{"text_format":"1","workbook":"xlsx","n_sheets":10,"sheets":["Title","Lookup","Labor Roles","Rates","Escalation","Calc","Calc_Raw","Config","Config_RawLabor","Config_Education"],"not_rendered":{"charts":0,"images":2,"macros":1,"external_links":0,"defined_names":1,"comments":0,"pivot_tables":0},"unopened":[],"bounds":{"document_bytes":16777216,"sheet_cells":100000,"rows_first":2000,"rows_last":500,"rows_between":2000,"halvings":0,"cell_chars":16384,"cell_head_chars":4096},"cells_cut":0,"cells_raw":0,"read":"whole","date_system":"1900"}

{"sheet":"Title","index":0,"n_rows":7,"n_cols":3,"rows_kept":7,"cut":false,"hidden":false,"merged":[]}
[]
[null,null,"Developed for the CPUC by:"]
[null,null,"Level 4 Ventures, Inc."]
[]
[null,null,"For support or questions:"]
[null,null,"william@level4ventures.com"]
[null,null,"(619) 917-4917"]

{"sheet":"Lookup","index":1,"n_rows":11,"n_cols":6,"rows_kept":11,"cut":false,"hidden":false,"merged":[[5,0,5,1],[10,1,10,5],[2,2,2,5],[3,2,3,5]]}
["Category:","Legal",null,"Low","Median","High"]
["Role:","Attorney ","Rate:",{"$f":"Config!B22","v":174.96888923000003},{"$f":"Config!B23","v":233.38888923000005},{"$f":"Config!B24","v":299.46888923000006}]
["Level:","I","Effective Period"]
["Education:",{"$f":"Config!B20","v":"JD, MD, PhD or Equivalent"},"1/1/2021 thru 12/31/2021"]
["Experience:",{"$f":"Config!B18","v":"0-1 years"}]
["Educational Eqivalency"]
["Ph.D.","Master's plus 4 years"]
["Master's","Bachelor's plus 4 years"]
["Bachelor's","Association plus 4 years or"]
[null,"High School plus 6 years"]
["Description:",{"$f":"Config!B21","v":"Attorney authorized by the California Bar to practice law in California. Higher experience levels should have experience with areas of law and procedures relevant to CPUC matters, such as environmental law or utility regulation."}]

{"sheet":"Labor Roles","index":2,"n_rows":78,"n_cols":8,"rows_kept":78,"cut":false,"hidden":false,"merged":[]}
["Category","Role","Description","Education I","Education II","Education III","Education IV","Education V"]
[{"$f":"Config_RawLabor!A2","v":"Advocate"},{"$f":"Config_RawLabor!B2","v":"Administrative Analyst"},{"$f":"Config_RawLabor!C2","v":"Assist in the planning, development and management of a comprehensive  program within the eight county service area. Assist in the administration and development of specific programs and projects. Specific areas of focus include human resources, information systems, or grant writing. Represent orgination to community groups, partners, and funders. Coordinate community events, public relations activities. "},{"$f":"VLOOKUP($B2,Config_Education!$A:$F,2,0)","v":"Bachelor's"},{"$f":"VLOOKUP($B2,Config_Education!$A:$F,3,0)","v":"Bachelor's"},{"$f":"VLOOKUP($B2,Config_Education!$A:$F,4,0)","v":"Bachelor's"},{"$f":"VLOOKUP($B2,Config_Education!$A:$F,5,0)","v":"Bachelor's"},{"$f":"VLOOKUP($B2,Config_Education!$A:$F,6,0)","v":"Bachelor's"}]
[{"$f":"Config_RawLabor!A3","v":"Advocate"},{"$f":"Config_RawLabor!B3","v":"Advocate - Not Otherwise Classified"},{"$f":"Config_RawLabor!C3","v":"Used for advocate roles that are not better classified as one of the more detailed roles, including for example consumer advocates. May also be used for advocates that fill multiple subroles."},{"$f":"VLOOKUP($B3,Config_Education!$A:$F,2,0)","v":"Bachelor's"},{"$f":"VLOOKUP($B3,Config_Education!$A:$F,3,0)","v":"Bachelor's"},{"$f":"VLOOKUP($B3,Config_Education!$A:$F,4,0)","v":"Bachelor's"},{"$f":"VLOOKUP($B3,Config_Education!$A:$F,5,0)","v":"Bachelor's"},{"$f":"VLOOKUP($B3,Config_Education!$A:$F,6,0)","v":"Bachelor's"}]
[{"$f":"Config_RawLabor!A4","v":"Advocate"},{"$f":"Config_RawLabor!B4","v":"Community Development Manager"},{"$f":"Config_RawLabor!C4","v":"Responsible for the supervision, support, and training of staff within a specific program, and for providing operational and program support to the program director. Meets program and organizational goals. Model and support organization's values."},{"$f":"VLOOKUP($B4,Config_Education!$A:$F,2,0)","v":"Bachelor's Degree"},{"$f":"VLOOKUP($B4,Config_Education!$A:$F,3,0)","v":"Bachelor's Degree"},{"$f":"VLOOKUP($B4,Config_Education!$A:$F,4,0)","v":"Bachelor's Degree"},{"$f":"VLOOKUP($B4,Config_Education!$A:$F,5,0)","v":"Bachelor's Degree"},{"$f":"VLOOKUP($B4,Config_Education!$A:$F,6,0)","v":"Bachelor's Degree"}]
[{"$f":"Config_RawLabor!A5","v":"Advocate"},{"$f":"Config_RawLabor!B5","v":"Community Development Program Director"},{"$f":"Config_RawLabor!C5","v":"A senior management position which provides leadership and management to one or more programs and participates in the overall management of (non-profit) organization. Coordinate, plan and develop comprehensive programs for implementing the organization's goals. On-going in-depth review and analysis of program operations, community needs and program resources. Represents the organization to community, agencies, the media, and participants. "},{"$f":"VLOOKUP($B5,Config_Education!$A:$F,2,0)","v":"Bachelor's"},{"$f":"VLOOKUP($B5,Config_Education!$A:$F,3,0)","v":"Bachelor's"},{"$f":"VLOOKUP($B5,Config_Education!$A:$F,4,0)","v":"Bachelor's"},{"$f":"VLOOKUP($B5,Config_Education!$A:$F,5,0)","v":"Bachelor's"},{"$f":"VLOOKUP($B5,Config_Education!$A:$F,6,0)","v":"Bachelor's"}]
[{"$f":"Config_RawLabor!A6","v":"Advocate"},{"$f":"Config_RawLabor!B6","v":"Community Development Senior Specialist"},{"$f":"Config_RawLabor!C6","v":"Work closely with low-income, rural residents to assist them in the development and management of community facilities. Perform advocacy and technical assistance role regarding the needs of rural, low income people for safe and affordable water, waste water and energyfacilities. Responsible for multiple community development projects. Can include organizing, research, loan and grant writing. In addition, the SR CD Specialist provides leadership and support to CD staff, serves as a resource for other staff and effectively and positively represents the organization to staff, participants and the community "},{"$f":"VLOOKUP($B6,Config_Education!$A:$F,2,0)","v":"Bachelor's"},{"$f":"VLOOKUP($B6,Config_Education!$A:$F,3,0)","v":"Bachelor's"},{"$f":"VLOOKUP($B6,Config_Education!$A:$F,4,0)","v":"Bachelor's"},{"$f":"VLOOKUP($B6,Config_Education!$A:$F,5,0)","v":"Bachelor's"},{"$f":"VLOOKUP($B6,Config_Education!$A:$F,6,0)","v":"Bachelor's"}]
[{"$f":"Config_RawLabor!A7","v":"Advocate"},{"$f":"Config_RawLabor!B7","v":"Community Development Specialist"},{"$f":"Config_RawLabor!C7","v":"Work closely with low-income, rural residents to assist them in the development and management of community facilities. Perform advocacy and technical assistance role regarding the needs of rural, low income people for safe and affordable water,waste water and energy facilities. Responsible for multiple community development projects. Can include organizing, research, loan and grant writing. "},{"$f":"VLOOKUP($B7,Config_Education!$A:$F,2,0)","v":"Bachelor's Degree"},{"$f":"VLOOKUP($B7,Config_Education!$A:$F,3,0)","v":"Bachelor's Degree"},{"$f":"VLOOKUP($B7,Config_Education!$A:$F,4,0)","v":"Bachelor's Degree"},{"$f":"VLOOKUP($B7,Config_Education!$A:$F,5,0)","v":"Bachelor's Degree"},{"$f":"VLOOKUP($B7,Config_Education!$A:$F,6,0)","v":"Bachelor's Degree"}]
[{"$f":"Config_RawLabor!A8","v":"Advocate"},{"$f":"Config_RawLabor!B8","v":"Executive Director"},{"$f":"Config_RawLabor!C8","v":"Provides overall direction and guidance to a non-profit organization's programs. Responsible for the success of special events, community outreach initiatives, and fundraising activities. Acts as a spokesperson and represents the organization's programs to the public. Assesses needs and ensures that program objectives are met, initiates changes to maintain member satisfaction and engagement. "},{"$f":"VLOOKUP($B8,Config_Education!$A:$F,2,0)","v":"Bachelor's"},{"$f":"VLOOKUP($B8,Config_Education!$A:$F,3,0)","v":"Bachelor's"},{"$f":"VLOOKUP($B8,Config_Education!$A:$F,4,0)","v":"Bachelor's"},{"$f":"VLOOKUP($B8,Config_Education!$A:$F,5,0)","v":"Bachelor's"},{"$f":"VLOOKUP($B8,Config_Education!$A:$F,6,0)","v":"Bachelor's"}]
[{"$f":"Config_RawLabor!A9","v":"Advocate"},{"$f":"Config_RawLabor!B9","v":"Housing Program Manager"},{"$f":"Config_RawLabor!C9","v":"Oversees operations of a housing program. Sets budget and policies, hires and trains staff, and oversees occupancy eligibility/operations. Develops and provides reports or documentation needed to secure/maintain funding or grants. May lead the work of others. "},{"$f":"VLOOKUP($B9,Config_Education!$A:$F,2,0)","v":"Bachelor's Degree"},{"$f":"VLOOKUP($B9,Config_Education!$A:$F,3,0)","v":"Bachelor's Degree"},{"$f":"VLOOKUP($B9,Config_Education!$A:$F,4,0)","v":"Bachelor's Degree"},{"$f":"VLOOKUP($B9,Config_Education!$A:$F,5,0)","v":"Bachelor's Degree"},{"$f":"VLOOKUP($B9,Config_Education!$A:$F,6,0)","v":"Bachelor's Degree"}]
[{"$f":"Config_RawLabor!A10","v":"Advocate"},{"$f":"Config_RawLabor!B10","v":"Program Coordinator"},{"$f":"Config_RawLabor!C10","v":"Plans and coordinates one or more programs for a non-profit organization, including fundraising, budgeting, and community outreach. Develops and implements programs that align with the organization's mission and support the organization's goals. Creates program materials, establishes staffing requirements, and ensures that program achieves stated objectives. May be responsible for special events that publicize the organization and its programs to the community. "},{"$f":"VLOOKUP($B10,Config_Education!$A:$F,2,0)","v":"Bachelor's"},{"$f":"VLOOKUP($B10,Config_Education!$A:$F,3,0)","v":"Bachelor's"},{"$f":"VLOOKUP($B10,Config_Education!$A:$F,4,0)","v":"Bachelor's"},{"$f":"VLOOKUP($B10,Config_Education!$A:$F,5,0)","v":"Bachelor's"},{"$f":"VLOOKUP($B10,Config_Education!$A:$F,6,0)","v":"Bachelor's"}]
[{"$f":"Config_RawLabor!A11","v":"Advocate"},{"$f":"Config_RawLabor!B11","v":"Program Manager"},{"$f":"Config_RawLabor!C11","v":"Manages a team that coordinates programs for a non-profit organization. Designs programs that align with the organization's mission and support the organization's goals. Establishes fundraising and development goals, identifies potential donors or sources of funding, and plans outreach strategies. Schedules and forecasts planning for special events that publicize the organization and its programs to the community. May assist in the development of grants applications or proposals. "},{"$f":"VLOOKUP($B11,Config_Education!$A:$F,2,0)","v":"Bachelor's"},{"$f":"VLOOKUP($B11,Config_Education!$A:$F,3,0)","v":"Bachelor's"},{"$f":"VLOOKUP($B11,Config_Education!$A:$F,4,0)","v":"Bachelor's"},{"$f":"VLOOKUP($B11,Config_Education!$A:$F,5,0)","v":"Bachelor's"},{"$f":"VLOOKUP($B11,Config_Education!$A:$F,6,0)","v":"Bachelor's"}]
[{"$f":"Config_RawLabor!A12","v":"Expert"},{"$f":"Config_RawLabor!B12","v":"Accountant"},{"$f":"Config_RawLabor!C12","v":"Prepares complex balance sheets, profit and loss statements and other financial reports. Analyzes current costs, revenues, financial commitments, and obligations incurred to predict future revenues and expenses. "},{"$f":"VLOOKUP($B12,Config_Education!$A:$F,2,0)","v":"Bachelor's Degree"},{"$f":"VLOOKUP($B12,Config_Education!$A:$F,3,0)","v":"Bachelor's Degree"},{"$f":"VLOOKUP($B12,Config_Education!$A:$F,4,0)","v":"Bachelor's Degree"},{"$f":"VLOOKUP($B12,Config_Education!$A:$F,5,0)","v":"Bachelor's Degree"},{"$f":"VLOOKUP($B12,Config_Education!$A:$F,6,0)","v":"Bachelor's Degree"}]
[{"$f":"Config_RawLabor!A13","v":"Expert"},{"$f":"Config_RawLabor!B13","v":"Biologist"},{"$f":"Config_RawLabor!C13","v":"Analyzes specific regional environments as well as the organisms and wildlife that inhabit those locations. Aids in the protection and survival of wildlife within any given ecosystem, and assesses the impact of human activity on the environment."},{"$f":"VLOOKUP($B13,Config_Education!$A:$F,2,0)","v":"Bachelor's Degree"},{"$f":"VLOOKUP($B13,Config_Education!$A:$F,3,0)","v":"Master's Degree or MBA"},{"$f":"VLOOKUP($B13,Config_Education!$A:$F,4,0)","v":"Master's Degree or MBA"},{"$f":"VLOOKUP($B13,Config_Education!$A:$F,5,0)","v":"JD, MD, PhD or Equivalent"},{"$f":"VLOOKUP($B13,Config_Education!$A:$F,6,0)","v":"JD, MD, PhD or Equivalent"}]
[{"$f":"Config_RawLabor!A14","v":"Expert"},{"$f":"Config_RawLabor!B14","v":"Certified Depreciation Professional"},{"$f":"Config_RawLabor!C14","v":"Specialist in calculating depreciation."},{"$f":"VLOOKUP($B14,Config_Education!$A:$F,2,0)","v":"Bachelor's Degree"},{"$f":"VLOOKUP($B14,Config_Education!$A:$F,3,0)","v":"Bachelor's Degree"},{"$f":"VLOOKUP($B14,Config_Education!$A:$F,4,0)","v":"Bachelor's Degree"},{"$f":"VLOOKUP($B14,Config_Education!$A:$F,5,0)","v":"Bachelor's Degree"},{"$f":"VLOOKUP($B14,Config_Education!$A:$F,6,0)","v":"Bachelor's Degree"}]
[{"$f":"Config_RawLabor!A15","v":"Expert"},{"$f":"Config_RawLabor!B15","v":"Chemical Engineer"},{"$f":"Config_RawLabor!C15","v":"Analyzes processes for the transport and storage of chemicals, including gases. "},{"$f":"VLOOKUP($B15,Config_Education!$A:$F,2,0)","v":"Bachelor's Degree"},{"$f":"VLOOKUP($B15,Config_Education!$A:$F,3,0)","v":"Bachelor's Degree"},{"$f":"VLOOKUP($B15,Config_Education!$A:$F,4,0)","v":"Bachelor's Degree"},{"$f":"VLOOKUP($B15,Config_Education!$A:$F,5,0)","v":"Bachelor's Degree"},{"$f":"VLOOKUP($B15,Config_Education!$A:$F,6,0)","v":"Bachelor's Degree"}]
[{"$f":"Config_RawLabor!A16","v":"Expert"},{"$f":"Config_RawLabor!B16","v":"Civil Engineer"},{"$f":"Config_RawLabor!C16","v":"Analyzes construction projects such as channels, dams, and roads. Responsibilities also include estimating costs, personnel, material and schedule needs."},{"$f":"VLOOKUP($B16,Config_Education!$A:$F,2,0)","v":"Bachelor's Degree"},{"$f":"VLOOKUP($B16,Config_Education!$A:$F,3,0)","v":"Bachelor's Degree"},{"$f":"VLOOKUP($B16,Config_Education!$A:$F,4,0)","v":"Bachelor's Degree"},{"$f":"VLOOKUP($B16,Config_Education!$A:$F,5,0)","v":"Bachelor's Degree"},{"$f":"VLOOKUP($B16,Config_Education!$A:$F,6,0)","v":"Bachelor's Degree"}]
[{"$f":"Config_RawLabor!A17","v":"Expert"},{"$f":"Config_RawLabor!B17","v":"Climate Scientist"},{"$f":"Config_RawLabor!C17","v":"Analyze and interpret data obtained from meteorological stations, radar and satellite imagery, and computer models.\nAnalyze past climate conditions and use models to predict future climate trends.\nExpert on factors that affect climate and cause climate change. Provides information and advises policy-makers on environmental topics such as climate change and air quality. Uses impact models to illustrate how human or natural activities respond to climate, for example crop yields, wetland ecology, biodiversity, and human health. "},{"$f":"VLOOKUP($B17,Config_Education!$A:$F,2,0)","v":"Master's Degree or MBA"},{"$f":"VLOOKUP($B17,Config_Education!$A:$F,3,0)","v":"Master's Degree or MBA"},{"$f":"VLOOKUP($B17,Config_Education!$A:$F,4,0)","v":"Master's Degree or MBA"},{"$f":"VLOOKUP($B17,Config_Education!$A:$F,5,0)","v":"Master's Degree or MBA"},{"$f":"VLOOKUP($B17,Config_Education!$A:$F,6,0)","v":"Master's Degree or MBA"}]
[{"$f":"Config_RawLabor!A18","v":"Expert"},{"$f":"Config_RawLabor!B18","v":"Communication Specialist"},{"$f":"Config_RawLabor!C18","v":"Defines, designs and implements communications strategy and programs. Evaluates and assist in establishing standard operating procedures regarding communications. Reviews and edits communications submitted for organizational issues. Works closely with various business departments to ensure messages are delivered clearly and effectively."},{"$f":"VLOOKUP($B18,Config_Education!$A:$F,2,0)","v":"Bachelor's Degree"},{"$f":"VLOOKUP($B18,Config_Education!$A:$F,3,0)","v":"Bachelor's Degree"},{"$f":"VLOOKUP($B18,Config_Education!$A:$F,4,0)","v":"Bachelor's Degree"},{"$f":"VLOOKUP($B18,Config_Education!$A:$F,5,0)","v":"Master's Degree or MBA"},{"$f":"VLOOKUP($B18,Config_Education!$A:$F,6,0)","v":"Bachelor's Degree"}]
[{"$f":"Config_RawLabor!A19","v":"Expert"},{"$f":"Config_RawLabor!B19","v":"Cost Accountant"},{"$f":"Config_RawLabor!C19","v":"Reviews cost accounting procedures and methods. Responsible for the preparation and analysis of cost reports and costing audits. Examines and reviews unusual cost records and ensures cost data is allocated correctly. "},{"$f":"VLOOKUP($B19,Config_Education!$A:$F,2,0)","v":"Bachelor's Degree"},{"$f":"VLOOKUP($B19,Config_Education!$A:$F,3,0)","v":"Bachelor's Degree"},{"$f":"VLOOKUP($B19,Config_Education!$A:$F,4,0)","v":"Bachelor's Degree"},{"$f":"VLOOKUP($B19,Config_Education!$A:$F,5,0)","v":"Bachelor's Degree"},{"$f":"VLOOKUP($B19,Config_Education!$A:$F,6,0)","v":"Bachelor's Degree"}]
[{"$f":"Config_RawLabor!A20","v":"Expert"},{"$f":"Config_RawLabor!B20","v":"Cost Estimation Analyst"},{"$f":"Config_RawLabor!C20","v":"Reviews project cost estimates, expenditures, and forecasts. Prepares should cost estimates for comparison as part of cost reasonableness analysis. Requires technical knowledge of the construction work involved, and the ability to use cost-estimating methods."},{"$f":"VLOOKUP($B20,Config_Education!$A:$F,2,0)","v":"Bachelor's"},{"$f":"VLOOKUP($B20,Config_Education!$A:$F,3,0)","v":"Bachelor's"},{"$f":"VLOOKUP($B20,Config_Education!$A:$F,4,0)","v":"Bachelor's"},{"$f":"VLOOKUP($B20,Config_Education!$A:$F,5,0)","v":"Bachelor's"},{"$f":"VLOOKUP($B20,Config_Education!$A:$F,6,0)","v":"Bachelor's"}]
[{"$f":"Config_RawLabor!A21","v":"Expert"},{"$f":"Config_RawLabor!B21","v":"Design Engineer"},{"$f":"Config_RawLabor!C21","v":"Evaluates products, parts, or processes for cost efficiency and reliability and to estimate project completion status. "},{"$f":"VLOOKUP($B21,Config_Education!$A:$F,2,0)","v":"Bachelor's Degree"},{"$f":"VLOOKUP($B21,Config_Education!$A:$F,3,0)","v":"Bachelor's Degree"},{"$f":"VLOOKUP($B21,Config_Education!$A:$F,4,0)","v":"Bachelor's Degree"},{"$f":"VLOOKUP($B21,Config_Education!$A:$F,5,0)","v":"Bachelor's Degree"},{"$f":"VLOOKUP($B21,Config_Education!$A:$F,6,0)","v":"Bachelor's Degree"}]
[{"$f":"Config_RawLabor!A22","v":"Expert"},{"$f":"Config_RawLabor!B22","v":"Drilling Engineer "},{"$f":"Config_RawLabor!C22","v":"Provides expert judgment for the design and implementation of oil and gas wells. Resolves highly complex technical issues and conducts advanced research into emerging technology in the field. Recommends alterations to development and design to improve safety, costs, and efficiency. "},{"$f":"VLOOKUP($B22,Config_Education!$A:$F,2,0)","v":"Bachelor's Degree"},{"$f":"VLOOKUP($B22,Config_Education!$A:$F,3,0)","v":"Bachelor's Degree"},{"$f":"VLOOKUP($B22,Config_Education!$A:$F,4,0)","v":"Bachelor's Degree"},{"$f":"VLOOKUP($B22,Config_Education!$A:$F,5,0)","v":"Bachelor's Degree"},{"$f":"VLOOKUP($B22,Config_Education!$A:$F,6,0)","v":"Master's Degree or MBA"}]
[{"$f":"Config_RawLabor!A23","v":"Expert"},{"$f":"Config_RawLabor!B23","v":"Ecologist"},{"$f":"Config_RawLabor!C23","v":"Investigates the factors at play in a disturbed ecosystem, anticipates potential effects of proposed actions, and recommends sustainable practices. Work may include fieldwork to collect and analyze data on environmental conditions, or to assess or certify a habitat. May plan or review habitat management or environmental restoration projects, including procedures, resources, schedules, and budgets."},{"$f":"VLOOKUP($B23,Config_Education!$A:$F,2,0)","v":"Bachelor's Degree"},{"$f":"VLOOKUP($B23,Config_Education!$A:$F,3,0)","v":"Master's Degree or MBA"},{"$f":"VLOOKUP($B23,Config_Education!$A:$F,4,0)","v":"Master's Degree or MBA"},{"$f":"VLOOKUP($B23,Config_Education!$A:$F,5,0)","v":"JD, MD, PhD or Equivalent"},{"$f":"VLOOKUP($B23,Config_Education!$A:$F,6,0)","v":"JD, MD, PhD or Equivalent"}]
[{"$f":"Config_RawLabor!A24","v":"Expert"},{"$f":"Config_RawLabor!B24","v":"Economist"},{"$f":"Config_RawLabor!C24","v":"Conducts research and analyses on economic data/trends and provides recommendations based on expertise. Researches and develops new data statistical models and technological innovations. Organizes data into report format and arranges graphic illustrations of research findings. Interprets and predicts economic conditions and advises management on implications. "},{"$f":"VLOOKUP($B24,Config_Education!$A:$F,2,0)","v":"Bachelor's Degree"},{"$f":"VLOOKUP($B24,Config_Education!$A:$F,3,0)","v":"Bachelor's Degree"},{"$f":"VLOOKUP($B24,Config_Education!$A:$F,4,0)","v":"Bachelor's Degree"},{"$f":"VLOOKUP($B24,Config_Education!$A:$F,5,0)","v":"Bachelor's Degree"},{"$f":"VLOOKUP($B24,Config_Education!$A:$F,6,0)","v":"Master's Degree or MBA"}]
[{"$f":"Config_RawLabor!A25","v":"Expert"},{"$f":"Config_RawLabor!B25","v":"Electrical Controls Engineer "},{"$f":"Config_RawLabor!C25","v":"Reviews design of electrical control systems, equipment, and machinery."},{"$f":"VLOOKUP($B25,Config_Education!$A:$F,2,0)","v":"Bachelor's"},{"$f":"VLOOKUP($B25,Config_Education!$A:$F,3,0)","v":"Bachelor's"},{"$f":"VLOOKUP($B25,Config_Education!$A:$F,4,0)","v":"Bachelor's"},{"$f":"VLOOKUP($B25,Config_Education!$A:$F,5,0)","v":"Bachelor's"},{"$f":"VLOOKUP($B25,Config_Education!$A:$F,6,0)","v":"Bachelor's Degree"}]
[{"$f":"Config_RawLabor!A26","v":"Expert"},{"$f":"Config_RawLabor!B26","v":"Electrical Engineer "},{"$f":"Config_RawLabor!C26","v":"Reviews electrical equipment, components, or systems. Applies mathematical and engineering principles and methods to analysis of electrical system designs. Studies new technologies and researches innovative solutions and product designs to make alternate recommendations."},{"$f":"VLOOKUP($B26,Config_Education!$A:$F,2,0)","v":"Bachelor's Degree"},{"$f":"VLOOKUP($B26,Config_Education!$A:$F,3,0)","v":"Bachelor's Degree"},{"$f":"VLOOKUP($B26,Config_Education!$A:$F,4,0)","v":"Bachelor's Degree"},{"$f":"VLOOKUP($B26,Config_Education!$A:$F,5,0)","v":"Bachelor's Degree"},{"$f":"VLOOKUP($B26,Config_Education!$A:$F,6,0)","v":"Bachelor's Degree"}]
[{"$f":"Config_RawLabor!A27","v":"Expert"},{"$f":"Config_RawLabor!B27","v":"Energy & Resources Expert"},{"$f":"Config_RawLabor!C27","v":"Offers broad, cross discipline expertise in analytic, methodological, theoretical, and practical approaches to problems in energy, resources, and the environment."},{"$f":"VLOOKUP($B27,Config_Education!$A:$F,2,0)","v":"Bachelor's"},{"$f":"VLOOKUP($B27,Config_Education!$A:$F,3,0)","v":"Bachelor's"},{"$f":"VLOOKUP($B27,Config_Education!$A:$F,4,0)","v":"Bachelor's"},{"$f":"VLOOKUP($B27,Config_Education!$A:$F,5,0)","v":"Bachelor's"},{"$f":"VLOOKUP($B27,Config_Education!$A:$F,6,0)","v":"Bachelor's"}]
[{"$f":"Config_RawLabor!A28","v":"Expert"},{"$f":"Config_RawLabor!B28","v":"Engineer "},{"$f":"Config_RawLabor!C28","v":"Provides expert consultation in one or more areas of engineering. Reviews highly complex technical issues and recommends alterations to development and design to improve quality of products and/or procedures. Has extensive engineering knowledge and is considered an expert in one or more engineering specialties. "},{"$f":"VLOOKUP($B28,Config_Education!$A:$F,2,0)","v":"Bachelor's Degree"},{"$f":"VLOOKUP($B28,Config_Education!$A:$F,3,0)","v":"Bachelor's Degree"},{"$f":"VLOOKUP($B28,Config_Education!$A:$F,4,0)","v":" Master's Degree or MBA"},{"$f":"VLOOKUP($B28,Config_Education!$A:$F,5,0)","v":"Bachelor's Degree"},{"$f":"VLOOKUP($B28,Config_Education!$A:$F,6,0)","v":"Master's Degree or MBA"}]
[{"$f":"Config_RawLabor!A29","v":"Expert"},{"$f":"Config_RawLabor!B29","v":"Env., Health, and Safety Engineer "},{"$f":"Config_RawLabor!C29","v":"Provides review and expert recommendations with respect to local, state and federal environmental, health and safety regulations. May review the design of facilities, work areas and work procedures from an environmental, health and safety perspective. Reviews environmental policy and procedures. Ensures compliance with all environmental, health and safety regulations. "},{"$f":"VLOOKUP($B29,Config_Education!$A:$F,2,0)","v":"Bachelor's Degree"},{"$f":"VLOOKUP($B29,Config_Education!$A:$F,3,0)","v":"Bachelor's Degree"},{"$f":"VLOOKUP($B29,Config_Education!$A:$F,4,0)","v":"Bachelor's Degree"},{"$f":"VLOOKUP($B29,Config_Education!$A:$F,5,0)","v":"Master's Degree or MBA"},{"$f":"VLOOKUP($B29,Config_Education!$A:$F,6,0)","v":"Bachelor's Degree"}]
[{"$f":"Config_RawLabor!A30","v":"Expert"},{"$f":"Config_RawLabor!B30","v":"Environmental Engineer "},{"$f":"Config_RawLabor!C30","v":"Identifies, assesses and resolves problems concerning the environment. May review measuring approaches, equipment and results in areas such as pollutants involving air, land, and water. Provides reports findings on environmental consequences of equipment, tools, and procedures. Reviews conformance to federal, state, and local environmental legislation."},{"$f":"VLOOKUP($B30,Config_Education!$A:$F,2,0)","v":"Master's Degree or MBA"},{"$f":"VLOOKUP($B30,Config_Education!$A:$F,3,0)","v":"Master's Degree or MBA"},{"$f":"VLOOKUP($B30,Config_Education!$A:$F,4,0)","v":"Master's Degree or MBA"},{"$f":"VLOOKUP($B30,Config_Education!$A:$F,5,0)","v":"Master's Degree or MBA"},{"$f":"VLOOKUP($B30,Config_Education!$A:$F,6,0)","v":"Master's Degree or MBA"}]
[{"$f":"Config_RawLabor!A31","v":"Expert"},{"$f":"Config_RawLabor!B31","v":"Equipment Engineer "},{"$f":"Config_RawLabor!C31","v":"Provides expert consultation with respect to technical products and equipment. Recognized as technical leader and resource. Recommends alterations and enhancements to improve quality of products and/or procedures. "},{"$f":"VLOOKUP($B31,Config_Education!$A:$F,2,0)","v":"Bachelor's Degree"},{"$f":"VLOOKUP($B31,Config_Education!$A:$F,3,0)","v":"Bachelor's Degree"},{"$f":"VLOOKUP($B31,Config_Education!$A:$F,4,0)","v":"Bachelor's Degree"},{"$f":"VLOOKUP($B31,Config_Education!$A:$F,5,0)","v":"Bachelor's Degree"},{"$f":"VLOOKUP($B31,Config_Education!$A:$F,6,0)","v":"Bachelor's Degree"}]
[{"$f":"Config_RawLabor!A32","v":"Expert"},{"$f":"Config_RawLabor!B32","v":"Expert - Not Otherwise Classified"},{"$f":"Config_RawLabor!C32","v":"Used for export roles that are not better classified as one of the more detailed roles. May also be used for experts that fill multiple subroles."},{"$f":"VLOOKUP($B32,Config_Education!$A:$F,2,0)","v":"Bachelor's Degree"},{"$f":"VLOOKUP($B32,Config_Education!$A:$F,3,0)","v":"Bachelor's Degree"},{"$f":"VLOOKUP($B32,Config_Education!$A:$F,4,0)","v":"Bachelor's Degree"},{"$f":"VLOOKUP($B32,Config_Education!$A:$F,5,0)","v":"Bachelor's Degree"},{"$f":"VLOOKUP($B32,Config_Education!$A:$F,6,0)","v":"Bachelor's Degree"}]
[{"$f":"Config_RawLabor!A33","v":"Expert"},{"$f":"Config_RawLabor!B33","v":"Expert - Social Work"},{"$f":"Config_RawLabor!C33","v":"Provides expertise in the discipline area of social work.  Familiar with current literature and research in the selected field."},{"$f":"VLOOKUP($B33,Config_Education!$A:$F,2,0)","v":"Master's Degree or MBA"},{"$f":"VLOOKUP($B33,Config_Education!$A:$F,3,0)","v":"Master's Degree or MBA"},{"$f":"VLOOKUP($B33,Config_Education!$A:$F,4,0)","v":"Master's Degree or MBA"},{"$f":"VLOOKUP($B33,Config_Education!$A:$F,5,0)","v":"Master's Degree or MBA"},{"$f":"VLOOKUP($B33,Config_Education!$A:$F,6,0)","v":"Master's Degree or MBA"}]
[{"$f":"Config_RawLabor!A34","v":"Expert"},{"$f":"Config_RawLabor!B34","v":"Field Service Engineer "},{"$f":"Config_RawLabor!C34","v":"Reviews installation and maintenance of products/equipment. Identifies, analyzes, makes recommendations regarding product failures, installation of new components or parts. Develops creative recommendations for more unique, chronic, or complex issues. Provides the intervenor team with explanations of product features and typical operation. Has extensive knowledge of an organization's products and services and is considered an expert."},{"$f":"VLOOKUP($B34,Config_Education!$A:$F,2,0)","v":"Bachelor's Degree"},{"$f":"VLOOKUP($B34,Config_Education!$A:$F,3,0)","v":"Bachelor's Degree"},{"$f":"VLOOKUP($B34,Config_Education!$A:$F,4,0)","v":"Bachelor's Degree"},{"$f":"VLOOKUP($B34,Config_Education!$A:$F,5,0)","v":"Bachelor's Degree"},{"$f":"VLOOKUP($B34,Config_Education!$A:$F,6,0)","v":"Bachelor's Degree"}]
[{"$f":"Config_RawLabor!A35","v":"Expert"},{"$f":"Config_RawLabor!B35","v":"Fire Fighter"},{"$f":"Config_RawLabor!C35","v":"Provides explanations of standard or expected fire fighting procedures under typical, potential, or observed scenarios."},{"$f":"VLOOKUP($B35,Config_Education!$A:$F,2,0)","v":"Bachelor's"},{"$f":"VLOOKUP($B35,Config_Education!$A:$F,3,0)","v":"Bachelor's"},{"$f":"VLOOKUP($B35,Config_Education!$A:$F,4,0)","v":"Bachelor's"},{"$f":"VLOOKUP($B35,Config_Education!$A:$F,5,0)","v":"Bachelor's"},{"$f":"VLOOKUP($B35,Config_Education!$A:$F,6,0)","v":"Bachelor's"}]
[{"$f":"Config_RawLabor!A36","v":"Expert"},{"$f":"Config_RawLabor!B36","v":"Fire Inspector Supervisor"},{"$f":"Config_RawLabor!C36","v":"Oversees the inspection of fire-damage to determine cause. Reviews preventive actions for appropriatness. Provides explanations of a variety of fire laws, regulations, and policies, including identifying those that are appropriate for a given situation. Assesses compliance with laws, regulations, and policies. "},{"$f":"VLOOKUP($B36,Config_Education!$A:$F,2,0)","v":"Bachelor's"},{"$f":"VLOOKUP($B36,Config_Education!$A:$F,3,0)","v":"Bachelor's"},{"$f":"VLOOKUP($B36,Config_Education!$A:$F,4,0)","v":"Bachelor's"},{"$f":"VLOOKUP($B36,Config_Education!$A:$F,5,0)","v":"Bachelor's"},{"$f":"VLOOKUP($B36,Config_Education!$A:$F,6,0)","v":"Bachelor's"}]
[{"$f":"Config_RawLabor!A37","v":"Expert"},{"$f":"Config_RawLabor!B37","v":"Fire Prevention Engineer"},{"$f":"Config_RawLabor!C37","v":"Examines buildings and equipment to determine compliance with fire prevention best practices. Ensures fire compliance codes are being adhered to. "},{"$f":"VLOOKUP($B37,Config_Education!$A:$F,2,0)","v":"Bachelor's"},{"$f":"VLOOKUP($B37,Config_Education!$A:$F,3,0)","v":"Bachelor's"},{"$f":"VLOOKUP($B37,Config_Education!$A:$F,4,0)","v":"Bachelor's"},{"$f":"VLOOKUP($B37,Config_Education!$A:$F,5,0)","v":"Bachelor's"},{"$f":"VLOOKUP($B37,Config_Education!$A:$F,6,0)","v":"Bachelor's"}]
[{"$f":"Config_RawLabor!A38","v":"Expert"},{"$f":"Config_RawLabor!B38","v":"Geologist"},{"$f":"Config_RawLabor!C38","v":"Expert on the formation, dissolution, and content of rock layers, along with the effects of internal pressures, heat, water, pollution, and erosion. "},{"$f":"VLOOKUP($B38,Config_Education!$A:$F,2,0)","v":"Bachelor's Degree"},{"$f":"VLOOKUP($B38,Config_Education!$A:$F,3,0)","v":"Bachelor's Degree"},{"$f":"VLOOKUP($B38,Config_Education!$A:$F,4,0)","v":"Master's Degree or MBA"},{"$f":"VLOOKUP($B38,Config_Education!$A:$F,5,0)","v":"Master's Degree or MBA"},{"$f":"VLOOKUP($B38,Config_Education!$A:$F,6,0)","v":"Master's Degree or MBA"}]
[{"$f":"Config_RawLabor!A39","v":"Expert"},{"$f":"Config_RawLabor!B39","v":"Geotechnical Engineer"},{"$f":"Config_RawLabor!C39","v":"Prepares and inspects projects involving drilling and exploration. Responsible for reviewing geological maps, site characterization, numerical modeling and analysis of excavations/supports. "},{"$f":"VLOOKUP($B39,Config_Education!$A:$F,2,0)","v":"Master's Degree or MBA"},{"$f":"VLOOKUP($B39,Config_Education!$A:$F,3,0)","v":"Master's Degree or MBA"},{"$f":"VLOOKUP($B39,Config_Education!$A:$F,4,0)","v":"Master's Degree or MBA"},{"$f":"VLOOKUP($B39,Config_Education!$A:$F,5,0)","v":"Master's Degree or MBA"},{"$f":"VLOOKUP($B39,Config_Education!$A:$F,6,0)","v":"Master's Degree or MBA"}]
[{"$f":"Config_RawLabor!A40","v":"Expert"},{"$f":"Config_RawLabor!B40","v":"Hardware Engineer "},{"$f":"Config_RawLabor!C40","v":"Reviews design, development, and implementation of hardware for products. Reviews test strategies and implementation, devices, and systems. Reviews stress and performance test results for a variety of computer hardware including circuit boards, processors and wiring. "},{"$f":"VLOOKUP($B40,Config_Education!$A:$F,2,0)","v":"Bachelor's Degree"},{"$f":"VLOOKUP($B40,Config_Education!$A:$F,3,0)","v":"Master's Degree or MBA"},{"$f":"VLOOKUP($B40,Config_Education!$A:$F,4,0)","v":"Master's Degree or MBA"},{"$f":"VLOOKUP($B40,Config_Education!$A:$F,5,0)","v":"Master's Degree or MBA"},{"$f":"VLOOKUP($B40,Config_Education!$A:$F,6,0)","v":"Master's Degree or MBA"}]
[{"$f":"Config_RawLabor!A41","v":"Expert"},{"$f":"Config_RawLabor!B41","v":"Health Scientist"},{"$f":"Config_RawLabor!C41","v":"Reviews the potential impact of policies and planned projects on community health.  "},{"$f":"VLOOKUP($B41,Config_Education!$A:$F,2,0)","v":"Master's Degree or MBA"},{"$f":"VLOOKUP($B41,Config_Education!$A:$F,3,0)","v":"Master's Degree or MBA"},{"$f":"VLOOKUP($B41,Config_Education!$A:$F,4,0)","v":"Master's Degree or MBA"},{"$f":"VLOOKUP($B41,Config_Education!$A:$F,5,0)","v":"Master's Degree or MBA"},{"$f":"VLOOKUP($B41,Config_Education!$A:$F,6,0)","v":"Master's Degree or MBA"}]
[{"$f":"Config_RawLabor!A42","v":"Expert"},{"$f":"Config_RawLabor!B42","v":"Hydrologist"},{"$f":"Config_RawLabor!C42","v":"Measure the properties of bodies of water, such as volume and stream flow\nCollect water and soil samples to test for certain properties, such as the pH or pollution levels. Analyze data on the environmental impacts of pollution, erosion, drought, and other problems. Recommend ways to minimize the negative impacts of erosion, sedimentation, or pollution on the environment. Use computer models to forecast future water supplies, the spread of pollution, floods, and other events.\nEvaluate the feasibility of water-related projects, such as hydroelectric power plants, irrigation systems, and wastewater treatment facilities."},{"$f":"VLOOKUP($B42,Config_Education!$A:$F,2,0)","v":"Master's Degree or MBA"},{"$f":"VLOOKUP($B42,Config_Education!$A:$F,3,0)","v":"Master's Degree or MBA"},{"$f":"VLOOKUP($B42,Config_Education!$A:$F,4,0)","v":"Master's Degree or MBA"},{"$f":"VLOOKUP($B42,Config_Education!$A:$F,5,0)","v":"Master's Degree or MBA"},{"$f":"VLOOKUP($B42,Config_Education!$A:$F,6,0)","v":"Master's Degree or MBA"}]
[{"$f":"Config_RawLabor!A43","v":"Expert"},{"$f":"Config_RawLabor!B43","v":"IT Project Engineer "},{"$f":"Config_RawLabor!C43","v":"Reviews IT engineering projects for compliance with industry best practices. Performs engineering design evaluations and reviews project budget and schedule. Reviews information system policies and controls to ensure data accuracy, security, and regulatory compliance. Reviews reports of computer and peripheral equipment production, malfunction, and maintenance to determine problems."},{"$f":"VLOOKUP($B43,Config_Education!$A:$F,2,0)","v":"Bachelor's Degree"},{"$f":"VLOOKUP($B43,Config_Education!$A:$F,3,0)","v":"Bachelor's Degree"},{"$f":"VLOOKUP($B43,Config_Education!$A:$F,4,0)","v":"Bachelor's Degree"},{"$f":"VLOOKUP($B43,Config_Education!$A:$F,5,0)","v":"Bachelor's Degree"},{"$f":"VLOOKUP($B43,Config_Education!$A:$F,6,0)","v":"Bachelor's Degree"}]
[{"$f":"Config_RawLabor!A44","v":"Expert"},{"$f":"Config_RawLabor!B44","v":"Mechanical Engineer "},{"$f":"Config_RawLabor!C44","v":"Reviews all aspects of mechanical components, equipment, and machinery design, installation, and testing. Applies knowledge of engineering principles to review products such as engines, instruments, controls, robots, machines, etc. Reviews product testing, models and prototypes. May review fabrication, operation, application, installation, and/or repair of mechanical products."},{"$f":"VLOOKUP($B44,Config_Education!$A:$F,2,0)","v":"Bachelor's Degree"},{"$f":"VLOOKUP($B44,Config_Education!$A:$F,3,0)","v":"Bachelor's Degree"},{"$f":"VLOOKUP($B44,Config_Education!$A:$F,4,0)","v":"Bachelor's Degree"},{"$f":"VLOOKUP($B44,Config_Education!$A:$F,5,0)","v":"Bachelor's Degree"},{"$f":"VLOOKUP($B44,Config_Education!$A:$F,6,0)","v":"Bachelor's Degree"}]
[{"$f":"Config_RawLabor!A45","v":"Expert"},{"$f":"Config_RawLabor!B45","v":"Network Engineer "},{"$f":"Config_RawLabor!C45","v":"Evaluates network systems and communications. May review issues such as network traffic, potential security risk, etc. Reviews network architecture design and optimization. Must have extensive knowledge of Internet, computer, routers, switches, firewall, etc. "},{"$f":"VLOOKUP($B45,Config_Education!$A:$F,2,0)","v":"Bachelor's Degree"},{"$f":"VLOOKUP($B45,Config_Education!$A:$F,3,0)","v":"Bachelor's Degree"},{"$f":"VLOOKUP($B45,Config_Education!$A:$F,4,0)","v":"Bachelor's Degree"},{"$f":"VLOOKUP($B45,Config_Education!$A:$F,5,0)","v":"Bachelor's Degree"},{"$f":"VLOOKUP($B45,Config_Education!$A:$F,6,0)","v":"Bachelor's Degree"}]
[{"$f":"Config_RawLabor!A46","v":"Expert"},{"$f":"Config_RawLabor!B46","v":"Nuclear Engineer "},{"$f":"Config_RawLabor!C46","v":"Reviews processes related to nuclear energy and radiation. Familiar with problems of nuclear energy systems. Reviews design of nuclear equipment. Reviews testing, operation, and maintenance of nuclear reactors. "},{"$f":"VLOOKUP($B46,Config_Education!$A:$F,2,0)","v":"Bachelor's Degree"},{"$f":"VLOOKUP($B46,Config_Education!$A:$F,3,0)","v":"Master's Degree or MBA"},{"$f":"VLOOKUP($B46,Config_Education!$A:$F,4,0)","v":"Master's Degree or MBA"},{"$f":"VLOOKUP($B46,Config_Education!$A:$F,5,0)","v":"Master's Degree or MBA"},{"$f":"VLOOKUP($B46,Config_Education!$A:$F,6,0)","v":"JD, MD, PhD or Equivalent"}]
[{"$f":"Config_RawLabor!A47","v":"Expert"},{"$f":"Config_RawLabor!B47","v":"Physicist"},{"$f":"Config_RawLabor!C47","v":"Provide reports regarding experimental physicists, force analysis, health physics, and high-energy physics. Provide expert witness testimony on issues regarding nuclear physics, optics, particle physics, quantum computing, quantum physics, radiation exposure, the science of matter and energy, shock physics, stress on materials, superconductivity, thermal exposure, and thermodynamics, as well as related topics."},{"$f":"VLOOKUP($B47,Config_Education!$A:$F,2,0)","v":"JD, MD, PhD or Equivalent"},{"$f":"VLOOKUP($B47,Config_Education!$A:$F,3,0)","v":"JD, MD, PhD or Equivalent"},{"$f":"VLOOKUP($B47,Config_Education!$A:$F,4,0)","v":"JD, MD, PhD or Equivalent"},{"$f":"VLOOKUP($B47,Config_Education!$A:$F,5,0)","v":"JD, MD, PhD or Equivalent"},{"$f":"VLOOKUP($B47,Config_Education!$A:$F,6,0)","v":"JD, MD, PhD or Equivalent"}]
[{"$f":"Config_RawLabor!A48","v":"Expert"},{"$f":"Config_RawLabor!B48","v":"Process Engineer "},{"$f":"Config_RawLabor!C48","v":"Reviews continuous production and manufacturing processes with respect to output, quality, and cost. Reviews production data and applies standard scientific and statistical methods to analyze, document, and diagram production processes. Identifies process bottlenecks and recommended solutions to resolve. Recommends changes or upgrades to equipment, work methods, or other aspects of the process to improve efficiency and utilization of resources including labor, energy and raw materials."},{"$f":"VLOOKUP($B48,Config_Education!$A:$F,2,0)","v":"Bachelor's Degree"},{"$f":"VLOOKUP($B48,Config_Education!$A:$F,3,0)","v":"Bachelor's Degree"},{"$f":"VLOOKUP($B48,Config_Education!$A:$F,4,0)","v":"Bachelor's Degree"},{"$f":"VLOOKUP($B48,Config_Education!$A:$F,5,0)","v":"Bachelor's Degree"},{"$f":"VLOOKUP($B48,Config_Education!$A:$F,6,0)","v":"Bachelor's Degree"}]
[{"$f":"Config_RawLabor!A49","v":"Expert"},{"$f":"Config_RawLabor!B49","v":"Professor - Law"},{"$f":"Config_RawLabor!C49","v":"Current or former law professor with knowledge of CPUC regulatory proceedings."},{"$f":"VLOOKUP($B49,Config_Education!$A:$F,2,0)","v":"JD, MD, PhD or Equivalent"},{"$f":"VLOOKUP($B49,Config_Education!$A:$F,3,0)","v":"JD, MD, PhD or Equivalent"},{"$f":"VLOOKUP($B49,Config_Education!$A:$F,4,0)","v":"JD, MD, PhD or Equivalent"},{"$f":"VLOOKUP($B49,Config_Education!$A:$F,5,0)","v":"JD, MD, PhD or Equivalent"},{"$f":"VLOOKUP($B49,Config_Education!$A:$F,6,0)","v":"JD, MD, PhD or Equivalent"}]
[{"$f":"Config_RawLabor!A50","v":"Expert"},{"$f":"Config_RawLabor!B50","v":"Program Design/Evaluation Specialist"},{"$f":"Config_RawLabor!C50","v":"Designs marketing strategies and programs for a utility product or product line. Evaluates utility product performance, and recommends changes to current products based on market research and new trends. "},{"$f":"VLOOKUP($B50,Config_Education!$A:$F,2,0)","v":"Bachelor's Degree"},{"$f":"VLOOKUP($B50,Config_Education!$A:$F,3,0)","v":"Bachelor's Degree"},{"$f":"VLOOKUP($B50,Config_Education!$A:$F,4,0)","v":"Master's Degree or MBA"},{"$f":"VLOOKUP($B50,Config_Education!$A:$F,5,0)","v":"Master's Degree or MBA"},{"$f":"VLOOKUP($B50,Config_Education!$A:$F,6,0)","v":"Master's Degree or MBA"}]
[{"$f":"Config_RawLabor!A51","v":"Expert"},{"$f":"Config_RawLabor!B51","v":"Project Engineer "},{"$f":"Config_RawLabor!C51","v":"Reviews engineering designs and implementation plans for reasonableness. Reviews industry policies and procedures to ensure data accuracy, security, and regulatory compliance. Reviews reports of production, malfunction, and maintenance to determine or address problems. Provides recommendations regarding engineering process. Coordinates with other engineering experts and coordinates their specialized contributions to the proceeding. Reviews and opins on operational plans for completing the project. Reviews progress and performance against the project plan and recommends actions to resolve operational problems and minimize delays. Develops alternate or comparative project schedules, budgets, and forecasts. "},{"$f":"VLOOKUP($B51,Config_Education!$A:$F,2,0)","v":"Bachelor's Degree"},{"$f":"VLOOKUP($B51,Config_Education!$A:$F,3,0)","v":"Bachelor's Degree"},{"$f":"VLOOKUP($B51,Config_Education!$A:$F,4,0)","v":"Bachelor's Degree"},{"$f":"VLOOKUP($B51,Config_Education!$A:$F,5,0)","v":"Master's Degree or MBA"},{"$f":"VLOOKUP($B51,Config_Education!$A:$F,6,0)","v":"Bachelor's Degree"}]
[{"$f":"Config_RawLabor!A52","v":"Expert"},{"$f":"Config_RawLabor!B52","v":"Project Engineer - Construction"},{"$f":"Config_RawLabor!C52","v":"Interviews construction staff. Reviews plans and other technical documents, answers questions regarding the scope and/or scheduling of the project. Develops cost estimates or appropriate schedules. "},{"$f":"VLOOKUP($B52,Config_Education!$A:$F,2,0)","v":"Bachelor's"},{"$f":"VLOOKUP($B52,Config_Education!$A:$F,3,0)","v":"Bachelor's"},{"$f":"VLOOKUP($B52,Config_Education!$A:$F,4,0)","v":"Bachelor's"},{"$f":"VLOOKUP($B52,Config_Education!$A:$F,5,0)","v":"Bachelor's"},{"$f":"VLOOKUP($B52,Config_Education!$A:$F,6,0)","v":"Bachelor's"}]
[{"$f":"Config_RawLabor!A53","v":"Expert"},{"$f":"Config_RawLabor!B53","v":"Public Policy Analyst"},{"$f":"Config_RawLabor!C53","v":"Reviews the impact of state government policies and regulations. Analyzes proposed legislative actions and determines the potential impact. Reviews policies, plans, and programs to ensure consistency with corresponding government regulations and laws."},{"$f":"VLOOKUP($B53,Config_Education!$A:$F,2,0)","v":"Bachelor's Degree"},{"$f":"VLOOKUP($B53,Config_Education!$A:$F,3,0)","v":"Bachelor's Degree"},{"$f":"VLOOKUP($B53,Config_Education!$A:$F,4,0)","v":"Bachelor's Degree"},{"$f":"VLOOKUP($B53,Config_Education!$A:$F,5,0)","v":"Master's Degree or MBA"},{"$f":"VLOOKUP($B53,Config_Education!$A:$F,6,0)","v":"Bachelor's Degree"}]
[{"$f":"Config_RawLabor!A54","v":"Expert"},{"$f":"Config_RawLabor!B54","v":"Regulatory Affairs Specialist"},{"$f":"Config_RawLabor!C54","v":"Familiar with regulatory forms, policies, and procedures and capable of reviewing regulatory compliance. "},{"$f":"VLOOKUP($B54,Config_Education!$A:$F,2,0)","v":"Bachelor's Degree"},{"$f":"VLOOKUP($B54,Config_Education!$A:$F,3,0)","v":"Master's Degree or MBA"},{"$f":"VLOOKUP($B54,Config_Education!$A:$F,4,0)","v":"Bachelor's Degree"},{"$f":"VLOOKUP($B54,Config_Education!$A:$F,5,0)","v":"Master's Degree or MBA"},{"$f":"VLOOKUP($B54,Config_Education!$A:$F,6,0)","v":"Master's Degree or MBA"}]
[{"$f":"Config_RawLabor!A55","v":"Expert"},{"$f":"Config_RawLabor!B55","v":"Reliability Engineer "},{"$f":"Config_RawLabor!C55","v":"Analyzes the reliability in design, cost, weight, production and consumer satisfaction of company products. Develops the methods and measures of analysis based on customer and contractual obligations. Prepares reports, charts and diagrams to disclose results and highlight areas for further investigation. Performs root cause analysis to determine product design flaws"},{"$f":"VLOOKUP($B55,Config_Education!$A:$F,2,0)","v":"Bachelor's Degree"},{"$f":"VLOOKUP($B55,Config_Education!$A:$F,3,0)","v":"Bachelor's Degree"},{"$f":"VLOOKUP($B55,Config_Education!$A:$F,4,0)","v":"Master's Degree or MBA"},{"$f":"VLOOKUP($B55,Config_Education!$A:$F,5,0)","v":"Master's Degree or MBA"},{"$f":"VLOOKUP($B55,Config_Education!$A:$F,6,0)","v":"Master's Degree or MBA"}]
[{"$f":"Config_RawLabor!A56","v":"Expert"},{"$f":"Config_RawLabor!B56","v":"Reservoir Engineer "},{"$f":"Config_RawLabor!C56","v":"Responsible for identifying oil and gas reserves and developing strategies to maximize recovery. Reviews testing results for  new wells and monitors and predicts performance."},{"$f":"VLOOKUP($B56,Config_Education!$A:$F,2,0)","v":"Bachelor's Degree"},{"$f":"VLOOKUP($B56,Config_Education!$A:$F,3,0)","v":"Master's Degree or MBA"},{"$f":"VLOOKUP($B56,Config_Education!$A:$F,4,0)","v":"Master's Degree or MBA"},{"$f":"VLOOKUP($B56,Config_Education!$A:$F,5,0)","v":"Master's Degree or MBA"},{"$f":"VLOOKUP($B56,Config_Education!$A:$F,6,0)","v":"Master's Degree or MBA"}]
[{"$f":"Config_RawLabor!A57","v":"Expert"},{"$f":"Config_RawLabor!B57","v":"Reservoir Engineering Manager"},{"$f":"Config_RawLabor!C57","v":"Reviews all aspects of engineering studies regarding the identification, evaluation, and development of oil and gas reserves within a region. Oversees the process of estimating, assessing, and planning oil and gas production and development projects. Ensures all projects, initiatives, and processes are in conformance with an organization's established policies and objectives"},{"$f":"VLOOKUP($B57,Config_Education!$A:$F,2,0)","v":"Master's Degree or MBA"},{"$f":"VLOOKUP($B57,Config_Education!$A:$F,3,0)","v":"Master's Degree or MBA"},{"$f":"VLOOKUP($B57,Config_Education!$A:$F,4,0)","v":"Master's Degree or MBA"},{"$f":"VLOOKUP($B57,Config_Education!$A:$F,5,0)","v":"Master's Degree or MBA"},{"$f":"VLOOKUP($B57,Config_Education!$A:$F,6,0)","v":"Master's Degree or MBA"}]
[{"$f":"Config_RawLabor!A58","v":"Expert"},{"$f":"Config_RawLabor!B58","v":"Sociologist"},{"$f":"Config_RawLabor!C58","v":"Provides expertise in the discipline area of sociology, including evaluating qualitative research methods in a proposed study..  Familiar with current literature and research in the selected field."},{"$f":"VLOOKUP($B58,Config_Education!$A:$F,2,0)","v":"JD, MD, PhD or Equivalent"},{"$f":"VLOOKUP($B58,Config_Education!$A:$F,3,0)","v":"JD, MD, PhD or Equivalent"},{"$f":"VLOOKUP($B58,Config_Education!$A:$F,4,0)","v":"JD, MD, PhD or Equivalent"},{"$f":"VLOOKUP($B58,Config_Education!$A:$F,5,0)","v":"JD, MD, PhD or Equivalent"},{"$f":"VLOOKUP($B58,Config_Education!$A:$F,6,0)","v":"JD, MD, PhD or Equivalent"}]
[{"$f":"Config_RawLabor!A59","v":"Expert"},{"$f":"Config_RawLabor!B59","v":"Software Engineer "},{"$f":"Config_RawLabor!C59","v":"Reviews the design and code of software applications. Reviews s coding, debugging, testing and troubleshooting procedures throughout the application development process. Provides consultation on software application components of complex projects. "},{"$f":"VLOOKUP($B59,Config_Education!$A:$F,2,0)","v":"Bachelor's Degree"},{"$f":"VLOOKUP($B59,Config_Education!$A:$F,3,0)","v":"Bachelor's Degree"},{"$f":"VLOOKUP($B59,Config_Education!$A:$F,4,0)","v":"Bachelor's Degree"},{"$f":"VLOOKUP($B59,Config_Education!$A:$F,5,0)","v":"Bachelor's Degree"},{"$f":"VLOOKUP($B59,Config_Education!$A:$F,6,0)","v":"Bachelor's Degree"}]
[{"$f":"Config_RawLabor!A60","v":"Expert"},{"$f":"Config_RawLabor!B60","v":"Statistician "},{"$f":"Config_RawLabor!C60","v":"Analyzes and interprets data from various sources. Compiles reports, charts, and tables based on established statistical methods."},{"$f":"VLOOKUP($B60,Config_Education!$A:$F,2,0)","v":"Master's Degree or MBA"},{"$f":"VLOOKUP($B60,Config_Education!$A:$F,3,0)","v":"Master's Degree or MBA"},{"$f":"VLOOKUP($B60,Config_Education!$A:$F,4,0)","v":"Master's Degree or MBA"},{"$f":"VLOOKUP($B60,Config_Education!$A:$F,5,0)","v":"JD, MD, PhD or Equivalent"},{"$f":"VLOOKUP($B60,Config_Education!$A:$F,6,0)","v":"JD, MD, PhD or Equivalent"}]
[{"$f":"Config_RawLabor!A61","v":"Expert"},{"$f":"Config_RawLabor!B61","v":"Structural Engineer "},{"$f":"Config_RawLabor!C61","v":"Reviews load-bearing structures or structural elements, such as buildings, bridges, or roadways. Performs analysis of building materials used in construction. Reviews  blueprints or specifications used during construction and ensures all projects comply with applicable codes and regulations. Determines cause of structural failures, damages, and defects through site investigations. Provides reports detailing investigations and assessment of damages to the structure."},{"$f":"VLOOKUP($B61,Config_Education!$A:$F,2,0)","v":"Master's Degree or MBA"},{"$f":"VLOOKUP($B61,Config_Education!$A:$F,3,0)","v":"Master's Degree or MBA"},{"$f":"VLOOKUP($B61,Config_Education!$A:$F,4,0)","v":"Master's Degree or MBA"},{"$f":"VLOOKUP($B61,Config_Education!$A:$F,5,0)","v":"Master's Degree or MBA"},{"$f":"VLOOKUP($B61,Config_Education!$A:$F,6,0)","v":"Master's Degree or MBA"}]
[{"$f":"Config_RawLabor!A62","v":"Expert"},{"$f":"Config_RawLabor!B62","v":"Systems Engineer "},{"$f":"Config_RawLabor!C62","v":"Reviews the plan and design of an organization's systems infrastructure. Ensures the accuracy and effectiveness of the system to meet business/customers' requirements. Monitors the performance of systems and suggests improvements. Verifies and reviews system related documents/reports including installation procedures. "},{"$f":"VLOOKUP($B62,Config_Education!$A:$F,2,0)","v":"Bachelor's Degree"},{"$f":"VLOOKUP($B62,Config_Education!$A:$F,3,0)","v":"Bachelor's Degree"},{"$f":"VLOOKUP($B62,Config_Education!$A:$F,4,0)","v":"Bachelor's Degree"},{"$f":"VLOOKUP($B62,Config_Education!$A:$F,5,0)","v":"Bachelor's Degree"},{"$f":"VLOOKUP($B62,Config_Education!$A:$F,6,0)","v":"Bachelor's Degree"}]
[{"$f":"Config_RawLabor!A63","v":"Expert"},{"$f":"Config_RawLabor!B63","v":"Telecommunications Economist"},{"$f":"Config_RawLabor!C63","v":"Reviews and analyzes telecommunication rating schedules and schedule tables. Reviews billing and compliance to ensure conformance to company and government standards. "},{"$f":"VLOOKUP($B63,Config_Education!$A:$F,2,0)","v":"Bachelor's Degree"},{"$f":"VLOOKUP($B63,Config_Education!$A:$F,3,0)","v":"Bachelor's Degree"},{"$f":"VLOOKUP($B63,Config_Education!$A:$F,4,0)","v":"Bachelor's Degree"},{"$f":"VLOOKUP($B63,Config_Education!$A:$F,5,0)","v":"Bachelor's Degree"},{"$f":"VLOOKUP($B63,Config_Education!$A:$F,6,0)","v":"Master's Degree or MBA"}]
[{"$f":"Config_RawLabor!A64","v":"Expert"},{"$f":"Config_RawLabor!B64","v":"Telecommunications Engineer "},{"$f":"Config_RawLabor!C64","v":"Reviews the design, implementation and maintenance of telecommunication networks, systems and equipment,. Analyzes existing networks and equipment and identifies opportunities for improvement. Recommends alternate solutions that better meet consumer requirements."},{"$f":"VLOOKUP($B64,Config_Education!$A:$F,2,0)","v":"Bachelor's Degree"},{"$f":"VLOOKUP($B64,Config_Education!$A:$F,3,0)","v":"Bachelor's Degree"},{"$f":"VLOOKUP($B64,Config_Education!$A:$F,4,0)","v":"Bachelor's Degree"},{"$f":"VLOOKUP($B64,Config_Education!$A:$F,5,0)","v":"Bachelor's Degree"},{"$f":"VLOOKUP($B64,Config_Education!$A:$F,6,0)","v":"Bachelor's Degree"}]
[{"$f":"Config_RawLabor!A65","v":"Expert"},{"$f":"Config_RawLabor!B65","v":"Top Economic Executive"},{"$f":"Config_RawLabor!C65","v":"Provides economic data, prepares interpretative reports, and provides leadership for the use of economic data and adaptation of economic models. Communicates the results of economic studies to the stakeholders and sets guidelines for proceeding economic strategies. Understands the macro and micro economic environment and its impact on the industry."},{"$f":"VLOOKUP($B65,Config_Education!$A:$F,2,0)","v":"JD, MD, PhD or Equivalent"},{"$f":"VLOOKUP($B65,Config_Education!$A:$F,3,0)","v":"JD, MD, PhD or Equivalent"},{"$f":"VLOOKUP($B65,Config_Education!$A:$F,4,0)","v":"JD, MD, PhD or Equivalent"},{"$f":"VLOOKUP($B65,Config_Education!$A:$F,5,0)","v":"JD, MD, PhD or Equivalent"},{"$f":"VLOOKUP($B65,Config_Education!$A:$F,6,0)","v":"JD, MD, PhD or Equivalent"}]
[{"$f":"Config_RawLabor!A66","v":"Expert"},{"$f":"Config_RawLabor!B66","v":"Urban Planner"},{"$f":"Config_RawLabor!C66","v":"Reviews  land-use plans for the beneficial development of urban areas."},{"$f":"VLOOKUP($B66,Config_Education!$A:$F,2,0)","v":"Bachelor's"},{"$f":"VLOOKUP($B66,Config_Education!$A:$F,3,0)","v":"Bachelor's"},{"$f":"VLOOKUP($B66,Config_Education!$A:$F,4,0)","v":"Bachelor's"},{"$f":"VLOOKUP($B66,Config_Education!$A:$F,5,0)","v":"Bachelor's"},{"$f":"VLOOKUP($B66,Config_Education!$A:$F,6,0)","v":"Bachelor's"}]
[{"$f":"Config_RawLabor!A67","v":"Expert"},{"$f":"Config_RawLabor!B67","v":"Utility Rate Analyst"},{"$f":"Config_RawLabor!C67","v":"Monitors, reviews, and evaluates service rates and charges for various public utilities. Calculates cost-of-service and performs related rate analysis. Ensures filings comply with the Federal Energy Regulatory Commission requirements."},{"$f":"VLOOKUP($B67,Config_Education!$A:$F,2,0)","v":"Bachelor's Degree"},{"$f":"VLOOKUP($B67,Config_Education!$A:$F,3,0)","v":"Bachelor's Degree"},{"$f":"VLOOKUP($B67,Config_Education!$A:$F,4,0)","v":"Bachelor's Degree"},{"$f":"VLOOKUP($B67,Config_Education!$A:$F,5,0)","v":"Bachelor's Degree"},{"$f":"VLOOKUP($B67,Config_Education!$A:$F,6,0)","v":"Bachelor's Degree"}]
[{"$f":"Config_RawLabor!A68","v":"Expert"},{"$f":"Config_RawLabor!B68","v":"Utility System Planner/Operator/Manager"},{"$f":"Config_RawLabor!C68","v":"Familiar with the proper operation of utility plant equipment including controls, operation, repairs, and perventive maintenance. Equipment may include bioenergy, hydro, nuclear, solar, thermal or wind generation or gas storage and transport."},{"$f":"VLOOKUP($B68,Config_Education!$A:$F,2,0)","v":"Bachelor's"},{"$f":"VLOOKUP($B68,Config_Education!$A:$F,3,0)","v":"Bachelor's"},{"$f":"VLOOKUP($B68,Config_Education!$A:$F,4,0)","v":"Bachelor's"},{"$f":"VLOOKUP($B68,Config_Education!$A:$F,5,0)","v":"Bachelor's"},{"$f":"VLOOKUP($B68,Config_Education!$A:$F,6,0)","v":"Bachelor's"}]
[{"$f":"Config_RawLabor!A69","v":"Expert"},{"$f":"Config_RawLabor!B69","v":"Wildfire Scientist"},{"$f":"Config_RawLabor!C69","v":"Uses analysis software to analyze wildfire risks and likely paths. Reviews approaches to preventing, controlling, or mitigating wildfire damage."},{"$f":"VLOOKUP($B69,Config_Education!$A:$F,2,0)","v":"Bachelor's"},{"$f":"VLOOKUP($B69,Config_Education!$A:$F,3,0)","v":"Bachelor's"},{"$f":"VLOOKUP($B69,Config_Education!$A:$F,4,0)","v":"Bachelor's"},{"$f":"VLOOKUP($B69,Config_Education!$A:$F,5,0)","v":"Bachelor's"},{"$f":"VLOOKUP($B69,Config_Education!$A:$F,6,0)","v":"Bachelor's"}]
[{"$f":"Config_RawLabor!A70","v":"Legal"},{"$f":"Config_RawLabor!B70","v":"Attorney "},{"$f":"Config_RawLabor!C70","v":"Attorney authorized by the California Bar to practice law in California. Higher experience levels should have experience with areas of law and procedures relevant to CPUC matters, such as environmental law or utility regulation."},{"$f":"VLOOKUP($B70,Config_Education!$A:$F,2,0)","v":"JD, MD, PhD or Equivalent"},{"$f":"VLOOKUP($B70,Config_Education!$A:$F,3,0)","v":"JD, MD, PhD or Equivalent"},{"$f":"VLOOKUP($B70,Config_Education!$A:$F,4,0)","v":"JD, MD, PhD or Equivalent"},{"$f":"VLOOKUP($B70,Config_Education!$A:$F,5,0)","v":"JD, MD, PhD or Equivalent"},{"$f":"VLOOKUP($B70,Config_Education!$A:$F,6,0)","v":"JD, MD, PhD or Equivalent"}]
[{"$f":"Config_RawLabor!A71","v":"Legal"},{"$f":"Config_RawLabor!B71","v":"Legal Director"},{"$f":"Config_RawLabor!C71","v":"Oversees the legal work of the organization, including providing strategic direction. Alternate title may be General Counsel. Responsible for coordinating and supervising a legal team. Participates in the most complex legal actions. Oversees all legal operations including case assignment, hiring, supervision and professional development of the legal staff, as well as budgeting."},{"$f":"VLOOKUP($B71,Config_Education!$A:$F,2,0)","v":"Bachelor's Degree"},{"$f":"VLOOKUP($B71,Config_Education!$A:$F,3,0)","v":"Bachelor's Degree"},{"$f":"VLOOKUP($B71,Config_Education!$A:$F,4,0)","v":"Bachelor's Degree"},{"$f":"VLOOKUP($B71,Config_Education!$A:$F,5,0)","v":"Bachelor's Degree"},{"$f":"VLOOKUP($B71,Config_Education!$A:$F,6,0)","v":"Bachelor's Degree"}]
[{"$f":"Config_RawLabor!A72","v":"Legal"},{"$f":"Config_RawLabor!B72","v":"Paralegal "},{"$f":"Config_RawLabor!C72","v":"Assists and supports attorneys with research. Researches and analyzes law sources such as statutes, recorded judicial decisions, legal articles, treaties, constitutions, and legal codes. Prepares legal documents. May direct the work of clerical or other support staff. May be responsible for the creation and administration of legal databases. Has complete understanding of technical legal terminology."},{"$f":"VLOOKUP($B72,Config_Education!$A:$F,2,0)","v":"Bachelor's Degree"},{"$f":"VLOOKUP($B72,Config_Education!$A:$F,3,0)","v":"Bachelor's Degree"},{"$f":"VLOOKUP($B72,Config_Education!$A:$F,4,0)","v":"Bachelor's Degree"},{"$f":"VLOOKUP($B72,Config_Education!$A:$F,5,0)","v":"Bachelor's Degree"},{"$f":"VLOOKUP($B72,Config_Education!$A:$F,6,0)","v":"Bachelor's Degree"}]
[{"$f":"Config_RawLabor!A73","v":"Legal"},{"$f":"Config_RawLabor!B73","v":"Paralegal Manager"},{"$f":"Config_RawLabor!C73","v":"Often the most senior Paralegal individual. Validates and oversees the preparation of legal documents. Provides research utilizing databases and legal libraries. Coordinates with attorneys on special requests or highly complex projects. Note that supervisory and training support is not reimbursable."},{"$f":"VLOOKUP($B73,Config_Education!$A:$F,2,0)","v":"Bachelor's Degree"},{"$f":"VLOOKUP($B73,Config_Education!$A:$F,3,0)","v":"Bachelor's Degree"},{"$f":"VLOOKUP($B73,Config_Education!$A:$F,4,0)","v":"Bachelor's Degree"},{"$f":"VLOOKUP($B73,Config_Education!$A:$F,5,0)","v":"Bachelor's Degree"},{"$f":"VLOOKUP($B73,Config_Education!$A:$F,6,0)","v":"Bachelor's Degree"}]
[{"$f":"Config_RawLabor!A74","v":"Legal"},{"$f":"Config_RawLabor!B74","v":"Paralegal Supervisor"},{"$f":"Config_RawLabor!C74","v":"Reviews prepared legal documents to ensure the work is complete and accurate. Prepares complex documents. Note that supervisory and training time is not reimbursable."},{"$f":"VLOOKUP($B74,Config_Education!$A:$F,2,0)","v":"Bachelor's Degree"},{"$f":"VLOOKUP($B74,Config_Education!$A:$F,3,0)","v":"Bachelor's Degree"},{"$f":"VLOOKUP($B74,Config_Education!$A:$F,4,0)","v":"Bachelor's Degree"},{"$f":"VLOOKUP($B74,Config_Education!$A:$F,5,0)","v":"Bachelor's Degree"},{"$f":"VLOOKUP($B74,Config_Education!$A:$F,6,0)","v":"Bachelor's Degree"}]
[{"$f":"Config_RawLabor!A75","v":"School"},{"$f":"Config_RawLabor!B75","v":"Assistant School Principal"},{"$f":"Config_RawLabor!C75","v":"Assists the school principal in the management of education and teaching programs for an assigned school. Coordinates school activities and ensures that budgetary guidelines are met. May help in developing the curriculum, staffing, reviewing faculty performance, and creating an atmosphere conducive to scholarly pursuits. "},{"$f":"VLOOKUP($B75,Config_Education!$A:$F,2,0)","v":"Master's Degree or MBA"},{"$f":"VLOOKUP($B75,Config_Education!$A:$F,3,0)","v":"Master's Degree or MBA"},{"$f":"VLOOKUP($B75,Config_Education!$A:$F,4,0)","v":"Master's Degree or MBA"},{"$f":"VLOOKUP($B75,Config_Education!$A:$F,5,0)","v":"Master's Degree or MBA"},{"$f":"VLOOKUP($B75,Config_Education!$A:$F,6,0)","v":"Master's Degree or MBA"}]
[{"$f":"Config_RawLabor!A76","v":"School"},{"$f":"Config_RawLabor!B76","v":"Public School Teacher"},{"$f":"Config_RawLabor!C76","v":"Prepares lesson plans and instructs students in an assigned school. Develops and implements grade appropriate course work to meet the academic of children in a K-12 classroom setting. Evaluates and monitors student's performance. Assesses and documents students' progress. Participates in development and implementation of Individual Education Plans for specific students. May participate in implementing special programs for students. May supervise teaching assistants. "},{"$f":"VLOOKUP($B76,Config_Education!$A:$F,2,0)","v":"Master's Degree or MBA"},{"$f":"VLOOKUP($B76,Config_Education!$A:$F,3,0)","v":"Master's Degree or MBA"},{"$f":"VLOOKUP($B76,Config_Education!$A:$F,4,0)","v":"Master's Degree or MBA"},{"$f":"VLOOKUP($B76,Config_Education!$A:$F,5,0)","v":"Master's Degree or MBA"},{"$f":"VLOOKUP($B76,Config_Education!$A:$F,6,0)","v":"Master's Degree or MBA"}]
[{"$f":"Config_RawLabor!A77","v":"School"},{"$f":"Config_RawLabor!B77","v":"School Principal"},{"$f":"Config_RawLabor!C77","v":"Directs and oversees education and teaching programs for an assigned school. Responsibilities include developing the curriculum, staffing departments, reviewing faculty performance, and creating an atmosphere conducive to scholarly pursuits. Ensures all school activities are within budgetary guidelines. "},{"$f":"VLOOKUP($B77,Config_Education!$A:$F,2,0)","v":"Master's Degree or MBA"},{"$f":"VLOOKUP($B77,Config_Education!$A:$F,3,0)","v":"Master's Degree or MBA"},{"$f":"VLOOKUP($B77,Config_Education!$A:$F,4,0)","v":"Master's Degree or MBA"},{"$f":"VLOOKUP($B77,Config_Education!$A:$F,5,0)","v":"Master's Degree or MBA"},{"$f":"VLOOKUP($B77,Config_Education!$A:$F,6,0)","v":"Master's Degree or MBA"}]
[{"$f":"Config_RawLabor!A78","v":"School"},{"$f":"Config_RawLabor!B78","v":"School Superintendent"},{"$f":"Config_RawLabor!C78","v":"Directs and manages a school district. Oversees all aspects of the district's operational policies, objectives, initiatives. Responsible for the attainment of short- and long-term financial and operational goals for the school system. "},{"$f":"VLOOKUP($B78,Config_Education!$A:$F,2,0)","v":"Master's Degree or MBA"},{"$f":"VLOOKUP($B78,Config_Education!$A:$F,3,0)","v":"Master's Degree or MBA"},{"$f":"VLOOKUP($B78,Config_Education!$A:$F,4,0)","v":"Master's Degree or MBA"},{"$f":"VLOOKUP($B78,Config_Education!$A:$F,5,0)","v":"Master's Degree or MBA"},{"$f":"VLOOKUP($B78,Config_Education!$A:$F,6,0)","v":"Master's Degree or MBA"}]

{"sheet":"Rates","index":3,"n_rows":79,"n_cols":17,"rows_kept":79,"cut":false,"hidden":false,"merged":[[0,2,0,4],[0,5,0,7],[0,8,0,10],[0,11,0,13],[0,14,0,16]]}
[null,{"$f":"Lookup!C4","v":"1/1/2021 thru 12/31/2021"},"Level I",null,null,"Level II",null,null,"Level III",null,null,"Level IV",null,null,"Level V"]
["Category","Role","Low","Median","High","Low","Median","High","Low","Median","High","Low","Median","High","Low","Median","High"]
[{"$f":"Calc!A2","v":"Advocate"},{"$f":"Calc!B2","v":"Administrative Analyst"},{"$f":"Calc!D2","v":45.592377405000008},{"$f":"Calc!E2","v":54.012377405000009},{"$f":"Calc!F2","v":65.452377405000007},{"$f":"Calc!G2","v":53.120434025000009},{"$f":"Calc!H2","v":64.340434025000008},{"$f":"Calc!I2","v":78.340434025000008},{"$f":"Calc!J2","v":63.283881505000025},{"$f":"Calc!K2","v":76.263881505000015},{"$f":"Calc!L2","v":92.103881505000018},{"$f":"Calc!M2","v":74.82172786000001},{"$f":"Calc!N2","v":89.761727860000008},{"$f":"Calc!O2","v":107.14172786},{"$f":"Calc!P2","v":84.416087175000015},{"$f":"Calc!Q2","v":101.91608717500002},{"$f":"Calc!R2","v":120.89608717500003}]
[{"$f":"Calc!A3","v":"Advocate"},{"$f":"Calc!B3","v":"Advocate - Not Otherwise Classified"},{"$f":"Calc!D3","v":59.864708502500008},{"$f":"Calc!E3","v":83.264708502500014},{"$f":"Calc!F3","v":113.50470850250002},{"$f":"Calc!G3","v":69.19736957500001},{"$f":"Calc!H3","v":98.557369575000024},{"$f":"Calc!I3","v":134.93736957500002},{"$f":"Calc!J3","v":82.764780307500018},{"$f":"Calc!K3","v":117.12478030750003},{"$f":"Calc!L3","v":158.92478030750004},{"$f":"Calc!M3","v":97.631389540000043},{"$f":"Calc!N3","v":137.79138954000004},{"$f":"Calc!O3","v":185.17138954000004},{"$f":"Calc!P3","v":109.98888042250002},{"$f":"Calc!Q3","v":156.14888042250004},{"$f":"Calc!R3","v":208.76888042250005}]
[{"$f":"Calc!A4","v":"Advocate"},{"$f":"Calc!B4","v":"Community Development Manager"},{"$f":"Calc!D4","v":55.361386450000012},{"$f":"Calc!E4","v":74.941386450000024},{"$f":"Calc!F4","v":96.981386450000016},{"$f":"Calc!G4","v":64.388416212500019},{"$f":"Calc!H4","v":89.268416212500014},{"$f":"Calc!I4","v":116.06841621250003},{"$f":"Calc!J4","v":76.739604400000019},{"$f":"Calc!K4","v":105.79960440000002},{"$f":"Calc!L4","v":136.51960440000002},{"$f":"Calc!M4","v":90.75495101250003},{"$f":"Calc!N4","v":124.53495101250003},{"$f":"Calc!O4","v":158.85495101250001},{"$f":"Calc!P4","v":102.37151496750002},{"$f":"Calc!Q4","v":141.39151496750003},{"$f":"Calc!R4","v":179.27151496750002}]
[{"$f":"Calc!A5","v":"Advocate"},{"$f":"Calc!B5","v":"Community Development Program Director"},{"$f":"Calc!D5","v":79.941653427500015},{"$f":"Calc!E5","v":104.36165342750003},{"$f":"Calc!F5","v":132.9416534275},{"$f":"Calc!G5","v":93.014535170000045},{"$f":"Calc!H5","v":124.31453517000003},{"$f":"Calc!I5","v":159.11453517000004},{"$f":"Calc!J5","v":110.83323870750004},{"$f":"Calc!K5","v":147.35323870750003},{"$f":"Calc!L5","v":187.09323870750003},{"$f":"Calc!M5","v":131.06627606250004},{"$f":"Calc!N5","v":173.44627606250003},{"$f":"Calc!O5","v":217.68627606250004},{"$f":"Calc!P5","v":147.87531529250003},{"$f":"Calc!Q5","v":196.91531529250005},{"$f":"Calc!R5","v":245.67531529250004}]
[{"$f":"Calc!A6","v":"Advocate"},{"$f":"Calc!B6","v":"Community Development Senior Specialist"},{"$f":"Calc!D6","v":55.27218898000001},{"$f":"Calc!E6","v":93.79218898000002},{"$f":"Calc!F6","v":132.15218898000003},{"$f":"Calc!G6","v":64.049840162500018},{"$f":"Calc!H6","v":111.72984016250003},{"$f":"Calc!I6","v":158.12984016250005},{"$f":"Calc!J6","v":76.407937372500015},{"$f":"Calc!K6","v":132.42793737250003},{"$f":"Calc!L6","v":186.00793737250004},{"$f":"Calc!M6","v":90.415984617500044},{"$f":"Calc!N6","v":155.87598461750002},{"$f":"Calc!O6","v":216.53598461750005},{"$f":"Calc!P6","v":101.89292954250001},{"$f":"Calc!Q6","v":176.97292954250005},{"$f":"Calc!R6","v":244.43292954250003}]
[{"$f":"Calc!A7","v":"Advocate"},{"$f":"Calc!B7","v":"Community Development Specialist"},{"$f":"Calc!D7","v":31.831840822500013},{"$f":"Calc!E7","v":43.63184082250001},{"$f":"Calc!F7","v":56.651840822500006},{"$f":"Calc!G7","v":37.016154860000007},{"$f":"Calc!H7","v":51.976154860000015},{"$f":"Calc!I7","v":67.816154860000012},{"$f":"Calc!J7","v":44.140979982500014},{"$f":"Calc!K7","v":61.600979982500007},{"$f":"Calc!L7","v":79.740979982500022},{"$f":"Calc!M7","v":52.186316190000014},{"$f":"Calc!N7","v":72.506316190000007},{"$f":"Calc!O7","v":92.806316190000018},{"$f":"Calc!P7","v":58.88006917749999},{"$f":"Calc!Q7","v":82.320069177500017},{"$f":"Calc!R7","v":104.7400691775}]
[{"$f":"Calc!A8","v":"Advocate"},{"$f":"Calc!B8","v":"Executive Director"},{"$f":"Calc!D8","v":91.637652675000027},{"$f":"Calc!E8","v":150.19765267500003},{"$f":"Calc!F8","v":238.93765267500004},{"$f":"Calc!G8","v":106.29468815500005},{"$f":"Calc!H8","v":178.91468815500005},{"$f":"Calc!I8","v":285.87468815500006},{"$f":"Calc!J8","v":126.76103247000003},{"$f":"Calc!K8","v":212.06103247000004},{"$f":"Calc!L8","v":336.38103247000004},{"$f":"Calc!M8","v":149.97569363500006},{"$f":"Calc!N8","v":249.61569363500004},{"$f":"Calc!O8","v":391.77569363500004},{"$f":"Calc!P8","v":169.05179750000008},{"$f":"Calc!Q8","v":283.39179750000005},{"$f":"Calc!R8","v":442.37179750000007}]
[{"$f":"Calc!A9","v":"Advocate"},{"$f":"Calc!B9","v":"Housing Program Manager"},{"$f":"Calc!D9","v":21.892221792500003},{"$f":"Calc!E9","v":47.872221792500007},{"$f":"Calc!F9","v":76.852221792500018},{"$f":"Calc!G9","v":25.235223245},{"$f":"Calc!H9","v":57.035223245000012},{"$f":"Calc!I9","v":91.935223245000017},{"$f":"Calc!J9","v":30.154191700000013},{"$f":"Calc!K9","v":67.594191700000025},{"$f":"Calc!L9","v":108.19419170000002},{"$f":"Calc!M9","v":35.71011914250002},{"$f":"Calc!N9","v":79.570119142500019},{"$f":"Calc!O9","v":126.01011914250002},{"$f":"Calc!P9","v":40.179007447500027},{"$f":"Calc!Q9","v":90.339007447500009},{"$f":"Calc!R9","v":142.27900744750002}]
[{"$f":"Calc!A10","v":"Advocate"},{"$f":"Calc!B10","v":"Program Coordinator"},{"$f":"Calc!D10","v":55.477132782500007},{"$f":"Calc!E10","v":71.677132782500024},{"$f":"Calc!F10","v":93.437132782500015},{"$f":"Calc!G10","v":64.574402995000014},{"$f":"Calc!H10","v":85.374402995000025},{"$f":"Calc!I10","v":111.81440299500002},{"$f":"Calc!J10","v":76.951863692500041},{"$f":"Calc!K10","v":101.19186369250002},{"$f":"Calc!L10","v":131.51186369250001},{"$f":"Calc!M10","v":90.988522890000027},{"$f":"Calc!N10","v":119.10852289000003},{"$f":"Calc!O10","v":153.02852289000003},{"$f":"Calc!P10","v":102.65036737000003},{"$f":"Calc!Q10","v":135.23036737000004},{"$f":"Calc!R10","v":172.71036737000006}]
[{"$f":"Calc!A11","v":"Advocate"},{"$f":"Calc!B11","v":"Program Manager"},{"$f":"Calc!D11","v":86.328090925000041},{"$f":"Calc!E11","v":96.668090925000016},{"$f":"Calc!F11","v":119.46809092500003},{"$f":"Calc!G11","v":100.63153371750003},{"$f":"Calc!H11","v":115.15153371750002},{"$f":"Calc!I11","v":142.99153371750003},{"$f":"Calc!J11","v":119.87939047750004},{"$f":"Calc!K11","v":136.47939047750003},{"$f":"Calc!L11","v":168.15939047750004},{"$f":"Calc!M11","v":141.69166120500006},{"$f":"Calc!N11","v":160.65166120500004},{"$f":"Calc!O11","v":195.61166120500002},{"$f":"Calc!P11","v":159.92886167250001},{"$f":"Calc!Q11","v":182.38886167250004},{"$f":"Calc!R11","v":220.7488616725}]
[{"$f":"Calc!A12","v":"Expert"},{"$f":"Calc!B12","v":"Accountant"},{"$f":"Calc!D12","v":88.960531327500021},{"$f":"Calc!E12","v":107.30053132750002},{"$f":"Calc!F12","v":127.9805313275},{"$f":"Calc!G12","v":103.43075771500003},{"$f":"Calc!H12","v":126.35075771500001},{"$f":"Calc!I12","v":151.550757715},{"$f":"Calc!J12","v":128.69351974750003},{"$f":"Calc!K12","v":157.09351974750001},{"$f":"Calc!L12","v":189.57351974750003},{"$f":"Calc!M12","v":160.28245436},{"$f":"Calc!N12","v":192.62245436000003},{"$f":"Calc!O12","v":228.60245436},{"$f":"Calc!P12","v":180.61811688500006},{"$f":"Calc!Q12","v":217.07811688500004},{"$f":"Calc!R12","v":257.61811688500006}]
[{"$f":"Calc!A13","v":"Expert"},{"$f":"Calc!B13","v":"Biologist"},{"$f":"Calc!D13","v":85.822069270000028},{"$f":"Calc!E13","v":104.58206927000002},{"$f":"Calc!F13","v":130.30206927},{"$f":"Calc!G13","v":91.104329592500022},{"$f":"Calc!H13","v":120.92432959250002},{"$f":"Calc!I13","v":151.20432959250002},{"$f":"Calc!J13","v":109.81621466250004},{"$f":"Calc!K13","v":147.41621466250001},{"$f":"Calc!L13","v":196.41621466250001},{"$f":"Calc!M13","v":153.83440917500002},{"$f":"Calc!N13","v":211.07440917500003},{"$f":"Calc!O13","v":278.59440917500007},{"$f":"Calc!P13","v":161.62339741000002},{"$f":"Calc!Q13","v":216.34339741000005},{"$f":"Calc!R13","v":256.30339741}]
[{"$f":"Calc!A14","v":"Expert"},{"$f":"Calc!B14","v":"Certified Depreciation Professional"},{"$f":"Calc!D14","v":99.301033037500019},{"$f":"Calc!E14","v":121.70103303750003},{"$f":"Calc!F14","v":144.82103303750003},{"$f":"Calc!G14","v":119.67740182000003},{"$f":"Calc!H14","v":142.99740182000005},{"$f":"Calc!I14","v":171.27740182000002},{"$f":"Calc!J14","v":139.68861550500003},{"$f":"Calc!K14","v":168.62861550500003},{"$f":"Calc!L14","v":199.18861550500003},{"$f":"Calc!M14","v":168.00001498750004},{"$f":"Calc!N14","v":202.94001498750004},{"$f":"Calc!O14","v":247.58001498750002},{"$f":"Calc!P14","v":190.20777181750003},{"$f":"Calc!Q14","v":229.76777181750003},{"$f":"Calc!R14","v":280.32777181750004}]
[{"$f":"Calc!A15","v":"Expert"},{"$f":"Calc!B15","v":"Chemical Engineer"},{"$f":"Calc!D15","v":127.99397046250004},{"$f":"Calc!E15","v":153.29397046250006},{"$f":"Calc!F15","v":184.09397046250001},{"$f":"Calc!G15","v":142.95837036750007},{"$f":"Calc!H15","v":175.81837036750002},{"$f":"Calc!I15","v":214.33837036750006},{"$f":"Calc!J15","v":163.74794618000007},{"$f":"Calc!K15","v":209.66794618000003},{"$f":"Calc!L15","v":258.38794618000009},{"$f":"Calc!M15","v":208.73277805000006},{"$f":"Calc!N15","v":254.63277805000004},{"$f":"Calc!O15","v":313.47277804999999},{"$f":"Calc!P15","v":225.61225290250002},{"$f":"Calc!Q15","v":273.03225290250003},{"$f":"Calc!R15","v":319.5722529025}]
[{"$f":"Calc!A16","v":"Expert"},{"$f":"Calc!B16","v":"Civil Engineer"},{"$f":"Calc!D16","v":114.01359886750004},{"$f":"Calc!E16","v":135.93359886750002},{"$f":"Calc!F16","v":169.25359886750002},{"$f":"Calc!G16","v":133.14404123750003},{"$f":"Calc!H16","v":166.20404123750004},{"$f":"Calc!I16","v":202.52404123750003},{"$f":"Calc!J16","v":160.11611210500001},{"$f":"Calc!K16","v":201.37611210500006},{"$f":"Calc!L16","v":249.91611210500002},{"$f":"Calc!M16","v":166.82224981250002},{"$f":"Calc!N16","v":210.18224981250003},{"$f":"Calc!O16","v":259.36224981250007},{"$f":"Calc!P16","v":195.15246213750007},{"$f":"Calc!Q16","v":248.91246213750006},{"$f":"Calc!R16","v":306.93246213750012}]
[{"$f":"Calc!A17","v":"Expert"},{"$f":"Calc!B17","v":"Climate Scientist"},{"$f":"Calc!D17","v":100.26061250750001},{"$f":"Calc!E17","v":128.04061250750001},{"$f":"Calc!F17","v":159.38061250750002},{"$f":"Calc!G17","v":130.93124536250002},{"$f":"Calc!H17","v":160.43124536250002},{"$f":"Calc!I17","v":196.59124536250005},{"$f":"Calc!J17","v":147.68498428750007},{"$f":"Calc!K17","v":189.92498428750002},{"$f":"Calc!L17","v":237.42498428750002},{"$f":"Calc!M17","v":156.72673352500001},{"$f":"Calc!N17","v":204.98673352500006},{"$f":"Calc!O17","v":253.28673352500002},{"$f":"Calc!P17","v":166.91515705250006},{"$f":"Calc!Q17","v":239.23515705250006},{"$f":"Calc!R17","v":303.2151570525001}]
[{"$f":"Calc!A18","v":"Expert"},{"$f":"Calc!B18","v":"Communication Specialist"},{"$f":"Calc!D18","v":105.91769223500003},{"$f":"Calc!E18","v":139.61769223500005},{"$f":"Calc!F18","v":176.19769223500003},{"$f":"Calc!G18","v":130.8614462525},{"$f":"Calc!H18","v":170.38144625250004},{"$f":"Calc!I18","v":214.14144625250003},{"$f":"Calc!J18","v":165.40615269500003},{"$f":"Calc!K18","v":211.74615269500006},{"$f":"Calc!L18","v":272.70615269500001},{"$f":"Calc!M18","v":204.64051875750005},{"$f":"Calc!N18","v":259.24051875750007},{"$f":"Calc!O18","v":326.68051875750001},{"$f":"Calc!P18","v":256.74474636000008},{"$f":"Calc!Q18","v":343.76474636000006},{"$f":"Calc!R18","v":460.12474636000007}]
[{"$f":"Calc!A19","v":"Expert"},{"$f":"Calc!B19","v":"Cost Accountant"},{"$f":"Calc!D19","v":99.301033037500019},{"$f":"Calc!E19","v":121.70103303750003},{"$f":"Calc!F19","v":144.82103303750003},{"$f":"Calc!G19","v":119.67740182000003},{"$f":"Calc!H19","v":142.99740182000005},{"$f":"Calc!I19","v":171.27740182000002},{"$f":"Calc!J19","v":139.68861550500003},{"$f":"Calc!K19","v":168.62861550500003},{"$f":"Calc!L19","v":199.18861550500003},{"$f":"Calc!M19","v":168.00001498750004},{"$f":"Calc!N19","v":202.94001498750004},{"$f":"Calc!O19","v":247.58001498750002},{"$f":"Calc!P19","v":190.20777181750003},{"$f":"Calc!Q19","v":229.76777181750003},{"$f":"Calc!R19","v":280.32777181750004}]
[{"$f":"Calc!A20","v":"Expert"},{"$f":"Calc!B20","v":"Cost Estimation Analyst"},{"$f":"Calc!D20","v":108.90816273000002},{"$f":"Calc!E20","v":130.52816273000002},{"$f":"Calc!F20","v":158.74816273000002},{"$f":"Calc!G20","v":133.84580453750007},{"$f":"Calc!H20","v":161.58580453750002},{"$f":"Calc!I20","v":200.06580453750004},{"$f":"Calc!J20","v":145.91193287000002},{"$f":"Calc!K20","v":183.51193287000004},{"$f":"Calc!L20","v":231.25193287000005},{"$f":"Calc!M20","v":170.95618859750002},{"$f":"Calc!N20","v":228.67618859750004},{"$f":"Calc!O20","v":279.57618859750005},{"$f":"Calc!P20","v":233.54604751000005},{"$f":"Calc!Q20","v":314.16604751000006},{"$f":"Calc!R20","v":389.66604751000006}]
[{"$f":"Calc!A21","v":"Expert"},{"$f":"Calc!B21","v":"Design Engineer"},{"$f":"Calc!D21","v":116.15171014000003},{"$f":"Calc!E21","v":136.95171014000002},{"$f":"Calc!F21","v":159.91171014000005},{"$f":"Calc!G21","v":123.57054848000001},{"$f":"Calc!H21","v":150.47054848000005},{"$f":"Calc!I21","v":183.35054848000004},{"$f":"Calc!J21","v":170.41419319250005},{"$f":"Calc!K21","v":199.85419319250005},{"$f":"Calc!L21","v":242.05419319250004},{"$f":"Calc!M21","v":197.79588412000007},{"$f":"Calc!N21","v":251.73588412000007},{"$f":"Calc!O21","v":328.21588412000006},{"$f":"Calc!P21","v":220.73474327000008},{"$f":"Calc!Q21","v":280.91474327000003},{"$f":"Calc!R21","v":366.29474327000003}]
[{"$f":"Calc!A22","v":"Expert"},{"$f":"Calc!B22","v":"Drilling Engineer "},{"$f":"Calc!D22","v":167.60993952500004},{"$f":"Calc!E22","v":196.58993952500006},{"$f":"Calc!F22","v":233.44993952500002},{"$f":"Calc!G22","v":197.56763232750006},{"$f":"Calc!H22","v":245.84763232750004},{"$f":"Calc!I22","v":287.88763232750006},{"$f":"Calc!J22","v":221.04526476000007},{"$f":"Calc!K22","v":290.02526476000003},{"$f":"Calc!L22","v":343.92526476},{"$f":"Calc!M22","v":290.10005810000013},{"$f":"Calc!N22","v":366.52005810000009},{"$f":"Calc!O22","v":429.06005810000016},{"$f":"Calc!P22","v":302.99950951500006},{"$f":"Calc!Q22","v":417.71950951500008},{"$f":"Calc!R22","v":469.39950951500003}]
[{"$f":"Calc!A23","v":"Expert"},{"$f":"Calc!B23","v":"Ecologist"},{"$f":"Calc!D23","v":85.822069270000028},{"$f":"Calc!E23","v":104.58206927000002},{"$f":"Calc!F23","v":130.30206927},{"$f":"Calc!G23","v":91.104329592500022},{"$f":"Calc!H23","v":120.92432959250002},{"$f":"Calc!I23","v":151.20432959250002},{"$f":"Calc!J23","v":109.81621466250004},{"$f":"Calc!K23","v":147.41621466250001},{"$f":"Calc!L23","v":196.41621466250001},{"$f":"Calc!M23","v":153.83440917500002},{"$f":"Calc!N23","v":211.07440917500003},{"$f":"Calc!O23","v":278.59440917500007},{"$f":"Calc!P23","v":161.62339741000002},{"$f":"Calc!Q23","v":216.34339741000005},{"$f":"Calc!R23","v":256.30339741}]
[{"$f":"Calc!A24","v":"Expert"},{"$f":"Calc!B24","v":"Economist"},{"$f":"Calc!D24","v":125.08492860500002},{"$f":"Calc!E24","v":178.28492860500006},{"$f":"Calc!F24","v":238.04492860500005},{"$f":"Calc!G24","v":146.60055625750002},{"$f":"Calc!H24","v":206.76055625750004},{"$f":"Calc!I24","v":276.76055625750007},{"$f":"Calc!J24","v":168.36255166250007},{"$f":"Calc!K24","v":235.58255166250004},{"$f":"Calc!L24","v":315.90255166250006},{"$f":"Calc!M24","v":178.48167573000006},{"$f":"Calc!N24","v":252.28167573000007},{"$f":"Calc!O24","v":343.26167573000009},{"$f":"Calc!P24","v":188.52633586500002},{"$f":"Calc!Q24","v":268.88633586500004},{"$f":"Calc!R24","v":370.44633586499998}]
[{"$f":"Calc!A25","v":"Expert"},{"$f":"Calc!B25","v":"Electrical Controls Engineer "},{"$f":"Calc!D25","v":113.11042774000001},{"$f":"Calc!E25","v":140.31042774000002},{"$f":"Calc!F25","v":157.95042774000001},{"$f":"Calc!G25","v":118.00145562750001},{"$f":"Calc!H25","v":157.26145562750006},{"$f":"Calc!I25","v":194.98145562750003},{"$f":"Calc!J25","v":122.84355565000004},{"$f":"Calc!K25","v":174.02355565000005},{"$f":"Calc!L25","v":231.60355565000003},{"$f":"Calc!M25","v":142.64242417500003},{"$f":"Calc!N25","v":190.08242417500003},{"$f":"Calc!O25","v":246.62242417500005},{"$f":"Calc!P25","v":162.15988487250007},{"$f":"Calc!Q25","v":205.89988487250002},{"$f":"Calc!R25","v":261.41988487250006}]
[{"$f":"Calc!A26","v":"Expert"},{"$f":"Calc!B26","v":"Electrical Engineer "},{"$f":"Calc!D26","v":121.73001189750005},{"$f":"Calc!E26","v":140.09001189750003},{"$f":"Calc!F26","v":162.33001189750004},{"$f":"Calc!G26","v":138.81882577000002},{"$f":"Calc!H26","v":165.45882577},{"$f":"Calc!I26","v":198.97882577000004},{"$f":"Calc!J26","v":163.64651285500005},{"$f":"Calc!K26","v":200.32651285500006},{"$f":"Calc!L26","v":238.50651285500001},{"$f":"Calc!M26","v":197.97589818250006},{"$f":"Calc!N26","v":232.05589818250004},{"$f":"Calc!O26","v":273.5158981825},{"$f":"Calc!P26","v":226.17007376000004},{"$f":"Calc!Q26","v":277.43007376000003},{"$f":"Calc!R26","v":318.01007376000007}]
[{"$f":"Calc!A27","v":"Expert"},{"$f":"Calc!B27","v":"Energy & Resources Expert"},{"$f":"Calc!D27","v":92.67616366750002},{"$f":"Calc!E27","v":129.21616366750001},{"$f":"Calc!F27","v":199.71616366750004},{"$f":"Calc!G27","v":106.8552830475},{"$f":"Calc!H27","v":152.47528304750003},{"$f":"Calc!I27","v":238.55528304750001},{"$f":"Calc!J27","v":131.60556511750002},{"$f":"Calc!K27","v":183.16556511750002},{"$f":"Calc!L27","v":281.84556511750003},{"$f":"Calc!M27","v":157.38288163750005},{"$f":"Calc!N27","v":221.62288163750006},{"$f":"Calc!O27","v":331.98288163749999},{"$f":"Calc!P27","v":169.02683551500007},{"$f":"Calc!Q27","v":241.38683551500003},{"$f":"Calc!R27","v":357.14683551500008}]
[{"$f":"Calc!A28","v":"Expert"},{"$f":"Calc!B28","v":"Engineer "},{"$f":"Calc!D28","v":117.90575823000003},{"$f":"Calc!E28","v":136.82575823000005},{"$f":"Calc!F28","v":170.16575823000002},{"$f":"Calc!G28","v":130.26667109500002},{"$f":"Calc!H28","v":158.00667109500003},{"$f":"Calc!I28","v":191.04667109500005},{"$f":"Calc!J28","v":155.00008942000005},{"$f":"Calc!K28","v":188.34008942000003},{"$f":"Calc!L28","v":240.58008942000004},{"$f":"Calc!M28","v":186.23241114250004},{"$f":"Calc!N28","v":230.71241114250006},{"$f":"Calc!O28","v":279.57241114250007},{"$f":"Calc!P28","v":218.51887619750005},{"$f":"Calc!Q28","v":274.01887619750005},{"$f":"Calc!R28","v":346.31887619750012}]
[{"$f":"Calc!A29","v":"Expert"},{"$f":"Calc!B29","v":"Env., Health, and Safety Engineer "},{"$f":"Calc!D29","v":101.36701982000002},{"$f":"Calc!E29","v":117.80701982000002},{"$f":"Calc!F29","v":154.36701982000005},{"$f":"Calc!G29","v":124.85874459000004},{"$f":"Calc!H29","v":144.71874459000003},{"$f":"Calc!I29","v":159.81874459000005},{"$f":"Calc!J29","v":144.78281920750007},{"$f":"Calc!K29","v":174.64281920750003},{"$f":"Calc!L29","v":201.80281920750005},{"$f":"Calc!M29","v":167.97562651750002},{"$f":"Calc!N29","v":209.19562651750005},{"$f":"Calc!O29","v":247.57562651750004},{"$f":"Calc!P29","v":214.10713736500003},{"$f":"Calc!Q29","v":266.78713736500004},{"$f":"Calc!R29","v":308.68713736500001}]
[{"$f":"Calc!A30","v":"Expert"},{"$f":"Calc!B30","v":"Environmental Engineer "},{"$f":"Calc!D30","v":100.26061250750001},{"$f":"Calc!E30","v":128.04061250750001},{"$f":"Calc!F30","v":159.38061250750002},{"$f":"Calc!G30","v":130.93124536250002},{"$f":"Calc!H30","v":160.43124536250002},{"$f":"Calc!I30","v":196.59124536250005},{"$f":"Calc!J30","v":147.68498428750007},{"$f":"Calc!K30","v":189.92498428750002},{"$f":"Calc!L30","v":237.42498428750002},{"$f":"Calc!M30","v":156.72673352500001},{"$f":"Calc!N30","v":204.98673352500006},{"$f":"Calc!O30","v":253.28673352500002},{"$f":"Calc!P30","v":166.91515705250006},{"$f":"Calc!Q30","v":239.23515705250006},{"$f":"Calc!R30","v":303.2151570525001}]
[{"$f":"Calc!A31","v":"Expert"},{"$f":"Calc!B31","v":"Equipment Engineer "},{"$f":"Calc!D31","v":112.67033249750003},{"$f":"Calc!E31","v":139.25033249750001},{"$f":"Calc!F31","v":164.41033249750004},{"$f":"Calc!G31","v":140.50809973250006},{"$f":"Calc!H31","v":173.90809973250003},{"$f":"Calc!I31","v":214.18809973250006},{"$f":"Calc!J31","v":153.29407245250005},{"$f":"Calc!K31","v":189.69407245250002},{"$f":"Calc!L31","v":237.93407245250003},{"$f":"Calc!M31","v":182.06917964500002},{"$f":"Calc!N31","v":230.00917964500002},{"$f":"Calc!O31","v":288.02917964500006},{"$f":"Calc!P31","v":210.49470165000002},{"$f":"Calc!Q31","v":249.59470165000005},{"$f":"Calc!R31","v":290.39470165}]
[{"$f":"Calc!A32","v":"Expert"},{"$f":"Calc!B32","v":"Expert - Not Otherwise Classified"},{"$f":"Calc!D32","v":117.40834384000004},{"$f":"Calc!E32","v":145.76834384000003},{"$f":"Calc!F32","v":189.90834384000001},{"$f":"Calc!G32","v":135.81725295500004},{"$f":"Calc!H32","v":172.19725295500004},{"$f":"Calc!I32","v":225.31725295500004},{"$f":"Calc!J32","v":161.75383772000006},{"$f":"Calc!K32","v":204.71383772000004},{"$f":"Calc!L32","v":266.43383772000004},{"$f":"Calc!M32","v":191.57221128250006},{"$f":"Calc!N32","v":241.71221128250005},{"$f":"Calc!O32","v":310.45221128250012},{"$f":"Calc!P32","v":219.11868102500006},{"$f":"Calc!Q32","v":278.45868102500009},{"$f":"Calc!R32","v":356.49868102500005}]
[{"$f":"Calc!A33","v":"Expert"},{"$f":"Calc!B33","v":"Expert - Social Work"},{"$f":"Calc!D33","v":85.857090595000017},{"$f":"Calc!E33","v":130.71709059500003},{"$f":"Calc!F33","v":237.33709059500001},{"$f":"Calc!G33","v":99.688048737500054},{"$f":"Calc!H33","v":155.70804873750004},{"$f":"Calc!I33","v":283.88804873750007},{"$f":"Calc!J33","v":118.84153212000001},{"$f":"Calc!K33","v":184.56153212000004},{"$f":"Calc!L33","v":334.16153212},{"$f":"Calc!M33","v":140.59555677250006},{"$f":"Calc!N33","v":217.23555677250005},{"$f":"Calc!O33","v":389.37555677250009},{"$f":"Calc!P33","v":158.53483176500006},{"$f":"Calc!Q33","v":246.63483176500003},{"$f":"Calc!R33","v":439.77483176500004}]
[{"$f":"Calc!A34","v":"Expert"},{"$f":"Calc!B34","v":"Field Service Engineer "},{"$f":"Calc!D34","v":93.017992025000027},{"$f":"Calc!E34","v":123.11799202500002},{"$f":"Calc!F34","v":158.55799202500003},{"$f":"Calc!G34","v":109.20875968250004},{"$f":"Calc!H34","v":145.98875968250005},{"$f":"Calc!I34","v":187.30875968250004},{"$f":"Calc!J34","v":135.63564995500005},{"$f":"Calc!K34","v":176.39564995500004},{"$f":"Calc!L34","v":228.57564995500005},{"$f":"Calc!M34","v":152.76762558000004},{"$f":"Calc!N34","v":210.50762558000005},{"$f":"Calc!O34","v":253.74762558000006},{"$f":"Calc!P34","v":169.40956530250003},{"$f":"Calc!Q34","v":227.68956530250006},{"$f":"Calc!R34","v":276.32956530250004}]
[{"$f":"Calc!A35","v":"Expert"},{"$f":"Calc!B35","v":"Fire Fighter"},{"$f":"Calc!D35","v":36.13972776750002},{"$f":"Calc!E35","v":67.499727767500019},{"$f":"Calc!F35","v":99.959727767500027},{"$f":"Calc!G35","v":41.839302550000028},{"$f":"Calc!H35","v":80.399302550000016},{"$f":"Calc!I35","v":119.59930255000003},{"$f":"Calc!J35","v":49.903611900000016},{"$f":"Calc!K35","v":95.303611900000021},{"$f":"Calc!L35","v":140.70361190000003},{"$f":"Calc!M35","v":59.070671847500009},{"$f":"Calc!N35","v":112.17067184750003},{"$f":"Calc!O35","v":163.83067184750001},{"$f":"Calc!P35","v":66.538372995000032},{"$f":"Calc!Q35","v":127.35837299500002},{"$f":"Calc!R35","v":184.93837299500001}]
[{"$f":"Calc!A36","v":"Expert"},{"$f":"Calc!B36","v":"Fire Inspector Supervisor"},{"$f":"Calc!D36","v":74.676177730000035},{"$f":"Calc!E36","v":109.53617773000002},{"$f":"Calc!F36","v":157.11617773000003},{"$f":"Calc!G36","v":86.755682767500019},{"$f":"Calc!H36","v":130.47568276750002},{"$f":"Calc!I36","v":188.01568276750004},{"$f":"Calc!J36","v":103.42795349500003},{"$f":"Calc!K36","v":154.64795349500002},{"$f":"Calc!L36","v":221.18795349500004},{"$f":"Calc!M36","v":122.33199792750005},{"$f":"Calc!N36","v":182.03199792750004},{"$f":"Calc!O36","v":257.49199792750005},{"$f":"Calc!P36","v":137.96609232500006},{"$f":"Calc!Q36","v":206.66609232500005},{"$f":"Calc!R36","v":290.66609232500002}]
[{"$f":"Calc!A37","v":"Expert"},{"$f":"Calc!B37","v":"Fire Prevention Engineer"},{"$f":"Calc!D37","v":84.306432242500009},{"$f":"Calc!E37","v":89.226432242500024},{"$f":"Calc!F37","v":120.70643224250001},{"$f":"Calc!G37","v":98.342420055000034},{"$f":"Calc!H37","v":106.28242005500003},{"$f":"Calc!I37","v":144.462420055},{"$f":"Calc!J37","v":117.12339797750001},{"$f":"Calc!K37","v":125.98339797750002},{"$f":"Calc!L37","v":169.90339797750005},{"$f":"Calc!M37","v":138.42738204000003},{"$f":"Calc!N37","v":148.28738204000004},{"$f":"Calc!O37","v":197.74738204000002},{"$f":"Calc!P37","v":156.27571970000005},{"$f":"Calc!Q37","v":168.35571970000004},{"$f":"Calc!R37","v":223.21571970000005}]
[{"$f":"Calc!A38","v":"Expert"},{"$f":"Calc!B38","v":"Geologist"},{"$f":"Calc!D38","v":108.75204480250002},{"$f":"Calc!E38","v":116.43204480250003},{"$f":"Calc!F38","v":155.05204480250003},{"$f":"Calc!G38","v":118.48274271500003},{"$f":"Calc!H38","v":147.34274271500001},{"$f":"Calc!I38","v":225.66274271500001},{"$f":"Calc!J38","v":166.27132185500002},{"$f":"Calc!K38","v":187.73132185500006},{"$f":"Calc!L38","v":248.01132185500003},{"$f":"Calc!M38","v":154.90880336250004},{"$f":"Calc!N38","v":219.20880336250005},{"$f":"Calc!O38","v":281.70880336250002},{"$f":"Calc!P38","v":192.22510914750001},{"$f":"Calc!Q38","v":283.88510914750009},{"$f":"Calc!R38","v":336.16510914750006}]
[{"$f":"Calc!A39","v":"Expert"},{"$f":"Calc!B39","v":"Geotechnical Engineer"},{"$f":"Calc!D39","v":106.37929992250002},{"$f":"Calc!E39","v":128.85929992250001},{"$f":"Calc!F39","v":144.91929992250004},{"$f":"Calc!G39","v":102.90514721500003},{"$f":"Calc!H39","v":141.04514721500001},{"$f":"Calc!I39","v":165.14514721500004},{"$f":"Calc!J39","v":133.06867118750006},{"$f":"Calc!K39","v":180.26867118750005},{"$f":"Calc!L39","v":208.18867118750006},{"$f":"Calc!M39","v":196.97837242750003},{"$f":"Calc!N39","v":217.71837242750004},{"$f":"Calc!O39","v":238.49837242750002},{"$f":"Calc!P39","v":224.38980678250005},{"$f":"Calc!Q39","v":248.00980678250005},{"$f":"Calc!R39","v":271.68980678250006}]
[{"$f":"Calc!A40","v":"Expert"},{"$f":"Calc!B40","v":"Hardware Engineer "},{"$f":"Calc!D40","v":112.33861916250004},{"$f":"Calc!E40","v":141.11861916250001},{"$f":"Calc!F40","v":165.85861916250002},{"$f":"Calc!G40","v":134.77885595500001},{"$f":"Calc!H40","v":167.99885595500004},{"$f":"Calc!I40","v":203.71885595500001},{"$f":"Calc!J40","v":164.70481461250003},{"$f":"Calc!K40","v":203.46481461250002},{"$f":"Calc!L40","v":247.10481461250001},{"$f":"Calc!M40","v":201.41575869250008},{"$f":"Calc!N40","v":248.13575869250005},{"$f":"Calc!O40","v":292.43575869250003},{"$f":"Calc!P40","v":230.66210300750004},{"$f":"Calc!Q40","v":281.28210300750004},{"$f":"Calc!R40","v":332.7021030075}]
[{"$f":"Calc!A41","v":"Expert"},{"$f":"Calc!B41","v":"Health Scientist"},{"$f":"Calc!D41","v":127.13183294000001},{"$f":"Calc!E41","v":189.01183294000006},{"$f":"Calc!F41","v":268.79183294000006},{"$f":"Calc!G41","v":147.66953511750006},{"$f":"Calc!H41","v":225.14953511750002},{"$f":"Calc!I41","v":321.62953511750004},{"$f":"Calc!J41","v":176.06060931250005},{"$f":"Calc!K41","v":266.86060931250006},{"$f":"Calc!L41","v":378.36060931250006},{"$f":"Calc!M41","v":208.2535675475001},{"$f":"Calc!N41","v":314.11356754750005},{"$f":"Calc!O41","v":440.47356754750007},{"$f":"Calc!P41","v":234.81283316500009},{"$f":"Calc!Q41","v":356.63283316500002},{"$f":"Calc!R41","v":497.21283316500006}]
[{"$f":"Calc!A42","v":"Expert"},{"$f":"Calc!B42","v":"Hydrologist"},{"$f":"Calc!D42","v":100.26061250750001},{"$f":"Calc!E42","v":128.04061250750001},{"$f":"Calc!F42","v":159.38061250750002},{"$f":"Calc!G42","v":130.93124536250002},{"$f":"Calc!H42","v":160.43124536250002},{"$f":"Calc!I42","v":196.59124536250005},{"$f":"Calc!J42","v":147.68498428750007},{"$f":"Calc!K42","v":189.92498428750002},{"$f":"Calc!L42","v":237.42498428750002},{"$f":"Calc!M42","v":156.72673352500001},{"$f":"Calc!N42","v":204.98673352500006},{"$f":"Calc!O42","v":253.28673352500002},{"$f":"Calc!P42","v":166.91515705250006},{"$f":"Calc!Q42","v":239.23515705250006},{"$f":"Calc!R42","v":303.2151570525001}]
[{"$f":"Calc!A43","v":"Expert"},{"$f":"Calc!B43","v":"IT Project Engineer "},{"$f":"Calc!D43","v":142.089377445},{"$f":"Calc!E43","v":177.10937744500004},{"$f":"Calc!F43","v":227.52937744499999},{"$f":"Calc!G43","v":151.743827315},{"$f":"Calc!H43","v":196.88382731500005},{"$f":"Calc!I43","v":251.48382731500001},{"$f":"Calc!J43","v":178.90105796750007},{"$f":"Calc!K43","v":221.16105796750006},{"$f":"Calc!L43","v":271.10105796750008},{"$f":"Calc!M43","v":176.72809241750002},{"$f":"Calc!N43","v":228.92809241750007},{"$f":"Calc!O43","v":278.04809241750002},{"$f":"Calc!P43","v":198.46784831000008},{"$f":"Calc!Q43","v":257.06784831000004},{"$f":"Calc!R43","v":312.24784831000005}]
[{"$f":"Calc!A44","v":"Expert"},{"$f":"Calc!B44","v":"Mechanical Engineer "},{"$f":"Calc!D44","v":118.33030231250004},{"$f":"Calc!E44","v":136.71030231250003},{"$f":"Calc!F44","v":158.57030231250005},{"$f":"Calc!G44","v":140.25882577000002},{"$f":"Calc!H44","v":165.45882577},{"$f":"Calc!I44","v":197.89882577000006},{"$f":"Calc!J44","v":167.2239225575},{"$f":"Calc!K44","v":197.94392255750003},{"$f":"Calc!L44","v":233.28392255750001},{"$f":"Calc!M44","v":197.35512686750008},{"$f":"Calc!N44","v":236.69512686750005},{"$f":"Calc!O44","v":282.15512686750009},{"$f":"Calc!P44","v":227.25215766000002},{"$f":"Calc!Q44","v":271.97215766000005},{"$f":"Calc!R44","v":316.6721576600001}]
[{"$f":"Calc!A45","v":"Expert"},{"$f":"Calc!B45","v":"Network Engineer "},{"$f":"Calc!D45","v":108.25369411000003},{"$f":"Calc!E45","v":136.99369411000004},{"$f":"Calc!F45","v":177.81369411000003},{"$f":"Calc!G45","v":131.50538400750003},{"$f":"Calc!H45","v":167.92538400750004},{"$f":"Calc!I45","v":210.94538400750002},{"$f":"Calc!J45","v":158.38795555500005},{"$f":"Calc!K45","v":196.54795555500002},{"$f":"Calc!L45","v":236.34795555500003},{"$f":"Calc!M45","v":194.96210094750009},{"$f":"Calc!N45","v":239.38210094750005},{"$f":"Calc!O45","v":290.44210094750008},{"$f":"Calc!P45","v":210.01159558000003},{"$f":"Calc!Q45","v":252.49159558000005},{"$f":"Calc!R45","v":303.03159558000004}]
[{"$f":"Calc!A46","v":"Expert"},{"$f":"Calc!B46","v":"Nuclear Engineer "},{"$f":"Calc!D46","v":135.05189125000004},{"$f":"Calc!E46","v":152.19189125000003},{"$f":"Calc!F46","v":196.39189125000001},{"$f":"Calc!G46","v":145.85157739750005},{"$f":"Calc!H46","v":188.37157739750003},{"$f":"Calc!I46","v":222.81157739750003},{"$f":"Calc!J46","v":169.49290141750004},{"$f":"Calc!K46","v":216.33290141750007},{"$f":"Calc!L46","v":259.95290141750002},{"$f":"Calc!M46","v":195.91404432750005},{"$f":"Calc!N46","v":229.05404432750004},{"$f":"Calc!O46","v":276.75404432750008},{"$f":"Calc!P46","v":208.10045370000006},{"$f":"Calc!Q46","v":260.72045370000006},{"$f":"Calc!R46","v":315.72045370000001}]
[{"$f":"Calc!A47","v":"Expert"},{"$f":"Calc!B47","v":"Physicist"},{"$f":"Calc!D47","v":138.87665131500003},{"$f":"Calc!E47","v":163.29665131500005},{"$f":"Calc!F47","v":259.71665131500004},{"$f":"Calc!G47","v":146.35271562000003},{"$f":"Calc!H47","v":207.65271562000004},{"$f":"Calc!I47","v":330.59271562000004},{"$f":"Calc!J47","v":168.81775203750007},{"$f":"Calc!K47","v":235.05775203750002},{"$f":"Calc!L47","v":346.33775203749997},{"$f":"Calc!M47","v":208.97649719500009},{"$f":"Calc!N47","v":289.41649719500009},{"$f":"Calc!O47","v":397.21649719500004},{"$f":"Calc!P47","v":260.95545627500007},{"$f":"Calc!Q47","v":313.09545627500006},{"$f":"Calc!R47","v":433.11545627500004}]
[{"$f":"Calc!A48","v":"Expert"},{"$f":"Calc!B48","v":"Process Engineer "},{"$f":"Calc!D48","v":117.63500669500002},{"$f":"Calc!E48","v":136.17500669500004},{"$f":"Calc!F48","v":159.23500669500004},{"$f":"Calc!G48","v":137.68903603500002},{"$f":"Calc!H48","v":162.28903603500004},{"$f":"Calc!I48","v":185.12903603500001},{"$f":"Calc!J48","v":161.71426293750002},{"$f":"Calc!K48","v":191.81426293750005},{"$f":"Calc!L48","v":219.05426293750006},{"$f":"Calc!M48","v":192.71337294250003},{"$f":"Calc!N48","v":228.19337294250005},{"$f":"Calc!O48","v":266.87337294250005},{"$f":"Calc!P48","v":217.07735231750002},{"$f":"Calc!Q48","v":257.05735231750003},{"$f":"Calc!R48","v":300.61735231750004}]
[{"$f":"Calc!A49","v":"Expert"},{"$f":"Calc!B49","v":"Professor - Law"},{"$f":"Calc!D49","v":121.31617453500004},{"$f":"Calc!E49","v":248.35617453500006},{"$f":"Calc!F49","v":391.81617453500007},{"$f":"Calc!G49","v":132.13110061750007},{"$f":"Calc!H49","v":273.43110061750002},{"$f":"Calc!I49","v":434.47110061749999},{"$f":"Calc!J49","v":142.77866696250004},{"$f":"Calc!K49","v":298.13866696250005},{"$f":"Calc!L49","v":476.49866696250007},{"$f":"Calc!M49","v":155.66989677000004},{"$f":"Calc!N49","v":345.98989677000003},{"$f":"Calc!O49","v":578.28989677000004},{"$f":"Calc!P49","v":168.32243916250013},{"$f":"Calc!Q49","v":393.02243916250006},{"$f":"Calc!R49","v":678.34243916250011}]
[{"$f":"Calc!A50","v":"Expert"},{"$f":"Calc!B50","v":"Program Design/Evaluation Specialist"},{"$f":"Calc!D50","v":100.96892935750003},{"$f":"Calc!E50","v":132.44892935750002},{"$f":"Calc!F50","v":169.16892935750005},{"$f":"Calc!G50","v":113.70216188500004},{"$f":"Calc!H50","v":154.10216188500002},{"$f":"Calc!I50","v":204.302161885},{"$f":"Calc!J50","v":143.01321058250002},{"$f":"Calc!K50","v":186.71321058250001},{"$f":"Calc!L50","v":235.39321058250002},{"$f":"Calc!M50","v":182.33957570750007},{"$f":"Calc!N50","v":235.51957570750002},{"$f":"Calc!O50","v":298.29957570750003},{"$f":"Calc!P50","v":182.06599914250006},{"$f":"Calc!Q50","v":247.50599914250006},{"$f":"Calc!R50","v":295.9459991425}]
[{"$f":"Calc!A51","v":"Expert"},{"$f":"Calc!B51","v":"Project Engineer "},{"$f":"Calc!D51","v":124.12891998250004},{"$f":"Calc!E51","v":145.56891998250003},{"$f":"Calc!F51","v":183.06891998250003},{"$f":"Calc!G51","v":143.21430718500005},{"$f":"Calc!H51","v":174.67430718500003},{"$f":"Calc!I51","v":215.31430718500008},{"$f":"Calc!J51","v":167.9729409775},{"$f":"Calc!K51","v":205.75294097750003},{"$f":"Calc!L51","v":252.83294097750002},{"$f":"Calc!M51","v":197.97595386500004},{"$f":"Calc!N51","v":243.69595386500006},{"$f":"Calc!O51","v":300.29595386500012},{"$f":"Calc!P51","v":215.41481770250005},{"$f":"Calc!Q51","v":266.31481770250002},{"$f":"Calc!R51","v":332.55481770250009}]
[{"$f":"Calc!A52","v":"Expert"},{"$f":"Calc!B52","v":"Project Engineer - Construction"},{"$f":"Calc!D52","v":104.66704063000003},{"$f":"Calc!E52","v":133.46704063000001},{"$f":"Calc!F52","v":169.90704063000001},{"$f":"Calc!G52","v":104.66704063000003},{"$f":"Calc!H52","v":133.46704063000001},{"$f":"Calc!I52","v":169.90704063000001},{"$f":"Calc!J52","v":104.66704063000003},{"$f":"Calc!K52","v":133.46704063000001},{"$f":"Calc!L52","v":169.90704063000001},{"$f":"Calc!M52","v":104.66704063000003},{"$f":"Calc!N52","v":133.46704063000001},{"$f":"Calc!O52","v":169.90704063000001},{"$f":"Calc!P52","v":104.66704063000003},{"$f":"Calc!Q52","v":133.46704063000001},{"$f":"Calc!R52","v":169.90704063000001}]
[{"$f":"Calc!A53","v":"Expert"},{"$f":"Calc!B53","v":"Public Policy Analyst"},{"$f":"Calc!D53","v":148.11341719000006},{"$f":"Calc!E53","v":211.05341719000006},{"$f":"Calc!F53","v":278.85341719000002},{"$f":"Calc!G53","v":167.07964076500005},{"$f":"Calc!H53","v":234.03964076500003},{"$f":"Calc!I53","v":310.49964076499998},{"$f":"Calc!J53","v":231.53483588500006},{"$f":"Calc!K53","v":330.43483588500004},{"$f":"Calc!L53","v":437.05483588500005},{"$f":"Calc!M53","v":263.71550933000003},{"$f":"Calc!N53","v":373.19550933000005},{"$f":"Calc!O53","v":493.97550933000002},{"$f":"Calc!P53","v":491.98798290249999},{"$f":"Calc!Q53","v":650.88798290250008},{"$f":"Calc!R53","v":868.70798290250002}]
[{"$f":"Calc!A54","v":"Expert"},{"$f":"Calc!B54","v":"Regulatory Affairs Specialist"},{"$f":"Calc!D54","v":120.30180641250004},{"$f":"Calc!E54","v":158.96180641250001},{"$f":"Calc!F54","v":197.02180641250001},{"$f":"Calc!G54","v":142.28852701000002},{"$f":"Calc!H54","v":202.90852701000003},{"$f":"Calc!I54","v":265.66852701000005},{"$f":"Calc!J54","v":178.72294200750002},{"$f":"Calc!K54","v":226.70294200750004},{"$f":"Calc!L54","v":292.22294200750002},{"$f":"Calc!M54","v":237.51378147000008},{"$f":"Calc!N54","v":283.4337814700001},{"$f":"Calc!O54","v":343.57378147000009},{"$f":"Calc!P54","v":267.45164394750014},{"$f":"Calc!Q54","v":319.15164394750008},{"$f":"Calc!R54","v":386.89164394750009}]
[{"$f":"Calc!A55","v":"Expert"},{"$f":"Calc!B55","v":"Reliability Engineer "},{"$f":"Calc!D55","v":114.34447583000002},{"$f":"Calc!E55","v":140.18447583000003},{"$f":"Calc!F55","v":156.82447583000001},{"$f":"Calc!G55","v":149.49895119750002},{"$f":"Calc!H55","v":169.05895119750002},{"$f":"Calc!I55","v":192.35895119750003},{"$f":"Calc!J55","v":169.96967929500002},{"$f":"Calc!K55","v":202.50967929500004},{"$f":"Calc!L55","v":230.62967929500005},{"$f":"Calc!M55","v":216.42420565750007},{"$f":"Calc!N55","v":249.58420565750004},{"$f":"Calc!O55","v":286.98420565750007},{"$f":"Calc!P55","v":213.24262815500003},{"$f":"Calc!Q55","v":262.88262815500008},{"$f":"Calc!R55","v":300.86262815500004}]
[{"$f":"Calc!A56","v":"Expert"},{"$f":"Calc!B56","v":"Reservoir Engineer "},{"$f":"Calc!D56","v":221.28852907000001},{"$f":"Calc!E56","v":244.80852907000005},{"$f":"Calc!F56","v":298.70852907000005},{"$f":"Calc!G56","v":227.51497331500008},{"$f":"Calc!H56","v":272.45497331500002},{"$f":"Calc!I56","v":330.6149733150001},{"$f":"Calc!J56","v":270.36390324000001},{"$f":"Calc!K56","v":314.54390324000008},{"$f":"Calc!L56","v":395.70390324000005},{"$f":"Calc!M56","v":365.75979993000016},{"$f":"Calc!N56","v":414.33979993000008},{"$f":"Calc!O56","v":454.09979993000007},{"$f":"Calc!P56","v":454.0302396725001},{"$f":"Calc!Q56","v":493.07023967250007},{"$f":"Calc!R56","v":548.25023967250013}]
[{"$f":"Calc!A57","v":"Expert"},{"$f":"Calc!B57","v":"Reservoir Engineering Manager"},{"$f":"Calc!D57","v":194.22452157000001},{"$f":"Calc!E57","v":255.30452157000005},{"$f":"Calc!F57","v":339.58452156999999},{"$f":"Calc!G57","v":225.99088669500009},{"$f":"Calc!H57","v":304.11088669500009},{"$f":"Calc!I57","v":406.41088669500004},{"$f":"Calc!J57","v":269.28387042750001},{"$f":"Calc!K57","v":360.46387042750007},{"$f":"Calc!L57","v":477.98387042750005},{"$f":"Calc!M57","v":318.43000082000009},{"$f":"Calc!N57","v":424.2900008200001},{"$f":"Calc!O57","v":556.27000082000018},{"$f":"Calc!P57","v":359.23357578750006},{"$f":"Calc!Q57","v":481.71357578750008},{"$f":"Calc!R57","v":627.83357578750008}]
[{"$f":"Calc!A58","v":"Expert"},{"$f":"Calc!B58","v":"Sociologist"},{"$f":"Calc!D58","v":84.516609695000028},{"$f":"Calc!E58","v":131.97660969500001},{"$f":"Calc!F58","v":268.076609695},{"$f":"Calc!G58","v":98.088975665000021},{"$f":"Calc!H58","v":157.20897566500003},{"$f":"Calc!I58","v":320.608975665},{"$f":"Calc!J58","v":116.94585084500005},{"$f":"Calc!K58","v":186.34585084500003},{"$f":"Calc!L58","v":377.48585084500007},{"$f":"Calc!M58","v":138.35475527250003},{"$f":"Calc!N58","v":219.33475527250005},{"$f":"Calc!O58","v":440.01475527250005},{"$f":"Calc!P58","v":155.97742206250004},{"$f":"Calc!Q58","v":249.01742206250006},{"$f":"Calc!R58","v":497.03742206250001}]
[{"$f":"Calc!A59","v":"Expert"},{"$f":"Calc!B59","v":"Software Engineer "},{"$f":"Calc!D59","v":105.44550268750001},{"$f":"Calc!E59","v":136.18550268750002},{"$f":"Calc!F59","v":180.36550268750003},{"$f":"Calc!G59","v":139.28189228000002},{"$f":"Calc!H59","v":173.14189228000004},{"$f":"Calc!I59","v":210.34189228000002},{"$f":"Calc!J59","v":175.39347756000006},{"$f":"Calc!K59","v":216.13347756000002},{"$f":"Calc!L59","v":260.09347756000005},{"$f":"Calc!M59","v":216.10890066500008},{"$f":"Calc!N59","v":262.16890066500008},{"$f":"Calc!O59","v":314.12890066500006},{"$f":"Calc!P59","v":233.49598611000005},{"$f":"Calc!Q59","v":288.13598611000003},{"$f":"Calc!R59","v":354.97598611000006}]
[{"$f":"Calc!A60","v":"Expert"},{"$f":"Calc!B60","v":"Statistician "},{"$f":"Calc!D60","v":97.610511547500025},{"$f":"Calc!E60","v":112.59051154750001},{"$f":"Calc!F60","v":128.39051154750001},{"$f":"Calc!G60","v":113.99183088000001},{"$f":"Calc!H60","v":147.11183088000001},{"$f":"Calc!I60","v":199.85183088000002},{"$f":"Calc!J60","v":117.38964705000001},{"$f":"Calc!K60","v":158.06964705000001},{"$f":"Calc!L60","v":196.18964705000002},{"$f":"Calc!M60","v":150.26904747},{"$f":"Calc!N60","v":191.06904747000002},{"$f":"Calc!O60","v":237.72904747000004},{"$f":"Calc!P60","v":203.54308824500004},{"$f":"Calc!Q60","v":245.96308824500005},{"$f":"Calc!R60","v":326.32308824500001}]
[{"$f":"Calc!A61","v":"Expert"},{"$f":"Calc!B61","v":"Structural Engineer "},{"$f":"Calc!D61","v":84.76301232000003},{"$f":"Calc!E61","v":128.30301232000002},{"$f":"Calc!F61","v":143.42301232000005},{"$f":"Calc!G61","v":136.9203684},{"$f":"Calc!H61","v":156.18036840000005},{"$f":"Calc!I61","v":191.20036840000003},{"$f":"Calc!J61","v":149.91928323250005},{"$f":"Calc!K61","v":196.99928323250003},{"$f":"Calc!L61","v":234.67928323250004},{"$f":"Calc!M61","v":166.06064681250004},{"$f":"Calc!N61","v":214.38064681250003},{"$f":"Calc!O61","v":244.14064681250002},{"$f":"Calc!P61","v":193.11130985250006},{"$f":"Calc!Q61","v":249.31130985250005},{"$f":"Calc!R61","v":283.91130985250004}]
[{"$f":"Calc!A62","v":"Expert"},{"$f":"Calc!B62","v":"Systems Engineer "},{"$f":"Calc!D62","v":108.37823350500003},{"$f":"Calc!E62","v":143.43823350500003},{"$f":"Calc!F62","v":173.29823350500004},{"$f":"Calc!G62","v":134.51584512750006},{"$f":"Calc!H62","v":171.95584512750006},{"$f":"Calc!I62","v":211.59584512750004},{"$f":"Calc!J62","v":173.67745018750003},{"$f":"Calc!K62","v":209.65745018750005},{"$f":"Calc!L62","v":252.21745018750005},{"$f":"Calc!M62","v":204.56814341250004},{"$f":"Calc!N62","v":247.12814341250004},{"$f":"Calc!O62","v":295.00814341250003},{"$f":"Calc!P62","v":229.14335053500002},{"$f":"Calc!Q62","v":281.94335053500004},{"$f":"Calc!R62","v":341.30335053500005}]
[{"$f":"Calc!A63","v":"Expert"},{"$f":"Calc!B63","v":"Telecommunications Economist"},{"$f":"Calc!D63","v":116.082942575},{"$f":"Calc!E63","v":136.34294257500002},{"$f":"Calc!F63","v":169.20294257500004},{"$f":"Calc!G63","v":135.23498794500003},{"$f":"Calc!H63","v":162.41498794500004},{"$f":"Calc!I63","v":202.514987945},{"$f":"Calc!J63","v":161.10699844250004},{"$f":"Calc!K63","v":192.50699844250002},{"$f":"Calc!L63","v":238.14699844250001},{"$f":"Calc!M63","v":190.71608866750003},{"$f":"Calc!N63","v":234.17608866750007},{"$f":"Calc!O63","v":279.85608866749999},{"$f":"Calc!P63","v":223.89375128500006},{"$f":"Calc!Q63","v":280.89375128500006},{"$f":"Calc!R63","v":326.61375128500009}]
[{"$f":"Calc!A64","v":"Expert"},{"$f":"Calc!B64","v":"Telecommunications Engineer "},{"$f":"Calc!D64","v":107.71747156500001},{"$f":"Calc!E64","v":134.95747156500005},{"$f":"Calc!F64","v":168.077471565},{"$f":"Calc!G64","v":126.42724255000002},{"$f":"Calc!H64","v":164.36724255000001},{"$f":"Calc!I64","v":203.78724255000003},{"$f":"Calc!J64","v":156.00613188500006},{"$f":"Calc!K64","v":196.08613188500004},{"$f":"Calc!L64","v":238.28613188500003},{"$f":"Calc!M64","v":170.77991037000001},{"$f":"Calc!N64","v":214.99991037000004},{"$f":"Calc!O64","v":252.27991037000001},{"$f":"Calc!P64","v":189.17813300750007},{"$f":"Calc!Q64","v":239.29813300750007},{"$f":"Calc!R64","v":285.99813300750009}]
[{"$f":"Calc!A65","v":"Expert"},{"$f":"Calc!B65","v":"Top Economic Executive"},{"$f":"Calc!D65","v":380.71811518250013},{"$f":"Calc!E65","v":488.15811518250007},{"$f":"Calc!F65","v":564.33811518250013},{"$f":"Calc!G65","v":459.08733289500015},{"$f":"Calc!H65","v":575.32733289500015},{"$f":"Calc!I65","v":681.12733289500011},{"$f":"Calc!J65","v":542.64299954000001},{"$f":"Calc!K65","v":683.58299954000006},{"$f":"Calc!L65","v":799.26299954000012},{"$f":"Calc!M65","v":637.23164785750009},{"$f":"Calc!N65","v":806.29164785750027},{"$f":"Calc!O65","v":928.09164785750022},{"$f":"Calc!P65","v":725.84398776250009},{"$f":"Calc!Q65","v":912.78398776250015},{"$f":"Calc!R65","v":1049.5239877625002}]
[{"$f":"Calc!A66","v":"Expert"},{"$f":"Calc!B66","v":"Urban Planner"},{"$f":"Calc!D66","v":62.693134657500011},{"$f":"Calc!E66","v":69.053134657500024},{"$f":"Calc!F66","v":87.753134657500013},{"$f":"Calc!G66","v":73.097093222500021},{"$f":"Calc!H66","v":82.257093222500018},{"$f":"Calc!I66","v":105.01709322250001},{"$f":"Calc!J66","v":87.057274332500029},{"$f":"Calc!K66","v":97.497274332500027},{"$f":"Calc!L66","v":123.49727433250003},{"$f":"Calc!M66","v":102.90318199500001},{"$f":"Calc!N66","v":114.76318199500002},{"$f":"Calc!O66","v":143.68318199500001},{"$f":"Calc!P66","v":116.157250895},{"$f":"Calc!Q66","v":130.29725089500002},{"$f":"Calc!R66","v":162.157250895}]
[{"$f":"Calc!A67","v":"Expert"},{"$f":"Calc!B67","v":"Utility Rate Analyst"},{"$f":"Calc!D67","v":121.39336413500001},{"$f":"Calc!E67","v":150.95336413500002},{"$f":"Calc!F67","v":174.77336413500001},{"$f":"Calc!G67","v":141.34684751750007},{"$f":"Calc!H67","v":179.80684751750005},{"$f":"Calc!I67","v":209.22684751750006},{"$f":"Calc!J67","v":168.42112771250001},{"$f":"Calc!K67","v":213.12112771250005},{"$f":"Calc!L67","v":245.96112771250003},{"$f":"Calc!M67","v":199.12471674250003},{"$f":"Calc!N67","v":250.86471674250004},{"$f":"Calc!O67","v":286.0447167425001},{"$f":"Calc!P67","v":224.68875648750003},{"$f":"Calc!Q67","v":284.80875648750009},{"$f":"Calc!R67","v":322.72875648750005}]
[{"$f":"Calc!A68","v":"Expert"},{"$f":"Calc!B68","v":"Utility System Planner/Operator/Manager"},{"$f":"Calc!D68","v":111.92184128500003},{"$f":"Calc!E68","v":154.94184128500004},{"$f":"Calc!F68","v":218.44184128500004},{"$f":"Calc!G68","v":144.47148215500002},{"$f":"Calc!H68","v":187.31148215500005},{"$f":"Calc!I68","v":232.99148215500006},{"$f":"Calc!J68","v":177.66605276500005},{"$f":"Calc!K68","v":217.24605276500003},{"$f":"Calc!L68","v":270.00605276500005},{"$f":"Calc!M68","v":197.18966054500004},{"$f":"Calc!N68","v":228.74966054500004},{"$f":"Calc!O68","v":264.46966054500007},{"$f":"Calc!P68","v":217.25997280000007},{"$f":"Calc!Q68","v":261.97997280000004},{"$f":"Calc!R68","v":318.21997280000011}]
[{"$f":"Calc!A69","v":"Expert"},{"$f":"Calc!B69","v":"Wildfire Scientist"},{"$f":"Calc!D69","v":74.676177730000035},{"$f":"Calc!E69","v":109.53617773000002},{"$f":"Calc!F69","v":157.11617773000003},{"$f":"Calc!G69","v":86.755682767500019},{"$f":"Calc!H69","v":130.47568276750002},{"$f":"Calc!I69","v":188.01568276750004},{"$f":"Calc!J69","v":103.42795349500003},{"$f":"Calc!K69","v":154.64795349500002},{"$f":"Calc!L69","v":221.18795349500004},{"$f":"Calc!M69","v":122.33199792750005},{"$f":"Calc!N69","v":182.03199792750004},{"$f":"Calc!O69","v":257.49199792750005},{"$f":"Calc!P69","v":137.96609232500006},{"$f":"Calc!Q69","v":206.66609232500005},{"$f":"Calc!R69","v":290.66609232500002}]
[{"$f":"Calc!A70","v":"Legal"},{"$f":"Calc!B70","v":"Attorney "},{"$f":"Calc!D70","v":174.96888923000003},{"$f":"Calc!E70","v":233.38888923000005},{"$f":"Calc!F70","v":299.46888923000006},{"$f":"Calc!G70","v":215.06966935250006},{"$f":"Calc!H70","v":305.98966935250002},{"$f":"Calc!I70","v":404.22966935250003},{"$f":"Calc!J70","v":309.75797626000008},{"$f":"Calc!K70","v":413.87797626000008},{"$f":"Calc!L70","v":519.4779762600001},{"$f":"Calc!M70","v":381.81318075500008},{"$f":"Calc!N70","v":497.15318075500011},{"$f":"Calc!O70","v":619.29318075500009},{"$f":"Calc!P70","v":486.31150275500011},{"$f":"Calc!Q70","v":606.31150275500011},{"$f":"Calc!R70","v":699.03150275500013}]
[{"$f":"Calc!A71","v":"Legal"},{"$f":"Calc!B71","v":"Legal Director"},{"$f":"Calc!D71","v":286.19189217500008},{"$f":"Calc!E71","v":374.81189217500008},{"$f":"Calc!F71","v":478.35189217500005},{"$f":"Calc!G71","v":333.00803297250008},{"$f":"Calc!H71","v":446.46803297250011},{"$f":"Calc!I71","v":572.50803297250013},{"$f":"Calc!J71","v":396.84694986500006},{"$f":"Calc!K71","v":529.18694986500009},{"$f":"Calc!L71","v":673.24694986500015},{"$f":"Calc!M71","v":469.23517090500013},{"$f":"Calc!N71","v":622.89517090500021},{"$f":"Calc!O71","v":783.35517090500025},{"$f":"Calc!P71","v":529.37898266500019},{"$f":"Calc!Q71","v":707.19898266500013},{"$f":"Calc!R71","v":884.05898266500026}]
[{"$f":"Calc!A72","v":"Legal"},{"$f":"Calc!B72","v":"Paralegal "},{"$f":"Calc!D72","v":88.52663885000004},{"$f":"Calc!E72","v":113.56663885000003},{"$f":"Calc!F72","v":141.48663885000002},{"$f":"Calc!G72","v":102.22717074500002},{"$f":"Calc!H72","v":130.50717074500002},{"$f":"Calc!I72","v":163.18717074500003},{"$f":"Calc!J72","v":122.73537829000003},{"$f":"Calc!K72","v":153.53537829000004},{"$f":"Calc!L72","v":186.55537829000002},{"$f":"Calc!M72","v":139.11161695750008},{"$f":"Calc!N72","v":177.79161695750003},{"$f":"Calc!O72","v":218.51161695750005},{"$f":"Calc!P72","v":154.50110690250006},{"$f":"Calc!Q72","v":197.46110690250003},{"$f":"Calc!R72","v":242.70110690250004}]
[{"$f":"Calc!A73","v":"Legal"},{"$f":"Calc!B73","v":"Paralegal Manager"},{"$f":"Calc!D73","v":114.04392518500003},{"$f":"Calc!E73","v":149.483925185},{"$f":"Calc!F73","v":199.423925185},{"$f":"Calc!G73","v":132.70451276250003},{"$f":"Calc!H73","v":178.06451276250004},{"$f":"Calc!I73","v":238.64451276250003},{"$f":"Calc!J73","v":158.13341719000005},{"$f":"Calc!K73","v":211.05341719000006},{"$f":"Calc!L73","v":280.69341719000005},{"$f":"Calc!M73","v":186.99915049000003},{"$f":"Calc!N73","v":248.41915049000005},{"$f":"Calc!O73","v":326.65915049000006},{"$f":"Calc!P73","v":210.95781446750004},{"$f":"Calc!Q73","v":282.03781446750003},{"$f":"Calc!R73","v":368.69781446750011}]
[{"$f":"Calc!A74","v":"Legal"},{"$f":"Calc!B74","v":"Paralegal Supervisor"},{"$f":"Calc!D74","v":97.370857645000029},{"$f":"Calc!E74","v":120.85085764500002},{"$f":"Calc!F74","v":194.95085764500001},{"$f":"Calc!G74","v":113.37253713750002},{"$f":"Calc!H74","v":143.95253713750003},{"$f":"Calc!I74","v":233.2325371375},{"$f":"Calc!J74","v":135.10285408000004},{"$f":"Calc!K74","v":170.62285408000002},{"$f":"Calc!L74","v":274.46285408},{"$f":"Calc!M74","v":159.72081648750003},{"$f":"Calc!N74","v":200.84081648750004},{"$f":"Calc!O74","v":319.66081648750003},{"$f":"Calc!P74","v":180.23494107000002},{"$f":"Calc!Q74","v":228.01494107000005},{"$f":"Calc!R74","v":360.95494107000002}]
[{"$f":"Calc!A75","v":"School"},{"$f":"Calc!B75","v":"Assistant School Principal"},{"$f":"Calc!D75","v":65.003235617500025},{"$f":"Calc!E75","v":84.503235617500025},{"$f":"Calc!F75","v":112.00323561750002},{"$f":"Calc!G75","v":75.656568075000024},{"$f":"Calc!H75","v":100.65656807500002},{"$f":"Calc!I75","v":134.03656807500002},{"$f":"Calc!J75","v":90.147946747500029},{"$f":"Calc!K75","v":119.30794674750003},{"$f":"Calc!L75","v":157.64794674750004},{"$f":"Calc!M75","v":106.59637965000002},{"$f":"Calc!N75","v":140.43637965000005},{"$f":"Calc!O75","v":183.45637965000003},{"$f":"Calc!P75","v":120.274126075},{"$f":"Calc!Q75","v":159.43412607500002},{"$f":"Calc!R75","v":207.05412607500003}]
[{"$f":"Calc!A76","v":"School"},{"$f":"Calc!B76","v":"Public School Teacher"},{"$f":"Calc!D76","v":44.078199200000014},{"$f":"Calc!E76","v":57.09819920000001},{"$f":"Calc!F76","v":74.158199200000013},{"$f":"Calc!G76","v":51.294031400000009},{"$f":"Calc!H76","v":68.014031400000007},{"$f":"Calc!I76","v":88.734031400000006},{"$f":"Calc!J76","v":61.099718392500009},{"$f":"Calc!K76","v":80.619718392500019},{"$f":"Calc!L76","v":104.35971839250003},{"$f":"Calc!M76","v":72.254268192500035},{"$f":"Calc!N76","v":94.894268192500022},{"$f":"Calc!O76","v":121.43426819250004},{"$f":"Calc!P76","v":81.521363012500032},{"$f":"Calc!Q76","v":107.74136301250003},{"$f":"Calc!R76","v":137.06136301250001}]
[{"$f":"Calc!A77","v":"School"},{"$f":"Calc!B77","v":"School Principal"},{"$f":"Calc!D77","v":80.792535077500006},{"$f":"Calc!E77","v":102.05253507750002},{"$f":"Calc!F77","v":126.77253507750002},{"$f":"Calc!G77","v":94.035081127500035},{"$f":"Calc!H77","v":121.57508112750003},{"$f":"Calc!I77","v":151.73508112750002},{"$f":"Calc!J77","v":112.03948103250005},{"$f":"Calc!K77","v":144.09948103250002},{"$f":"Calc!L77","v":178.41948103250002},{"$f":"Calc!M77","v":132.48474280750003},{"$f":"Calc!N77","v":169.60474280750003},{"$f":"Calc!O77","v":207.56474280750001},{"$f":"Calc!P77","v":149.47947840500001},{"$f":"Calc!Q77","v":192.55947840500005},{"$f":"Calc!R77","v":234.23947840500006}]
[{"$f":"Calc!A78","v":"School"},{"$f":"Calc!B78","v":"School Superintendent"},{"$f":"Calc!D78","v":99.912532450000015},{"$f":"Calc!E78","v":150.51253245000004},{"$f":"Calc!F78","v":210.41253245000001},{"$f":"Calc!G78","v":116.04204789250002},{"$f":"Calc!H78","v":179.28204789250003},{"$f":"Calc!I78","v":251.78204789250003},{"$f":"Calc!J78","v":138.34186415500002},{"$f":"Calc!K78","v":212.50186415500005},{"$f":"Calc!L78","v":296.18186415500008},{"$f":"Calc!M78","v":163.64999726750003},{"$f":"Calc!N78","v":250.12999726750004},{"$f":"Calc!O78","v":344.7699972675},{"$f":"Calc!P78","v":184.5195730800001},{"$f":"Calc!Q78","v":283.97957308000008},{"$f":"Calc!R78","v":389.15957308000003}]

{"sheet":"Escalation","index":4,"n_rows":13,"n_cols":2,"rows_kept":13,"cut":false,"hidden":false,"merged":[]}
["To:","Escalation"]
["1/1/2019 thru 12/31/2019",2.35E-2]
["1/1/2020 thru 12/31/2020",2.5499999999999998E-2]
["1/1/2021 thru 12/31/2021",0]
["1/1/2022 thru 12/31/2022",3.3099999999999997E-2]
["1/1/2023 thru 12/31/2023",4.4600000000000001E-2]
["1/1/2024 thru 12/31/2024",4.07E-2]
["1/1/2025 thru 12/31/2025",3.4599999999999999E-2]
["1/1/2026 thru 12/31/2026"]
["1/1/2027 thru 12/31/2027"]
["1/1/2028 thru 12/31/2028"]
["1/1/2029 thru 12/31/2029"]
["1/1/2030 thru 12/31/2030"]

{"sheet":"Calc","index":5,"n_rows":78,"n_cols":18,"rows_kept":78,"cut":false,"hidden":true,"merged":[]}
["Category","CPUC Role","Description","Min 1","Med 1","Max 1","Min 2","Med 2","Max 2","Min 3","Med 3","Max 3","Min 4","Med 4","Max 4","Min 5","Med 5","Max 5"]
[{"$f":"Config_RawLabor!A2","v":"Advocate"},{"$f":"Config_RawLabor!B2","v":"Administrative Analyst"},{"$f":"Config_RawLabor!C2","v":"Assist in the planning, development and management of a comprehensive  program within the eight county service area. Assist in the administration and development of specific programs and projects. Specific areas of focus include human resources, information systems, or grant writing. Represent orgination to community groups, partners, and funders. Coordinate community events, public relations activities. "},{"$f":"E2-((Calc_Raw!E2-Calc_Raw!D2)*2)","v":45.592377405000008},{"$f":"Calc_Raw!E2*Escalation","v":54.012377405000009},{"$f":"E2+((Calc_Raw!F2-Calc_Raw!E2)*2)","v":65.452377405000007},{"$f":"H2-((Calc_Raw!H2-Calc_Raw!G2)*2)","v":53.120434025000009},{"$f":"Calc_Raw!H2*Escalation","v":64.340434025000008},{"$f":"H2+((Calc_Raw!I2-Calc_Raw!H2)*2)","v":78.340434025000008},{"$f":"K2-((Calc_Raw!K2-Calc_Raw!J2)*2)","v":63.283881505000025},{"$f":"Calc_Raw!K2*Escalation","v":76.263881505000015},{"$f":"K2+((Calc_Raw!L2-Calc_Raw!K2)*2)","v":92.103881505000018},{"$f":"N2-((Calc_Raw!N2-Calc_Raw!M2)*2)","v":74.82172786000001},{"$f":"Calc_Raw!N2*Escalation","v":89.761727860000008},{"$f":"N2+((Calc_Raw!O2-Calc_Raw!N2)*2)","v":107.14172786},{"$f":"Q2-((Calc_Raw!Q2-Calc_Raw!P2)*2)","v":84.416087175000015},{"$f":"Calc_Raw!Q2*Escalation","v":101.91608717500002},{"$f":"Q2+((Calc_Raw!R2-Calc_Raw!Q2)*2)","v":120.89608717500003}]
[{"$f":"Config_RawLabor!A3","v":"Advocate"},{"$f":"Config_RawLabor!B3","v":"Advocate - Not Otherwise Classified"},{"$f":"Config_RawLabor!C3","v":"Used for advocate roles that are not better classified as one of the more detailed roles, including for example consumer advocates. May also be used for advocates that fill multiple subroles."},{"$f":"E3-((Calc_Raw!E3-Calc_Raw!D3)*2)","v":59.864708502500008},{"$f":"Calc_Raw!E3*Escalation","v":83.264708502500014},{"$f":"E3+((Calc_Raw!F3-Calc_Raw!E3)*2)","v":113.50470850250002},{"$f":"H3-((Calc_Raw!H3-Calc_Raw!G3)*2)","v":69.19736957500001},{"$f":"Calc_Raw!H3*Escalation","v":98.557369575000024},{"$f":"H3+((Calc_Raw!I3-Calc_Raw!H3)*2)","v":134.93736957500002},{"$f":"K3-((Calc_Raw!K3-Calc_Raw!J3)*2)","v":82.764780307500018},{"$f":"Calc_Raw!K3*Escalation","v":117.12478030750003},{"$f":"K3+((Calc_Raw!L3-Calc_Raw!K3)*2)","v":158.92478030750004},{"$f":"N3-((Calc_Raw!N3-Calc_Raw!M3)*2)","v":97.631389540000043},{"$f":"Calc_Raw!N3*Escalation","v":137.79138954000004},{"$f":"N3+((Calc_Raw!O3-Calc_Raw!N3)*2)","v":185.17138954000004},{"$f":"Q3-((Calc_Raw!Q3-Calc_Raw!P3)*2)","v":109.98888042250002},{"$f":"Calc_Raw!Q3*Escalation","v":156.14888042250004},{"$f":"Q3+((Calc_Raw!R3-Calc_Raw!Q3)*2)","v":208.76888042250005}]
[{"$f":"Config_RawLabor!A4","v":"Advocate"},{"$f":"Config_RawLabor!B4","v":"Community Development Manager"},{"$f":"Config_RawLabor!C4","v":"Responsible for the supervision, support, and training of staff within a specific program, and for providing operational and program support to the program director. Meets program and organizational goals. Model and support organization's values."},{"$f":"E4-((Calc_Raw!E4-Calc_Raw!D4)*2)","v":55.361386450000012},{"$f":"Calc_Raw!E4*Escalation","v":74.941386450000024},{"$f":"E4+((Calc_Raw!F4-Calc_Raw!E4)*2)","v":96.981386450000016},{"$f":"H4-((Calc_Raw!H4-Calc_Raw!G4)*2)","v":64.388416212500019},{"$f":"Calc_Raw!H4*Escalation","v":89.268416212500014},{"$f":"H4+((Calc_Raw!I4-Calc_Raw!H4)*2)","v":116.06841621250003},{"$f":"K4-((Calc_Raw!K4-Calc_Raw!J4)*2)","v":76.739604400000019},{"$f":"Calc_Raw!K4*Escalation","v":105.79960440000002},{"$f":"K4+((Calc_Raw!L4-Calc_Raw!K4)*2)","v":136.51960440000002},{"$f":"N4-((Calc_Raw!N4-Calc_Raw!M4)*2)","v":90.75495101250003},{"$f":"Calc_Raw!N4*Escalation","v":124.53495101250003},{"$f":"N4+((Calc_Raw!O4-Calc_Raw!N4)*2)","v":158.85495101250001},{"$f":"Q4-((Calc_Raw!Q4-Calc_Raw!P4)*2)","v":102.37151496750002},{"$f":"Calc_Raw!Q4*Escalation","v":141.39151496750003},{"$f":"Q4+((Calc_Raw!R4-Calc_Raw!Q4)*2)","v":179.27151496750002}]
[{"$f":"Config_RawLabor!A5","v":"Advocate"},{"$f":"Config_RawLabor!B5","v":"Community Development Program Director"},{"$f":"Config_RawLabor!C5","v":"A senior management position which provides leadership and management to one or more programs and participates in the overall management of (non-profit) organization. Coordinate, plan and develop comprehensive programs for implementing the organization's goals. On-going in-depth review and analysis of program operations, community needs and program resources. Represents the organization to community, agencies, the media, and participants. "},{"$f":"E5-((Calc_Raw!E5-Calc_Raw!D5)*2)","v":79.941653427500015},{"$f":"Calc_Raw!E5*Escalation","v":104.36165342750003},{"$f":"E5+((Calc_Raw!F5-Calc_Raw!E5)*2)","v":132.9416534275},{"$f":"H5-((Calc_Raw!H5-Calc_Raw!G5)*2)","v":93.014535170000045},{"$f":"Calc_Raw!H5*Escalation","v":124.31453517000003},{"$f":"H5+((Calc_Raw!I5-Calc_Raw!H5)*2)","v":159.11453517000004},{"$f":"K5-((Calc_Raw!K5-Calc_Raw!J5)*2)","v":110.83323870750004},{"$f":"Calc_Raw!K5*Escalation","v":147.35323870750003},{"$f":"K5+((Calc_Raw!L5-Calc_Raw!K5)*2)","v":187.09323870750003},{"$f":"N5-((Calc_Raw!N5-Calc_Raw!M5)*2)","v":131.06627606250004},{"$f":"Calc_Raw!N5*Escalation","v":173.44627606250003},{"$f":"N5+((Calc_Raw!O5-Calc_Raw!N5)*2)","v":217.68627606250004},{"$f":"Q5-((Calc_Raw!Q5-Calc_Raw!P5)*2)","v":147.87531529250003},{"$f":"Calc_Raw!Q5*Escalation","v":196.91531529250005},{"$f":"Q5+((Calc_Raw!R5-Calc_Raw!Q5)*2)","v":245.67531529250004}]
[{"$f":"Config_RawLabor!A6","v":"Advocate"},{"$f":"Config_RawLabor!B6","v":"Community Development Senior Specialist"},{"$f":"Config_RawLabor!C6","v":"Work closely with low-income, rural residents to assist them in the development and management of community facilities. Perform advocacy and technical assistance role regarding the needs of rural, low income people for safe and affordable water, waste water and energyfacilities. Responsible for multiple community development projects. Can include organizing, research, loan and grant writing. In addition, the SR CD Specialist provides leadership and support to CD staff, serves as a resource for other staff and effectively and positively represents the organization to staff, participants and the community "},{"$f":"E6-((Calc_Raw!E6-Calc_Raw!D6)*2)","v":55.27218898000001},{"$f":"Calc_Raw!E6*Escalation","v":93.79218898000002},{"$f":"E6+((Calc_Raw!F6-Calc_Raw!E6)*2)","v":132.15218898000003},{"$f":"H6-((Calc_Raw!H6-Calc_Raw!G6)*2)","v":64.049840162500018},{"$f":"Calc_Raw!H6*Escalation","v":111.72984016250003},{"$f":"H6+((Calc_Raw!I6-Calc_Raw!H6)*2)","v":158.12984016250005},{"$f":"K6-((Calc_Raw!K6-Calc_Raw!J6)*2)","v":76.407937372500015},{"$f":"Calc_Raw!K6*Escalation","v":132.42793737250003},{"$f":"K6+((Calc_Raw!L6-Calc_Raw!K6)*2)","v":186.00793737250004},{"$f":"N6-((Calc_Raw!N6-Calc_Raw!M6)*2)","v":90.415984617500044},{"$f":"Calc_Raw!N6*Escalation","v":155.87598461750002},{"$f":"N6+((Calc_Raw!O6-Calc_Raw!N6)*2)","v":216.53598461750005},{"$f":"Q6-((Calc_Raw!Q6-Calc_Raw!P6)*2)","v":101.89292954250001},{"$f":"Calc_Raw!Q6*Escalation","v":176.97292954250005},{"$f":"Q6+((Calc_Raw!R6-Calc_Raw!Q6)*2)","v":244.43292954250003}]
[{"$f":"Config_RawLabor!A7","v":"Advocate"},{"$f":"Config_RawLabor!B7","v":"Community Development Specialist"},{"$f":"Config_RawLabor!C7","v":"Work closely with low-income, rural residents to assist them in the development and management of community facilities. Perform advocacy and technical assistance role regarding the needs of rural, low income people for safe and affordable water,waste water and energy facilities. Responsible for multiple community development projects. Can include organizing, research, loan and grant writing. "},{"$f":"E7-((Calc_Raw!E7-Calc_Raw!D7)*2)","v":31.831840822500013},{"$f":"Calc_Raw!E7*Escalation","v":43.63184082250001},{"$f":"E7+((Calc_Raw!F7-Calc_Raw!E7)*2)","v":56.651840822500006},{"$f":"H7-((Calc_Raw!H7-Calc_Raw!G7)*2)","v":37.016154860000007},{"$f":"Calc_Raw!H7*Escalation","v":51.976154860000015},{"$f":"H7+((Calc_Raw!I7-Calc_Raw!H7)*2)","v":67.816154860000012},{"$f":"K7-((Calc_Raw!K7-Calc_Raw!J7)*2)","v":44.140979982500014},{"$f":"Calc_Raw!K7*Escalation","v":61.600979982500007},{"$f":"K7+((Calc_Raw!L7-Calc_Raw!K7)*2)","v":79.740979982500022},{"$f":"N7-((Calc_Raw!N7-Calc_Raw!M7)*2)","v":52.186316190000014},{"$f":"Calc_Raw!N7*Escalation","v":72.506316190000007},{"$f":"N7+((Calc_Raw!O7-Calc_Raw!N7)*2)","v":92.806316190000018},{"$f":"Q7-((Calc_Raw!Q7-Calc_Raw!P7)*2)","v":58.88006917749999},{"$f":"Calc_Raw!Q7*Escalation","v":82.320069177500017},{"$f":"Q7+((Calc_Raw!R7-Calc_Raw!Q7)*2)","v":104.7400691775}]
[{"$f":"Config_RawLabor!A8","v":"Advocate"},{"$f":"Config_RawLabor!B8","v":"Executive Director"},{"$f":"Config_RawLabor!C8","v":"Provides overall direction and guidance to a non-profit organization's programs. Responsible for the success of special events, community outreach initiatives, and fundraising activities. Acts as a spokesperson and represents the organization's programs to the public. Assesses needs and ensures that program objectives are met, initiates changes to maintain member satisfaction and engagement. "},{"$f":"E8-((Calc_Raw!E8-Calc_Raw!D8)*2)","v":91.637652675000027},{"$f":"Calc_Raw!E8*Escalation","v":150.19765267500003},{"$f":"E8+((Calc_Raw!F8-Calc_Raw!E8)*2)","v":238.93765267500004},{"$f":"H8-((Calc_Raw!H8-Calc_Raw!G8)*2)","v":106.29468815500005},{"$f":"Calc_Raw!H8*Escalation","v":178.91468815500005},{"$f":"H8+((Calc_Raw!I8-Calc_Raw!H8)*2)","v":285.87468815500006},{"$f":"K8-((Calc_Raw!K8-Calc_Raw!J8)*2)","v":126.76103247000003},{"$f":"Calc_Raw!K8*Escalation","v":212.06103247000004},{"$f":"K8+((Calc_Raw!L8-Calc_Raw!K8)*2)","v":336.38103247000004},{"$f":"N8-((Calc_Raw!N8-Calc_Raw!M8)*2)","v":149.97569363500006},{"$f":"Calc_Raw!N8*Escalation","v":249.61569363500004},{"$f":"N8+((Calc_Raw!O8-Calc_Raw!N8)*2)","v":391.77569363500004},{"$f":"Q8-((Calc_Raw!Q8-Calc_Raw!P8)*2)","v":169.05179750000008},{"$f":"Calc_Raw!Q8*Escalation","v":283.39179750000005},{"$f":"Q8+((Calc_Raw!R8-Calc_Raw!Q8)*2)","v":442.37179750000007}]
[{"$f":"Config_RawLabor!A9","v":"Advocate"},{"$f":"Config_RawLabor!B9","v":"Housing Program Manager"},{"$f":"Config_RawLabor!C9","v":"Oversees operations of a housing program. Sets budget and policies, hires and trains staff, and oversees occupancy eligibility/operations. Develops and provides reports or documentation needed to secure/maintain funding or grants. May lead the work of others. "},{"$f":"E9-((Calc_Raw!E9-Calc_Raw!D9)*2)","v":21.892221792500003},{"$f":"Calc_Raw!E9*Escalation","v":47.872221792500007},{"$f":"E9+((Calc_Raw!F9-Calc_Raw!E9)*2)","v":76.852221792500018},{"$f":"H9-((Calc_Raw!H9-Calc_Raw!G9)*2)","v":25.235223245},{"$f":"Calc_Raw!H9*Escalation","v":57.035223245000012},{"$f":"H9+((Calc_Raw!I9-Calc_Raw!H9)*2)","v":91.935223245000017},{"$f":"K9-((Calc_Raw!K9-Calc_Raw!J9)*2)","v":30.154191700000013},{"$f":"Calc_Raw!K9*Escalation","v":67.594191700000025},{"$f":"K9+((Calc_Raw!L9-Calc_Raw!K9)*2)","v":108.19419170000002},{"$f":"N9-((Calc_Raw!N9-Calc_Raw!M9)*2)","v":35.71011914250002},{"$f":"Calc_Raw!N9*Escalation","v":79.570119142500019},{"$f":"N9+((Calc_Raw!O9-Calc_Raw!N9)*2)","v":126.01011914250002},{"$f":"Q9-((Calc_Raw!Q9-Calc_Raw!P9)*2)","v":40.179007447500027},{"$f":"Calc_Raw!Q9*Escalation","v":90.339007447500009},{"$f":"Q9+((Calc_Raw!R9-Calc_Raw!Q9)*2)","v":142.27900744750002}]
[{"$f":"Config_RawLabor!A10","v":"Advocate"},{"$f":"Config_RawLabor!B10","v":"Program Coordinator"},{"$f":"Config_RawLabor!C10","v":"Plans and coordinates one or more programs for a non-profit organization, including fundraising, budgeting, and community outreach. Develops and implements programs that align with the organization's mission and support the organization's goals. Creates program materials, establishes staffing requirements, and ensures that program achieves stated objectives. May be responsible for special events that publicize the organization and its programs to the community. "},{"$f":"E10-((Calc_Raw!E10-Calc_Raw!D10)*2)","v":55.477132782500007},{"$f":"Calc_Raw!E10*Escalation","v":71.677132782500024},{"$f":"E10+((Calc_Raw!F10-Calc_Raw!E10)*2)","v":93.437132782500015},{"$f":"H10-((Calc_Raw!H10-Calc_Raw!G10)*2)","v":64.574402995000014},{"$f":"Calc_Raw!H10*Escalation","v":85.374402995000025},{"$f":"H10+((Calc_Raw!I10-Calc_Raw!H10)*2)","v":111.81440299500002},{"$f":"K10-((Calc_Raw!K10-Calc_Raw!J10)*2)","v":76.951863692500041},{"$f":"Calc_Raw!K10*Escalation","v":101.19186369250002},{"$f":"K10+((Calc_Raw!L10-Calc_Raw!K10)*2)","v":131.51186369250001},{"$f":"N10-((Calc_Raw!N10-Calc_Raw!M10)*2)","v":90.988522890000027},{"$f":"Calc_Raw!N10*Escalation","v":119.10852289000003},{"$f":"N10+((Calc_Raw!O10-Calc_Raw!N10)*2)","v":153.02852289000003},{"$f":"Q10-((Calc_Raw!Q10-Calc_Raw!P10)*2)","v":102.65036737000003},{"$f":"Calc_Raw!Q10*Escalation","v":135.23036737000004},{"$f":"Q10+((Calc_Raw!R10-Calc_Raw!Q10)*2)","v":172.71036737000006}]
[{"$f":"Config_RawLabor!A11","v":"Advocate"},{"$f":"Config_RawLabor!B11","v":"Program Manager"},{"$f":"Config_RawLabor!C11","v":"Manages a team that coordinates programs for a non-profit organization. Designs programs that align with the organization's mission and support the organization's goals. Establishes fundraising and development goals, identifies potential donors or sources of funding, and plans outreach strategies. Schedules and forecasts planning for special events that publicize the organization and its programs to the community. May assist in the development of grants applications or proposals. "},{"$f":"E11-((Calc_Raw!E11-Calc_Raw!D11)*2)","v":86.328090925000041},{"$f":"Calc_Raw!E11*Escalation","v":96.668090925000016},{"$f":"E11+((Calc_Raw!F11-Calc_Raw!E11)*2)","v":119.46809092500003},{"$f":"H11-((Calc_Raw!H11-Calc_Raw!G11)*2)","v":100.63153371750003},{"$f":"Calc_Raw!H11*Escalation","v":115.15153371750002},{"$f":"H11+((Calc_Raw!I11-Calc_Raw!H11)*2)","v":142.99153371750003},{"$f":"K11-((Calc_Raw!K11-Calc_Raw!J11)*2)","v":119.87939047750004},{"$f":"Calc_Raw!K11*Escalation","v":136.47939047750003},{"$f":"K11+((Calc_Raw!L11-Calc_Raw!K11)*2)","v":168.15939047750004},{"$f":"N11-((Calc_Raw!N11-Calc_Raw!M11)*2)","v":141.69166120500006},{"$f":"Calc_Raw!N11*Escalation","v":160.65166120500004},{"$f":"N11+((Calc_Raw!O11-Calc_Raw!N11)*2)","v":195.61166120500002},{"$f":"Q11-((Calc_Raw!Q11-Calc_Raw!P11)*2)","v":159.92886167250001},{"$f":"Calc_Raw!Q11*Escalation","v":182.38886167250004},{"$f":"Q11+((Calc_Raw!R11-Calc_Raw!Q11)*2)","v":220.7488616725}]
[{"$f":"Config_RawLabor!A12","v":"Expert"},{"$f":"Config_RawLabor!B12","v":"Accountant"},{"$f":"Config_RawLabor!C12","v":"Prepares complex balance sheets, profit and loss statements and other financial reports. Analyzes current costs, revenues, financial commitments, and obligations incurred to predict future revenues and expenses. "},{"$f":"E12-((Calc_Raw!E12-Calc_Raw!D12)*2)","v":88.960531327500021},{"$f":"Calc_Raw!E12*Escalation","v":107.30053132750002},{"$f":"E12+((Calc_Raw!F12-Calc_Raw!E12)*2)","v":127.9805313275},{"$f":"H12-((Calc_Raw!H12-Calc_Raw!G12)*2)","v":103.43075771500003},{"$f":"Calc_Raw!H12*Escalation","v":126.35075771500001},{"$f":"H12+((Calc_Raw!I12-Calc_Raw!H12)*2)","v":151.550757715},{"$f":"K12-((Calc_Raw!K12-Calc_Raw!J12)*2)","v":128.69351974750003},{"$f":"Calc_Raw!K12*Escalation","v":157.09351974750001},{"$f":"K12+((Calc_Raw!L12-Calc_Raw!K12)*2)","v":189.57351974750003},{"$f":"N12-((Calc_Raw!N12-Calc_Raw!M12)*2)","v":160.28245436},{"$f":"Calc_Raw!N12*Escalation","v":192.62245436000003},{"$f":"N12+((Calc_Raw!O12-Calc_Raw!N12)*2)","v":228.60245436},{"$f":"Q12-((Calc_Raw!Q12-Calc_Raw!P12)*2)","v":180.61811688500006},{"$f":"Calc_Raw!Q12*Escalation","v":217.07811688500004},{"$f":"Q12+((Calc_Raw!R12-Calc_Raw!Q12)*2)","v":257.61811688500006}]
[{"$f":"Config_RawLabor!A13","v":"Expert"},{"$f":"Config_RawLabor!B13","v":"Biologist"},{"$f":"Config_RawLabor!C13","v":"Analyzes specific regional environments as well as the organisms and wildlife that inhabit those locations. Aids in the protection and survival of wildlife within any given ecosystem, and assesses the impact of human activity on the environment."},{"$f":"E13-((Calc_Raw!E13-Calc_Raw!D13)*2)","v":85.822069270000028},{"$f":"Calc_Raw!E13*Escalation","v":104.58206927000002},{"$f":"E13+((Calc_Raw!F13-Calc_Raw!E13)*2)","v":130.30206927},{"$f":"H13-((Calc_Raw!H13-Calc_Raw!G13)*2)","v":91.104329592500022},{"$f":"Calc_Raw!H13*Escalation","v":120.92432959250002},{"$f":"H13+((Calc_Raw!I13-Calc_Raw!H13)*2)","v":151.20432959250002},{"$f":"K13-((Calc_Raw!K13-Calc_Raw!J13)*2)","v":109.81621466250004},{"$f":"Calc_Raw!K13*Escalation","v":147.41621466250001},{"$f":"K13+((Calc_Raw!L13-Calc_Raw!K13)*2)","v":196.41621466250001},{"$f":"N13-((Calc_Raw!N13-Calc_Raw!M13)*2)","v":153.83440917500002},{"$f":"Calc_Raw!N13*Escalation","v":211.07440917500003},{"$f":"N13+((Calc_Raw!O13-Calc_Raw!N13)*2)","v":278.59440917500007},{"$f":"Q13-((Calc_Raw!Q13-Calc_Raw!P13)*2)","v":161.62339741000002},{"$f":"Calc_Raw!Q13*Escalation","v":216.34339741000005},{"$f":"Q13+((Calc_Raw!R13-Calc_Raw!Q13)*2)","v":256.30339741}]
[{"$f":"Config_RawLabor!A14","v":"Expert"},{"$f":"Config_RawLabor!B14","v":"Certified Depreciation Professional"},{"$f":"Config_RawLabor!C14","v":"Specialist in calculating depreciation."},{"$f":"E14-((Calc_Raw!E14-Calc_Raw!D14)*2)","v":99.301033037500019},{"$f":"Calc_Raw!E14*Escalation","v":121.70103303750003},{"$f":"E14+((Calc_Raw!F14-Calc_Raw!E14)*2)","v":144.82103303750003},{"$f":"H14-((Calc_Raw!H14-Calc_Raw!G14)*2)","v":119.67740182000003},{"$f":"Calc_Raw!H14*Escalation","v":142.99740182000005},{"$f":"H14+((Calc_Raw!I14-Calc_Raw!H14)*2)","v":171.27740182000002},{"$f":"K14-((Calc_Raw!K14-Calc_Raw!J14)*2)","v":139.68861550500003},{"$f":"Calc_Raw!K14*Escalation","v":168.62861550500003},{"$f":"K14+((Calc_Raw!L14-Calc_Raw!K14)*2)","v":199.18861550500003},{"$f":"N14-((Calc_Raw!N14-Calc_Raw!M14)*2)","v":168.00001498750004},{"$f":"Calc_Raw!N14*Escalation","v":202.94001498750004},{"$f":"N14+((Calc_Raw!O14-Calc_Raw!N14)*2)","v":247.58001498750002},{"$f":"Q14-((Calc_Raw!Q14-Calc_Raw!P14)*2)","v":190.20777181750003},{"$f":"Calc_Raw!Q14*Escalation","v":229.76777181750003},{"$f":"Q14+((Calc_Raw!R14-Calc_Raw!Q14)*2)","v":280.32777181750004}]
[{"$f":"Config_RawLabor!A15","v":"Expert"},{"$f":"Config_RawLabor!B15","v":"Chemical Engineer"},{"$f":"Config_RawLabor!C15","v":"Analyzes processes for the transport and storage of chemicals, including gases. "},{"$f":"E15-((Calc_Raw!E15-Calc_Raw!D15)*2)","v":127.99397046250004},{"$f":"Calc_Raw!E15*Escalation","v":153.29397046250006},{"$f":"E15+((Calc_Raw!F15-Calc_Raw!E15)*2)","v":184.09397046250001},{"$f":"H15-((Calc_Raw!H15-Calc_Raw!G15)*2)","v":142.95837036750007},{"$f":"Calc_Raw!H15*Escalation","v":175.81837036750002},{"$f":"H15+((Calc_Raw!I15-Calc_Raw!H15)*2)","v":214.33837036750006},{"$f":"K15-((Calc_Raw!K15-Calc_Raw!J15)*2)","v":163.74794618000007},{"$f":"Calc_Raw!K15*Escalation","v":209.66794618000003},{"$f":"K15+((Calc_Raw!L15-Calc_Raw!K15)*2)","v":258.38794618000009},{"$f":"N15-((Calc_Raw!N15-Calc_Raw!M15)*2)","v":208.73277805000006},{"$f":"Calc_Raw!N15*Escalation","v":254.63277805000004},{"$f":"N15+((Calc_Raw!O15-Calc_Raw!N15)*2)","v":313.47277804999999},{"$f":"Q15-((Calc_Raw!Q15-Calc_Raw!P15)*2)","v":225.61225290250002},{"$f":"Calc_Raw!Q15*Escalation","v":273.03225290250003},{"$f":"Q15+((Calc_Raw!R15-Calc_Raw!Q15)*2)","v":319.5722529025}]
[{"$f":"Config_RawLabor!A16","v":"Expert"},{"$f":"Config_RawLabor!B16","v":"Civil Engineer"},{"$f":"Config_RawLabor!C16","v":"Analyzes construction projects such as channels, dams, and roads. Responsibilities also include estimating costs, personnel, material and schedule needs."},{"$f":"E16-((Calc_Raw!E16-Calc_Raw!D16)*2)","v":114.01359886750004},{"$f":"Calc_Raw!E16*Escalation","v":135.93359886750002},{"$f":"E16+((Calc_Raw!F16-Calc_Raw!E16)*2)","v":169.25359886750002},{"$f":"H16-((Calc_Raw!H16-Calc_Raw!G16)*2)","v":133.14404123750003},{"$f":"Calc_Raw!H16*Escalation","v":166.20404123750004},{"$f":"H16+((Calc_Raw!I16-Calc_Raw!H16)*2)","v":202.52404123750003},{"$f":"K16-((Calc_Raw!K16-Calc_Raw!J16)*2)","v":160.11611210500001},{"$f":"Calc_Raw!K16*Escalation","v":201.37611210500006},{"$f":"K16+((Calc_Raw!L16-Calc_Raw!K16)*2)","v":249.91611210500002},{"$f":"N16-((Calc_Raw!N16-Calc_Raw!M16)*2)","v":166.82224981250002},{"$f":"Calc_Raw!N16*Escalation","v":210.18224981250003},{"$f":"N16+((Calc_Raw!O16-Calc_Raw!N16)*2)","v":259.36224981250007},{"$f":"Q16-((Calc_Raw!Q16-Calc_Raw!P16)*2)","v":195.15246213750007},{"$f":"Calc_Raw!Q16*Escalation","v":248.91246213750006},{"$f":"Q16+((Calc_Raw!R16-Calc_Raw!Q16)*2)","v":306.93246213750012}]
[{"$f":"Config_RawLabor!A17","v":"Expert"},{"$f":"Config_RawLabor!B17","v":"Climate Scientist"},{"$f":"Config_RawLabor!C17","v":"Analyze and interpret data obtained from meteorological stations, radar and satellite imagery, and computer models.\nAnalyze past climate conditions and use models to predict future climate trends.\nExpert on factors that affect climate and cause climate change. Provides information and advises policy-makers on environmental topics such as climate change and air quality. Uses impact models to illustrate how human or natural activities respond to climate, for example crop yields, wetland ecology, biodiversity, and human health. "},{"$f":"E17-((Calc_Raw!E17-Calc_Raw!D17)*2)","v":100.26061250750001},{"$f":"Calc_Raw!E17*Escalation","v":128.04061250750001},{"$f":"E17+((Calc_Raw!F17-Calc_Raw!E17)*2)","v":159.38061250750002},{"$f":"H17-((Calc_Raw!H17-Calc_Raw!G17)*2)","v":130.93124536250002},{"$f":"Calc_Raw!H17*Escalation","v":160.43124536250002},{"$f":"H17+((Calc_Raw!I17-Calc_Raw!H17)*2)","v":196.59124536250005},{"$f":"K17-((Calc_Raw!K17-Calc_Raw!J17)*2)","v":147.68498428750007},{"$f":"Calc_Raw!K17*Escalation","v":189.92498428750002},{"$f":"K17+((Calc_Raw!L17-Calc_Raw!K17)*2)","v":237.42498428750002},{"$f":"N17-((Calc_Raw!N17-Calc_Raw!M17)*2)","v":156.72673352500001},{"$f":"Calc_Raw!N17*Escalation","v":204.98673352500006},{"$f":"N17+((Calc_Raw!O17-Calc_Raw!N17)*2)","v":253.28673352500002},{"$f":"Q17-((Calc_Raw!Q17-Calc_Raw!P17)*2)","v":166.91515705250006},{"$f":"Calc_Raw!Q17*Escalation","v":239.23515705250006},{"$f":"Q17+((Calc_Raw!R17-Calc_Raw!Q17)*2)","v":303.2151570525001}]
[{"$f":"Config_RawLabor!A18","v":"Expert"},{"$f":"Config_RawLabor!B18","v":"Communication Specialist"},{"$f":"Config_RawLabor!C18","v":"Defines, designs and implements communications strategy and programs. Evaluates and assist in establishing standard operating procedures regarding communications. Reviews and edits communications submitted for organizational issues. Works closely with various business departments to ensure messages are delivered clearly and effectively."},{"$f":"E18-((Calc_Raw!E18-Calc_Raw!D18)*2)","v":105.91769223500003},{"$f":"Calc_Raw!E18*Escalation","v":139.61769223500005},{"$f":"E18+((Calc_Raw!F18-Calc_Raw!E18)*2)","v":176.19769223500003},{"$f":"H18-((Calc_Raw!H18-Calc_Raw!G18)*2)","v":130.8614462525},{"$f":"Calc_Raw!H18*Escalation","v":170.38144625250004},{"$f":"H18+((Calc_Raw!I18-Calc_Raw!H18)*2)","v":214.14144625250003},{"$f":"K18-((Calc_Raw!K18-Calc_Raw!J18)*2)","v":165.40615269500003},{"$f":"Calc_Raw!K18*Escalation","v":211.74615269500006},{"$f":"K18+((Calc_Raw!L18-Calc_Raw!K18)*2)","v":272.70615269500001},{"$f":"N18-((Calc_Raw!N18-Calc_Raw!M18)*2)","v":204.64051875750005},{"$f":"Calc_Raw!N18*Escalation","v":259.24051875750007},{"$f":"N18+((Calc_Raw!O18-Calc_Raw!N18)*2)","v":326.68051875750001},{"$f":"Q18-((Calc_Raw!Q18-Calc_Raw!P18)*2)","v":256.74474636000008},{"$f":"Calc_Raw!Q18*Escalation","v":343.76474636000006},{"$f":"Q18+((Calc_Raw!R18-Calc_Raw!Q18)*2)","v":460.12474636000007}]
[{"$f":"Config_RawLabor!A19","v":"Expert"},{"$f":"Config_RawLabor!B19","v":"Cost Accountant"},{"$f":"Config_RawLabor!C19","v":"Reviews cost accounting procedures and methods. Responsible for the preparation and analysis of cost reports and costing audits. Examines and reviews unusual cost records and ensures cost data is allocated correctly. "},{"$f":"E19-((Calc_Raw!E19-Calc_Raw!D19)*2)","v":99.301033037500019},{"$f":"Calc_Raw!E19*Escalation","v":121.70103303750003},{"$f":"E19+((Calc_Raw!F19-Calc_Raw!E19)*2)","v":144.82103303750003},{"$f":"H19-((Calc_Raw!H19-Calc_Raw!G19)*2)","v":119.67740182000003},{"$f":"Calc_Raw!H19*Escalation","v":142.99740182000005},{"$f":"H19+((Calc_Raw!I19-Calc_Raw!H19)*2)","v":171.27740182000002},{"$f":"K19-((Calc_Raw!K19-Calc_Raw!J19)*2)","v":139.68861550500003},{"$f":"Calc_Raw!K19*Escalation","v":168.62861550500003},{"$f":"K19+((Calc_Raw!L19-Calc_Raw!K19)*2)","v":199.18861550500003},{"$f":"N19-((Calc_Raw!N19-Calc_Raw!M19)*2)","v":168.00001498750004},{"$f":"Calc_Raw!N19*Escalation","v":202.94001498750004},{"$f":"N19+((Calc_Raw!O19-Calc_Raw!N19)*2)","v":247.58001498750002},{"$f":"Q19-((Calc_Raw!Q19-Calc_Raw!P19)*2)","v":190.20777181750003},{"$f":"Calc_Raw!Q19*Escalation","v":229.76777181750003},{"$f":"Q19+((Calc_Raw!R19-Calc_Raw!Q19)*2)","v":280.32777181750004}]
[{"$f":"Config_RawLabor!A20","v":"Expert"},{"$f":"Config_RawLabor!B20","v":"Cost Estimation Analyst"},{"$f":"Config_RawLabor!C20","v":"Reviews project cost estimates, expenditures, and forecasts. Prepares should cost estimates for comparison as part of cost reasonableness analysis. Requires technical knowledge of the construction work involved, and the ability to use cost-estimating methods."},{"$f":"E20-((Calc_Raw!E20-Calc_Raw!D20)*2)","v":108.90816273000002},{"$f":"Calc_Raw!E20*Escalation","v":130.52816273000002},{"$f":"E20+((Calc_Raw!F20-Calc_Raw!E20)*2)","v":158.74816273000002},{"$f":"H20-((Calc_Raw!H20-Calc_Raw!G20)*2)","v":133.84580453750007},{"$f":"Calc_Raw!H20*Escalation","v":161.58580453750002},{"$f":"H20+((Calc_Raw!I20-Calc_Raw!H20)*2)","v":200.06580453750004},{"$f":"K20-((Calc_Raw!K20-Calc_Raw!J20)*2)","v":145.91193287000002},{"$f":"Calc_Raw!K20*Escalation","v":183.51193287000004},{"$f":"K20+((Calc_Raw!L20-Calc_Raw!K20)*2)","v":231.25193287000005},{"$f":"N20-((Calc_Raw!N20-Calc_Raw!M20)*2)","v":170.95618859750002},{"$f":"Calc_Raw!N20*Escalation","v":228.67618859750004},{"$f":"N20+((Calc_Raw!O20-Calc_Raw!N20)*2)","v":279.57618859750005},{"$f":"Q20-((Calc_Raw!Q20-Calc_Raw!P20)*2)","v":233.54604751000005},{"$f":"Calc_Raw!Q20*Escalation","v":314.16604751000006},{"$f":"Q20+((Calc_Raw!R20-Calc_Raw!Q20)*2)","v":389.66604751000006}]
[{"$f":"Config_RawLabor!A21","v":"Expert"},{"$f":"Config_RawLabor!B21","v":"Design Engineer"},{"$f":"Config_RawLabor!C21","v":"Evaluates products, parts, or processes for cost efficiency and reliability and to estimate project completion status. "},{"$f":"E21-((Calc_Raw!E21-Calc_Raw!D21)*2)","v":116.15171014000003},{"$f":"Calc_Raw!E21*Escalation","v":136.95171014000002},{"$f":"E21+((Calc_Raw!F21-Calc_Raw!E21)*2)","v":159.91171014000005},{"$f":"H21-((Calc_Raw!H21-Calc_Raw!G21)*2)","v":123.57054848000001},{"$f":"Calc_Raw!H21*Escalation","v":150.47054848000005},{"$f":"H21+((Calc_Raw!I21-Calc_Raw!H21)*2)","v":183.35054848000004},{"$f":"K21-((Calc_Raw!K21-Calc_Raw!J21)*2)","v":170.41419319250005},{"$f":"Calc_Raw!K21*Escalation","v":199.85419319250005},{"$f":"K21+((Calc_Raw!L21-Calc_Raw!K21)*2)","v":242.05419319250004},{"$f":"N21-((Calc_Raw!N21-Calc_Raw!M21)*2)","v":197.79588412000007},{"$f":"Calc_Raw!N21*Escalation","v":251.73588412000007},{"$f":"N21+((Calc_Raw!O21-Calc_Raw!N21)*2)","v":328.21588412000006},{"$f":"Q21-((Calc_Raw!Q21-Calc_Raw!P21)*2)","v":220.73474327000008},{"$f":"Calc_Raw!Q21*Escalation","v":280.91474327000003},{"$f":"Q21+((Calc_Raw!R21-Calc_Raw!Q21)*2)","v":366.29474327000003}]
[{"$f":"Config_RawLabor!A22","v":"Expert"},{"$f":"Config_RawLabor!B22","v":"Drilling Engineer "},{"$f":"Config_RawLabor!C22","v":"Provides expert judgment for the design and implementation of oil and gas wells. Resolves highly complex technical issues and conducts advanced research into emerging technology in the field. Recommends alterations to development and design to improve safety, costs, and efficiency. "},{"$f":"E22-((Calc_Raw!E22-Calc_Raw!D22)*2)","v":167.60993952500004},{"$f":"Calc_Raw!E22*Escalation","v":196.58993952500006},{"$f":"E22+((Calc_Raw!F22-Calc_Raw!E22)*2)","v":233.44993952500002},{"$f":"H22-((Calc_Raw!H22-Calc_Raw!G22)*2)","v":197.56763232750006},{"$f":"Calc_Raw!H22*Escalation","v":245.84763232750004},{"$f":"H22+((Calc_Raw!I22-Calc_Raw!H22)*2)","v":287.88763232750006},{"$f":"K22-((Calc_Raw!K22-Calc_Raw!J22)*2)","v":221.04526476000007},{"$f":"Calc_Raw!K22*Escalation","v":290.02526476000003},{"$f":"K22+((Calc_Raw!L22-Calc_Raw!K22)*2)","v":343.92526476},{"$f":"N22-((Calc_Raw!N22-Calc_Raw!M22)*2)","v":290.10005810000013},{"$f":"Calc_Raw!N22*Escalation","v":366.52005810000009},{"$f":"N22+((Calc_Raw!O22-Calc_Raw!N22)*2)","v":429.06005810000016},{"$f":"Q22-((Calc_Raw!Q22-Calc_Raw!P22)*2)","v":302.99950951500006},{"$f":"Calc_Raw!Q22*Escalation","v":417.71950951500008},{"$f":"Q22+((Calc_Raw!R22-Calc_Raw!Q22)*2)","v":469.39950951500003}]
[{"$f":"Config_RawLabor!A23","v":"Expert"},{"$f":"Config_RawLabor!B23","v":"Ecologist"},{"$f":"Config_RawLabor!C23","v":"Investigates the factors at play in a disturbed ecosystem, anticipates potential effects of proposed actions, and recommends sustainable practices. Work may include fieldwork to collect and analyze data on environmental conditions, or to assess or certify a habitat. May plan or review habitat management or environmental restoration projects, including procedures, resources, schedules, and budgets."},{"$f":"E23-((Calc_Raw!E23-Calc_Raw!D23)*2)","v":85.822069270000028},{"$f":"Calc_Raw!E23*Escalation","v":104.58206927000002},{"$f":"E23+((Calc_Raw!F23-Calc_Raw!E23)*2)","v":130.30206927},{"$f":"H23-((Calc_Raw!H23-Calc_Raw!G23)*2)","v":91.104329592500022},{"$f":"Calc_Raw!H23*Escalation","v":120.92432959250002},{"$f":"H23+((Calc_Raw!I23-Calc_Raw!H23)*2)","v":151.20432959250002},{"$f":"K23-((Calc_Raw!K23-Calc_Raw!J23)*2)","v":109.81621466250004},{"$f":"Calc_Raw!K23*Escalation","v":147.41621466250001},{"$f":"K23+((Calc_Raw!L23-Calc_Raw!K23)*2)","v":196.41621466250001},{"$f":"N23-((Calc_Raw!N23-Calc_Raw!M23)*2)","v":153.83440917500002},{"$f":"Calc_Raw!N23*Escalation","v":211.07440917500003},{"$f":"N23+((Calc_Raw!O23-Calc_Raw!N23)*2)","v":278.59440917500007},{"$f":"Q23-((Calc_Raw!Q23-Calc_Raw!P23)*2)","v":161.62339741000002},{"$f":"Calc_Raw!Q23*Escalation","v":216.34339741000005},{"$f":"Q23+((Calc_Raw!R23-Calc_Raw!Q23)*2)","v":256.30339741}]
[{"$f":"Config_RawLabor!A24","v":"Expert"},{"$f":"Config_RawLabor!B24","v":"Economist"},{"$f":"Config_RawLabor!C24","v":"Conducts research and analyses on economic data/trends and provides recommendations based on expertise. Researches and develops new data statistical models and technological innovations. Organizes data into report format and arranges graphic illustrations of research findings. Interprets and predicts economic conditions and advises management on implications. "},{"$f":"E24-((Calc_Raw!E24-Calc_Raw!D24)*2)","v":125.08492860500002},{"$f":"Calc_Raw!E24*Escalation","v":178.28492860500006},{"$f":"E24+((Calc_Raw!F24-Calc_Raw!E24)*2)","v":238.04492860500005},{"$f":"H24-((Calc_Raw!H24-Calc_Raw!G24)*2)","v":146.60055625750002},{"$f":"Calc_Raw!H24*Escalation","v":206.76055625750004},{"$f":"H24+((Calc_Raw!I24-Calc_Raw!H24)*2)","v":276.76055625750007},{"$f":"K24-((Calc_Raw!K24-Calc_Raw!J24)*2)","v":168.36255166250007},{"$f":"Calc_Raw!K24*Escalation","v":235.58255166250004},{"$f":"K24+((Calc_Raw!L24-Calc_Raw!K24)*2)","v":315.90255166250006},{"$f":"N24-((Calc_Raw!N24-Calc_Raw!M24)*2)","v":178.48167573000006},{"$f":"Calc_Raw!N24*Escalation","v":252.28167573000007},{"$f":"N24+((Calc_Raw!O24-Calc_Raw!N24)*2)","v":343.26167573000009},{"$f":"Q24-((Calc_Raw!Q24-Calc_Raw!P24)*2)","v":188.52633586500002},{"$f":"Calc_Raw!Q24*Escalation","v":268.88633586500004},{"$f":"Q24+((Calc_Raw!R24-Calc_Raw!Q24)*2)","v":370.44633586499998}]
[{"$f":"Config_RawLabor!A25","v":"Expert"},{"$f":"Config_RawLabor!B25","v":"Electrical Controls Engineer "},{"$f":"Config_RawLabor!C25","v":"Reviews design of electrical control systems, equipment, and machinery."},{"$f":"E25-((Calc_Raw!E25-Calc_Raw!D25)*2)","v":113.11042774000001},{"$f":"Calc_Raw!E25*Escalation","v":140.31042774000002},{"$f":"E25+((Calc_Raw!F25-Calc_Raw!E25)*2)","v":157.95042774000001},{"$f":"H25-((Calc_Raw!H25-Calc_Raw!G25)*2)","v":118.00145562750001},{"$f":"Calc_Raw!H25*Escalation","v":157.26145562750006},{"$f":"H25+((Calc_Raw!I25-Calc_Raw!H25)*2)","v":194.98145562750003},{"$f":"K25-((Calc_Raw!K25-Calc_Raw!J25)*2)","v":122.84355565000004},{"$f":"Calc_Raw!K25*Escalation","v":174.02355565000005},{"$f":"K25+((Calc_Raw!L25-Calc_Raw!K25)*2)","v":231.60355565000003},{"$f":"N25-((Calc_Raw!N25-Calc_Raw!M25)*2)","v":142.64242417500003},{"$f":"Calc_Raw!N25*Escalation","v":190.08242417500003},{"$f":"N25+((Calc_Raw!O25-Calc_Raw!N25)*2)","v":246.62242417500005},{"$f":"Q25-((Calc_Raw!Q25-Calc_Raw!P25)*2)","v":162.15988487250007},{"$f":"Calc_Raw!Q25*Escalation","v":205.89988487250002},{"$f":"Q25+((Calc_Raw!R25-Calc_Raw!Q25)*2)","v":261.41988487250006}]
[{"$f":"Config_RawLabor!A26","v":"Expert"},{"$f":"Config_RawLabor!B26","v":"Electrical Engineer "},{"$f":"Config_RawLabor!C26","v":"Reviews electrical equipment, components, or systems. Applies mathematical and engineering principles and methods to analysis of electrical system designs. Studies new technologies and researches innovative solutions and product designs to make alternate recommendations."},{"$f":"E26-((Calc_Raw!E26-Calc_Raw!D26)*2)","v":121.73001189750005},{"$f":"Calc_Raw!E26*Escalation","v":140.09001189750003},{"$f":"E26+((Calc_Raw!F26-Calc_Raw!E26)*2)","v":162.33001189750004},{"$f":"H26-((Calc_Raw!H26-Calc_Raw!G26)*2)","v":138.81882577000002},{"$f":"Calc_Raw!H26*Escalation","v":165.45882577},{"$f":"H26+((Calc_Raw!I26-Calc_Raw!H26)*2)","v":198.97882577000004},{"$f":"K26-((Calc_Raw!K26-Calc_Raw!J26)*2)","v":163.64651285500005},{"$f":"Calc_Raw!K26*Escalation","v":200.32651285500006},{"$f":"K26+((Calc_Raw!L26-Calc_Raw!K26)*2)","v":238.50651285500001},{"$f":"N26-((Calc_Raw!N26-Calc_Raw!M26)*2)","v":197.97589818250006},{"$f":"Calc_Raw!N26*Escalation","v":232.05589818250004},{"$f":"N26+((Calc_Raw!O26-Calc_Raw!N26)*2)","v":273.5158981825},{"$f":"Q26-((Calc_Raw!Q26-Calc_Raw!P26)*2)","v":226.17007376000004},{"$f":"Calc_Raw!Q26*Escalation","v":277.43007376000003},{"$f":"Q26+((Calc_Raw!R26-Calc_Raw!Q26)*2)","v":318.01007376000007}]
[{"$f":"Config_RawLabor!A27","v":"Expert"},{"$f":"Config_RawLabor!B27","v":"Energy & Resources Expert"},{"$f":"Config_RawLabor!C27","v":"Offers broad, cross discipline expertise in analytic, methodological, theoretical, and practical approaches to problems in energy, resources, and the environment."},{"$f":"E27-((Calc_Raw!E27-Calc_Raw!D27)*2)","v":92.67616366750002},{"$f":"Calc_Raw!E27*Escalation","v":129.21616366750001},{"$f":"E27+((Calc_Raw!F27-Calc_Raw!E27)*2)","v":199.71616366750004},{"$f":"H27-((Calc_Raw!H27-Calc_Raw!G27)*2)","v":106.8552830475},{"$f":"Calc_Raw!H27*Escalation","v":152.47528304750003},{"$f":"H27+((Calc_Raw!I27-Calc_Raw!H27)*2)","v":238.55528304750001},{"$f":"K27-((Calc_Raw!K27-Calc_Raw!J27)*2)","v":131.60556511750002},{"$f":"Calc_Raw!K27*Escalation","v":183.16556511750002},{"$f":"K27+((Calc_Raw!L27-Calc_Raw!K27)*2)","v":281.84556511750003},{"$f":"N27-((Calc_Raw!N27-Calc_Raw!M27)*2)","v":157.38288163750005},{"$f":"Calc_Raw!N27*Escalation","v":221.62288163750006},{"$f":"N27+((Calc_Raw!O27-Calc_Raw!N27)*2)","v":331.98288163749999},{"$f":"Q27-((Calc_Raw!Q27-Calc_Raw!P27)*2)","v":169.02683551500007},{"$f":"Calc_Raw!Q27*Escalation","v":241.38683551500003},{"$f":"Q27+((Calc_Raw!R27-Calc_Raw!Q27)*2)","v":357.14683551500008}]
[{"$f":"Config_RawLabor!A28","v":"Expert"},{"$f":"Config_RawLabor!B28","v":"Engineer "},{"$f":"Config_RawLabor!C28","v":"Provides expert consultation in one or more areas of engineering. Reviews highly complex technical issues and recommends alterations to development and design to improve quality of products and/or procedures. Has extensive engineering knowledge and is considered an expert in one or more engineering specialties. "},{"$f":"E28-((Calc_Raw!E28-Calc_Raw!D28)*2)","v":117.90575823000003},{"$f":"Calc_Raw!E28*Escalation","v":136.82575823000005},{"$f":"E28+((Calc_Raw!F28-Calc_Raw!E28)*2)","v":170.16575823000002},{"$f":"H28-((Calc_Raw!H28-Calc_Raw!G28)*2)","v":130.26667109500002},{"$f":"Calc_Raw!H28*Escalation","v":158.00667109500003},{"$f":"H28+((Calc_Raw!I28-Calc_Raw!H28)*2)","v":191.04667109500005},{"$f":"K28-((Calc_Raw!K28-Calc_Raw!J28)*2)","v":155.00008942000005},{"$f":"Calc_Raw!K28*Escalation","v":188.34008942000003},{"$f":"K28+((Calc_Raw!L28-Calc_Raw!K28)*2)","v":240.58008942000004},{"$f":"N28-((Calc_Raw!N28-Calc_Raw!M28)*2)","v":186.23241114250004},{"$f":"Calc_Raw!N28*Escalation","v":230.71241114250006},{"$f":"N28+((Calc_Raw!O28-Calc_Raw!N28)*2)","v":279.57241114250007},{"$f":"Q28-((Calc_Raw!Q28-Calc_Raw!P28)*2)","v":218.51887619750005},{"$f":"Calc_Raw!Q28*Escalation","v":274.01887619750005},{"$f":"Q28+((Calc_Raw!R28-Calc_Raw!Q28)*2)","v":346.31887619750012}]
[{"$f":"Config_RawLabor!A29","v":"Expert"},{"$f":"Config_RawLabor!B29","v":"Env., Health, and Safety Engineer "},{"$f":"Config_RawLabor!C29","v":"Provides review and expert recommendations with respect to local, state and federal environmental, health and safety regulations. May review the design of facilities, work areas and work procedures from an environmental, health and safety perspective. Reviews environmental policy and procedures. Ensures compliance with all environmental, health and safety regulations. "},{"$f":"E29-((Calc_Raw!E29-Calc_Raw!D29)*2)","v":101.36701982000002},{"$f":"Calc_Raw!E29*Escalation","v":117.80701982000002},{"$f":"E29+((Calc_Raw!F29-Calc_Raw!E29)*2)","v":154.36701982000005},{"$f":"H29-((Calc_Raw!H29-Calc_Raw!G29)*2)","v":124.85874459000004},{"$f":"Calc_Raw!H29*Escalation","v":144.71874459000003},{"$f":"H29+((Calc_Raw!I29-Calc_Raw!H29)*2)","v":159.81874459000005},{"$f":"K29-((Calc_Raw!K29-Calc_Raw!J29)*2)","v":144.78281920750007},{"$f":"Calc_Raw!K29*Escalation","v":174.64281920750003},{"$f":"K29+((Calc_Raw!L29-Calc_Raw!K29)*2)","v":201.80281920750005},{"$f":"N29-((Calc_Raw!N29-Calc_Raw!M29)*2)","v":167.97562651750002},{"$f":"Calc_Raw!N29*Escalation","v":209.19562651750005},{"$f":"N29+((Calc_Raw!O29-Calc_Raw!N29)*2)","v":247.57562651750004},{"$f":"Q29-((Calc_Raw!Q29-Calc_Raw!P29)*2)","v":214.10713736500003},{"$f":"Calc_Raw!Q29*Escalation","v":266.78713736500004},{"$f":"Q29+((Calc_Raw!R29-Calc_Raw!Q29)*2)","v":308.68713736500001}]
[{"$f":"Config_RawLabor!A30","v":"Expert"},{"$f":"Config_RawLabor!B30","v":"Environmental Engineer "},{"$f":"Config_RawLabor!C30","v":"Identifies, assesses and resolves problems concerning the environment. May review measuring approaches, equipment and results in areas such as pollutants involving air, land, and water. Provides reports findings on environmental consequences of equipment, tools, and procedures. Reviews conformance to federal, state, and local environmental legislation."},{"$f":"E30-((Calc_Raw!E30-Calc_Raw!D30)*2)","v":100.26061250750001},{"$f":"Calc_Raw!E30*Escalation","v":128.04061250750001},{"$f":"E30+((Calc_Raw!F30-Calc_Raw!E30)*2)","v":159.38061250750002},{"$f":"H30-((Calc_Raw!H30-Calc_Raw!G30)*2)","v":130.93124536250002},{"$f":"Calc_Raw!H30*Escalation","v":160.43124536250002},{"$f":"H30+((Calc_Raw!I30-Calc_Raw!H30)*2)","v":196.59124536250005},{"$f":"K30-((Calc_Raw!K30-Calc_Raw!J30)*2)","v":147.68498428750007},{"$f":"Calc_Raw!K30*Escalation","v":189.92498428750002},{"$f":"K30+((Calc_Raw!L30-Calc_Raw!K30)*2)","v":237.42498428750002},{"$f":"N30-((Calc_Raw!N30-Calc_Raw!M30)*2)","v":156.72673352500001},{"$f":"Calc_Raw!N30*Escalation","v":204.98673352500006},{"$f":"N30+((Calc_Raw!O30-Calc_Raw!N30)*2)","v":253.28673352500002},{"$f":"Q30-((Calc_Raw!Q30-Calc_Raw!P30)*2)","v":166.91515705250006},{"$f":"Calc_Raw!Q30*Escalation","v":239.23515705250006},{"$f":"Q30+((Calc_Raw!R30-Calc_Raw!Q30)*2)","v":303.2151570525001}]
[{"$f":"Config_RawLabor!A31","v":"Expert"},{"$f":"Config_RawLabor!B31","v":"Equipment Engineer "},{"$f":"Config_RawLabor!C31","v":"Provides expert consultation with respect to technical products and equipment. Recognized as technical leader and resource. Recommends alterations and enhancements to improve quality of products and/or procedures. "},{"$f":"E31-((Calc_Raw!E31-Calc_Raw!D31)*2)","v":112.67033249750003},{"$f":"Calc_Raw!E31*Escalation","v":139.25033249750001},{"$f":"E31+((Calc_Raw!F31-Calc_Raw!E31)*2)","v":164.41033249750004},{"$f":"H31-((Calc_Raw!H31-Calc_Raw!G31)*2)","v":140.50809973250006},{"$f":"Calc_Raw!H31*Escalation","v":173.90809973250003},{"$f":"H31+((Calc_Raw!I31-Calc_Raw!H31)*2)","v":214.18809973250006},{"$f":"K31-((Calc_Raw!K31-Calc_Raw!J31)*2)","v":153.29407245250005},{"$f":"Calc_Raw!K31*Escalation","v":189.69407245250002},{"$f":"K31+((Calc_Raw!L31-Calc_Raw!K31)*2)","v":237.93407245250003},{"$f":"N31-((Calc_Raw!N31-Calc_Raw!M31)*2)","v":182.06917964500002},{"$f":"Calc_Raw!N31*Escalation","v":230.00917964500002},{"$f":"N31+((Calc_Raw!O31-Calc_Raw!N31)*2)","v":288.02917964500006},{"$f":"Q31-((Calc_Raw!Q31-Calc_Raw!P31)*2)","v":210.49470165000002},{"$f":"Calc_Raw!Q31*Escalation","v":249.59470165000005},{"$f":"Q31+((Calc_Raw!R31-Calc_Raw!Q31)*2)","v":290.39470165}]
[{"$f":"Config_RawLabor!A32","v":"Expert"},{"$f":"Config_RawLabor!B32","v":"Expert - Not Otherwise Classified"},{"$f":"Config_RawLabor!C32","v":"Used for export roles that are not better classified as one of the more detailed roles. May also be used for experts that fill multiple subroles."},{"$f":"E32-((Calc_Raw!E32-Calc_Raw!D32)*2)","v":117.40834384000004},{"$f":"Calc_Raw!E32*Escalation","v":145.76834384000003},{"$f":"E32+((Calc_Raw!F32-Calc_Raw!E32)*2)","v":189.90834384000001},{"$f":"H32-((Calc_Raw!H32-Calc_Raw!G32)*2)","v":135.81725295500004},{"$f":"Calc_Raw!H32*Escalation","v":172.19725295500004},{"$f":"H32+((Calc_Raw!I32-Calc_Raw!H32)*2)","v":225.31725295500004},{"$f":"K32-((Calc_Raw!K32-Calc_Raw!J32)*2)","v":161.75383772000006},{"$f":"Calc_Raw!K32*Escalation","v":204.71383772000004},{"$f":"K32+((Calc_Raw!L32-Calc_Raw!K32)*2)","v":266.43383772000004},{"$f":"N32-((Calc_Raw!N32-Calc_Raw!M32)*2)","v":191.57221128250006},{"$f":"Calc_Raw!N32*Escalation","v":241.71221128250005},{"$f":"N32+((Calc_Raw!O32-Calc_Raw!N32)*2)","v":310.45221128250012},{"$f":"Q32-((Calc_Raw!Q32-Calc_Raw!P32)*2)","v":219.11868102500006},{"$f":"Calc_Raw!Q32*Escalation","v":278.45868102500009},{"$f":"Q32+((Calc_Raw!R32-Calc_Raw!Q32)*2)","v":356.49868102500005}]
[{"$f":"Config_RawLabor!A33","v":"Expert"},{"$f":"Config_RawLabor!B33","v":"Expert - Social Work"},{"$f":"Config_RawLabor!C33","v":"Provides expertise in the discipline area of social work.  Familiar with current literature and research in the selected field."},{"$f":"E33-((Calc_Raw!E33-Calc_Raw!D33)*2)","v":85.857090595000017},{"$f":"Calc_Raw!E33*Escalation","v":130.71709059500003},{"$f":"E33+((Calc_Raw!F33-Calc_Raw!E33)*2)","v":237.33709059500001},{"$f":"H33-((Calc_Raw!H33-Calc_Raw!G33)*2)","v":99.688048737500054},{"$f":"Calc_Raw!H33*Escalation","v":155.70804873750004},{"$f":"H33+((Calc_Raw!I33-Calc_Raw!H33)*2)","v":283.88804873750007},{"$f":"K33-((Calc_Raw!K33-Calc_Raw!J33)*2)","v":118.84153212000001},{"$f":"Calc_Raw!K33*Escalation","v":184.56153212000004},{"$f":"K33+((Calc_Raw!L33-Calc_Raw!K33)*2)","v":334.16153212},{"$f":"N33-((Calc_Raw!N33-Calc_Raw!M33)*2)","v":140.59555677250006},{"$f":"Calc_Raw!N33*Escalation","v":217.23555677250005},{"$f":"N33+((Calc_Raw!O33-Calc_Raw!N33)*2)","v":389.37555677250009},{"$f":"Q33-((Calc_Raw!Q33-Calc_Raw!P33)*2)","v":158.53483176500006},{"$f":"Calc_Raw!Q33*Escalation","v":246.63483176500003},{"$f":"Q33+((Calc_Raw!R33-Calc_Raw!Q33)*2)","v":439.77483176500004}]
[{"$f":"Config_RawLabor!A34","v":"Expert"},{"$f":"Config_RawLabor!B34","v":"Field Service Engineer "},{"$f":"Config_RawLabor!C34","v":"Reviews installation and maintenance of products/equipment. Identifies, analyzes, makes recommendations regarding product failures, installation of new components or parts. Develops creative recommendations for more unique, chronic, or complex issues. Provides the intervenor team with explanations of product features and typical operation. Has extensive knowledge of an organization's products and services and is considered an expert."},{"$f":"E34-((Calc_Raw!E34-Calc_Raw!D34)*2)","v":93.017992025000027},{"$f":"Calc_Raw!E34*Escalation","v":123.11799202500002},{"$f":"E34+((Calc_Raw!F34-Calc_Raw!E34)*2)","v":158.55799202500003},{"$f":"H34-((Calc_Raw!H34-Calc_Raw!G34)*2)","v":109.20875968250004},{"$f":"Calc_Raw!H34*Escalation","v":145.98875968250005},{"$f":"H34+((Calc_Raw!I34-Calc_Raw!H34)*2)","v":187.30875968250004},{"$f":"K34-((Calc_Raw!K34-Calc_Raw!J34)*2)","v":135.63564995500005},{"$f":"Calc_Raw!K34*Escalation","v":176.39564995500004},{"$f":"K34+((Calc_Raw!L34-Calc_Raw!K34)*2)","v":228.57564995500005},{"$f":"N34-((Calc_Raw!N34-Calc_Raw!M34)*2)","v":152.76762558000004},{"$f":"Calc_Raw!N34*Escalation","v":210.50762558000005},{"$f":"N34+((Calc_Raw!O34-Calc_Raw!N34)*2)","v":253.74762558000006},{"$f":"Q34-((Calc_Raw!Q34-Calc_Raw!P34)*2)","v":169.40956530250003},{"$f":"Calc_Raw!Q34*Escalation","v":227.68956530250006},{"$f":"Q34+((Calc_Raw!R34-Calc_Raw!Q34)*2)","v":276.32956530250004}]
[{"$f":"Config_RawLabor!A35","v":"Expert"},{"$f":"Config_RawLabor!B35","v":"Fire Fighter"},{"$f":"Config_RawLabor!C35","v":"Provides explanations of standard or expected fire fighting procedures under typical, potential, or observed scenarios."},{"$f":"E35-((Calc_Raw!E35-Calc_Raw!D35)*2)","v":36.13972776750002},{"$f":"Calc_Raw!E35*Escalation","v":67.499727767500019},{"$f":"E35+((Calc_Raw!F35-Calc_Raw!E35)*2)","v":99.959727767500027},{"$f":"H35-((Calc_Raw!H35-Calc_Raw!G35)*2)","v":41.839302550000028},{"$f":"Calc_Raw!H35*Escalation","v":80.399302550000016},{"$f":"H35+((Calc_Raw!I35-Calc_Raw!H35)*2)","v":119.59930255000003},{"$f":"K35-((Calc_Raw!K35-Calc_Raw!J35)*2)","v":49.903611900000016},{"$f":"Calc_Raw!K35*Escalation","v":95.303611900000021},{"$f":"K35+((Calc_Raw!L35-Calc_Raw!K35)*2)","v":140.70361190000003},{"$f":"N35-((Calc_Raw!N35-Calc_Raw!M35)*2)","v":59.070671847500009},{"$f":"Calc_Raw!N35*Escalation","v":112.17067184750003},{"$f":"N35+((Calc_Raw!O35-Calc_Raw!N35)*2)","v":163.83067184750001},{"$f":"Q35-((Calc_Raw!Q35-Calc_Raw!P35)*2)","v":66.538372995000032},{"$f":"Calc_Raw!Q35*Escalation","v":127.35837299500002},{"$f":"Q35+((Calc_Raw!R35-Calc_Raw!Q35)*2)","v":184.93837299500001}]
[{"$f":"Config_RawLabor!A36","v":"Expert"},{"$f":"Config_RawLabor!B36","v":"Fire Inspector Supervisor"},{"$f":"Config_RawLabor!C36","v":"Oversees the inspection of fire-damage to determine cause. Reviews preventive actions for appropriatness. Provides explanations of a variety of fire laws, regulations, and policies, including identifying those that are appropriate for a given situation. Assesses compliance with laws, regulations, and policies. "},{"$f":"E36-((Calc_Raw!E36-Calc_Raw!D36)*2)","v":74.676177730000035},{"$f":"Calc_Raw!E36*Escalation","v":109.53617773000002},{"$f":"E36+((Calc_Raw!F36-Calc_Raw!E36)*2)","v":157.11617773000003},{"$f":"H36-((Calc_Raw!H36-Calc_Raw!G36)*2)","v":86.755682767500019},{"$f":"Calc_Raw!H36*Escalation","v":130.47568276750002},{"$f":"H36+((Calc_Raw!I36-Calc_Raw!H36)*2)","v":188.01568276750004},{"$f":"K36-((Calc_Raw!K36-Calc_Raw!J36)*2)","v":103.42795349500003},{"$f":"Calc_Raw!K36*Escalation","v":154.64795349500002},{"$f":"K36+((Calc_Raw!L36-Calc_Raw!K36)*2)","v":221.18795349500004},{"$f":"N36-((Calc_Raw!N36-Calc_Raw!M36)*2)","v":122.33199792750005},{"$f":"Calc_Raw!N36*Escalation","v":182.03199792750004},{"$f":"N36+((Calc_Raw!O36-Calc_Raw!N36)*2)","v":257.49199792750005},{"$f":"Q36-((Calc_Raw!Q36-Calc_Raw!P36)*2)","v":137.96609232500006},{"$f":"Calc_Raw!Q36*Escalation","v":206.66609232500005},{"$f":"Q36+((Calc_Raw!R36-Calc_Raw!Q36)*2)","v":290.66609232500002}]
[{"$f":"Config_RawLabor!A37","v":"Expert"},{"$f":"Config_RawLabor!B37","v":"Fire Prevention Engineer"},{"$f":"Config_RawLabor!C37","v":"Examines buildings and equipment to determine compliance with fire prevention best practices. Ensures fire compliance codes are being adhered to. "},{"$f":"E37-((Calc_Raw!E37-Calc_Raw!D37)*2)","v":84.306432242500009},{"$f":"Calc_Raw!E37*Escalation","v":89.226432242500024},{"$f":"E37+((Calc_Raw!F37-Calc_Raw!E37)*2)","v":120.70643224250001},{"$f":"H37-((Calc_Raw!H37-Calc_Raw!G37)*2)","v":98.342420055000034},{"$f":"Calc_Raw!H37*Escalation","v":106.28242005500003},{"$f":"H37+((Calc_Raw!I37-Calc_Raw!H37)*2)","v":144.462420055},{"$f":"K37-((Calc_Raw!K37-Calc_Raw!J37)*2)","v":117.12339797750001},{"$f":"Calc_Raw!K37*Escalation","v":125.98339797750002},{"$f":"K37+((Calc_Raw!L37-Calc_Raw!K37)*2)","v":169.90339797750005},{"$f":"N37-((Calc_Raw!N37-Calc_Raw!M37)*2)","v":138.42738204000003},{"$f":"Calc_Raw!N37*Escalation","v":148.28738204000004},{"$f":"N37+((Calc_Raw!O37-Calc_Raw!N37)*2)","v":197.74738204000002},{"$f":"Q37-((Calc_Raw!Q37-Calc_Raw!P37)*2)","v":156.27571970000005},{"$f":"Calc_Raw!Q37*Escalation","v":168.35571970000004},{"$f":"Q37+((Calc_Raw!R37-Calc_Raw!Q37)*2)","v":223.21571970000005}]
[{"$f":"Config_RawLabor!A38","v":"Expert"},{"$f":"Config_RawLabor!B38","v":"Geologist"},{"$f":"Config_RawLabor!C38","v":"Expert on the formation, dissolution, and content of rock layers, along with the effects of internal pressures, heat, water, pollution, and erosion. "},{"$f":"E38-((Calc_Raw!E38-Calc_Raw!D38)*2)","v":108.75204480250002},{"$f":"Calc_Raw!E38*Escalation","v":116.43204480250003},{"$f":"E38+((Calc_Raw!F38-Calc_Raw!E38)*2)","v":155.05204480250003},{"$f":"H38-((Calc_Raw!H38-Calc_Raw!G38)*2)","v":118.48274271500003},{"$f":"Calc_Raw!H38*Escalation","v":147.34274271500001},{"$f":"H38+((Calc_Raw!I38-Calc_Raw!H38)*2)","v":225.66274271500001},{"$f":"K38-((Calc_Raw!K38-Calc_Raw!J38)*2)","v":166.27132185500002},{"$f":"Calc_Raw!K38*Escalation","v":187.73132185500006},{"$f":"K38+((Calc_Raw!L38-Calc_Raw!K38)*2)","v":248.01132185500003},{"$f":"N38-((Calc_Raw!N38-Calc_Raw!M38)*2)","v":154.90880336250004},{"$f":"Calc_Raw!N38*Escalation","v":219.20880336250005},{"$f":"N38+((Calc_Raw!O38-Calc_Raw!N38)*2)","v":281.70880336250002},{"$f":"Q38-((Calc_Raw!Q38-Calc_Raw!P38)*2)","v":192.22510914750001},{"$f":"Calc_Raw!Q38*Escalation","v":283.88510914750009},{"$f":"Q38+((Calc_Raw!R38-Calc_Raw!Q38)*2)","v":336.16510914750006}]
[{"$f":"Config_RawLabor!A39","v":"Expert"},{"$f":"Config_RawLabor!B39","v":"Geotechnical Engineer"},{"$f":"Config_RawLabor!C39","v":"Prepares and inspects projects involving drilling and exploration. Responsible for reviewing geological maps, site characterization, numerical modeling and analysis of excavations/supports. "},{"$f":"E39-((Calc_Raw!E39-Calc_Raw!D39)*2)","v":106.37929992250002},{"$f":"Calc_Raw!E39*Escalation","v":128.85929992250001},{"$f":"E39+((Calc_Raw!F39-Calc_Raw!E39)*2)","v":144.91929992250004},{"$f":"H39-((Calc_Raw!H39-Calc_Raw!G39)*2)","v":102.90514721500003},{"$f":"Calc_Raw!H39*Escalation","v":141.04514721500001},{"$f":"H39+((Calc_Raw!I39-Calc_Raw!H39)*2)","v":165.14514721500004},{"$f":"K39-((Calc_Raw!K39-Calc_Raw!J39)*2)","v":133.06867118750006},{"$f":"Calc_Raw!K39*Escalation","v":180.26867118750005},{"$f":"K39+((Calc_Raw!L39-Calc_Raw!K39)*2)","v":208.18867118750006},{"$f":"N39-((Calc_Raw!N39-Calc_Raw!M39)*2)","v":196.97837242750003},{"$f":"Calc_Raw!N39*Escalation","v":217.71837242750004},{"$f":"N39+((Calc_Raw!O39-Calc_Raw!N39)*2)","v":238.49837242750002},{"$f":"Q39-((Calc_Raw!Q39-Calc_Raw!P39)*2)","v":224.38980678250005},{"$f":"Calc_Raw!Q39*Escalation","v":248.00980678250005},{"$f":"Q39+((Calc_Raw!R39-Calc_Raw!Q39)*2)","v":271.68980678250006}]
[{"$f":"Config_RawLabor!A40","v":"Expert"},{"$f":"Config_RawLabor!B40","v":"Hardware Engineer "},{"$f":"Config_RawLabor!C40","v":"Reviews design, development, and implementation of hardware for products. Reviews test strategies and implementation, devices, and systems. Reviews stress and performance test results for a variety of computer hardware including circuit boards, processors and wiring. "},{"$f":"E40-((Calc_Raw!E40-Calc_Raw!D40)*2)","v":112.33861916250004},{"$f":"Calc_Raw!E40*Escalation","v":141.11861916250001},{"$f":"E40+((Calc_Raw!F40-Calc_Raw!E40)*2)","v":165.85861916250002},{"$f":"H40-((Calc_Raw!H40-Calc_Raw!G40)*2)","v":134.77885595500001},{"$f":"Calc_Raw!H40*Escalation","v":167.99885595500004},{"$f":"H40+((Calc_Raw!I40-Calc_Raw!H40)*2)","v":203.71885595500001},{"$f":"K40-((Calc_Raw!K40-Calc_Raw!J40)*2)","v":164.70481461250003},{"$f":"Calc_Raw!K40*Escalation","v":203.46481461250002},{"$f":"K40+((Calc_Raw!L40-Calc_Raw!K40)*2)","v":247.10481461250001},{"$f":"N40-((Calc_Raw!N40-Calc_Raw!M40)*2)","v":201.41575869250008},{"$f":"Calc_Raw!N40*Escalation","v":248.13575869250005},{"$f":"N40+((Calc_Raw!O40-Calc_Raw!N40)*2)","v":292.43575869250003},{"$f":"Q40-((Calc_Raw!Q40-Calc_Raw!P40)*2)","v":230.66210300750004},{"$f":"Calc_Raw!Q40*Escalation","v":281.28210300750004},{"$f":"Q40+((Calc_Raw!R40-Calc_Raw!Q40)*2)","v":332.7021030075}]
[{"$f":"Config_RawLabor!A41","v":"Expert"},{"$f":"Config_RawLabor!B41","v":"Health Scientist"},{"$f":"Config_RawLabor!C41","v":"Reviews the potential impact of policies and planned projects on community health.  "},{"$f":"E41-((Calc_Raw!E41-Calc_Raw!D41)*2)","v":127.13183294000001},{"$f":"Calc_Raw!E41*Escalation","v":189.01183294000006},{"$f":"E41+((Calc_Raw!F41-Calc_Raw!E41)*2)","v":268.79183294000006},{"$f":"H41-((Calc_Raw!H41-Calc_Raw!G41)*2)","v":147.66953511750006},{"$f":"Calc_Raw!H41*Escalation","v":225.14953511750002},{"$f":"H41+((Calc_Raw!I41-Calc_Raw!H41)*2)","v":321.62953511750004},{"$f":"K41-((Calc_Raw!K41-Calc_Raw!J41)*2)","v":176.06060931250005},{"$f":"Calc_Raw!K41*Escalation","v":266.86060931250006},{"$f":"K41+((Calc_Raw!L41-Calc_Raw!K41)*2)","v":378.36060931250006},{"$f":"N41-((Calc_Raw!N41-Calc_Raw!M41)*2)","v":208.2535675475001},{"$f":"Calc_Raw!N41*Escalation","v":314.11356754750005},{"$f":"N41+((Calc_Raw!O41-Calc_Raw!N41)*2)","v":440.47356754750007},{"$f":"Q41-((Calc_Raw!Q41-Calc_Raw!P41)*2)","v":234.81283316500009},{"$f":"Calc_Raw!Q41*Escalation","v":356.63283316500002},{"$f":"Q41+((Calc_Raw!R41-Calc_Raw!Q41)*2)","v":497.21283316500006}]
[{"$f":"Config_RawLabor!A42","v":"Expert"},{"$f":"Config_RawLabor!B42","v":"Hydrologist"},{"$f":"Config_RawLabor!C42","v":"Measure the properties of bodies of water, such as volume and stream flow\nCollect water and soil samples to test for certain properties, such as the pH or pollution levels. Analyze data on the environmental impacts of pollution, erosion, drought, and other problems. Recommend ways to minimize the negative impacts of erosion, sedimentation, or pollution on the environment. Use computer models to forecast future water supplies, the spread of pollution, floods, and other events.\nEvaluate the feasibility of water-related projects, such as hydroelectric power plants, irrigation systems, and wastewater treatment facilities."},{"$f":"E42-((Calc_Raw!E42-Calc_Raw!D42)*2)","v":100.26061250750001},{"$f":"Calc_Raw!E42*Escalation","v":128.04061250750001},{"$f":"E42+((Calc_Raw!F42-Calc_Raw!E42)*2)","v":159.38061250750002},{"$f":"H42-((Calc_Raw!H42-Calc_Raw!G42)*2)","v":130.93124536250002},{"$f":"Calc_Raw!H42*Escalation","v":160.43124536250002},{"$f":"H42+((Calc_Raw!I42-Calc_Raw!H42)*2)","v":196.59124536250005},{"$f":"K42-((Calc_Raw!K42-Calc_Raw!J42)*2)","v":147.68498428750007},{"$f":"Calc_Raw!K42*Escalation","v":189.92498428750002},{"$f":"K42+((Calc_Raw!L42-Calc_Raw!K42)*2)","v":237.42498428750002},{"$f":"N42-((Calc_Raw!N42-Calc_Raw!M42)*2)","v":156.72673352500001},{"$f":"Calc_Raw!N42*Escalation","v":204.98673352500006},{"$f":"N42+((Calc_Raw!O42-Calc_Raw!N42)*2)","v":253.28673352500002},{"$f":"Q42-((Calc_Raw!Q42-Calc_Raw!P42)*2)","v":166.91515705250006},{"$f":"Calc_Raw!Q42*Escalation","v":239.23515705250006},{"$f":"Q42+((Calc_Raw!R42-Calc_Raw!Q42)*2)","v":303.2151570525001}]
[{"$f":"Config_RawLabor!A43","v":"Expert"},{"$f":"Config_RawLabor!B43","v":"IT Project Engineer "},{"$f":"Config_RawLabor!C43","v":"Reviews IT engineering projects for compliance with industry best practices. Performs engineering design evaluations and reviews project budget and schedule. Reviews information system policies and controls to ensure data accuracy, security, and regulatory compliance. Reviews reports of computer and peripheral equipment production, malfunction, and maintenance to determine problems."},{"$f":"E43-((Calc_Raw!E43-Calc_Raw!D43)*2)","v":142.089377445},{"$f":"Calc_Raw!E43*Escalation","v":177.10937744500004},{"$f":"E43+((Calc_Raw!F43-Calc_Raw!E43)*2)","v":227.52937744499999},{"$f":"H43-((Calc_Raw!H43-Calc_Raw!G43)*2)","v":151.743827315},{"$f":"Calc_Raw!H43*Escalation","v":196.88382731500005},{"$f":"H43+((Calc_Raw!I43-Calc_Raw!H43)*2)","v":251.48382731500001},{"$f":"K43-((Calc_Raw!K43-Calc_Raw!J43)*2)","v":178.90105796750007},{"$f":"Calc_Raw!K43*Escalation","v":221.16105796750006},{"$f":"K43+((Calc_Raw!L43-Calc_Raw!K43)*2)","v":271.10105796750008},{"$f":"N43-((Calc_Raw!N43-Calc_Raw!M43)*2)","v":176.72809241750002},{"$f":"Calc_Raw!N43*Escalation","v":228.92809241750007},{"$f":"N43+((Calc_Raw!O43-Calc_Raw!N43)*2)","v":278.04809241750002},{"$f":"Q43-((Calc_Raw!Q43-Calc_Raw!P43)*2)","v":198.46784831000008},{"$f":"Calc_Raw!Q43*Escalation","v":257.06784831000004},{"$f":"Q43+((Calc_Raw!R43-Calc_Raw!Q43)*2)","v":312.24784831000005}]
[{"$f":"Config_RawLabor!A44","v":"Expert"},{"$f":"Config_RawLabor!B44","v":"Mechanical Engineer "},{"$f":"Config_RawLabor!C44","v":"Reviews all aspects of mechanical components, equipment, and machinery design, installation, and testing. Applies knowledge of engineering principles to review products such as engines, instruments, controls, robots, machines, etc. Reviews product testing, models and prototypes. May review fabrication, operation, application, installation, and/or repair of mechanical products."},{"$f":"E44-((Calc_Raw!E44-Calc_Raw!D44)*2)","v":118.33030231250004},{"$f":"Calc_Raw!E44*Escalation","v":136.71030231250003},{"$f":"E44+((Calc_Raw!F44-Calc_Raw!E44)*2)","v":158.57030231250005},{"$f":"H44-((Calc_Raw!H44-Calc_Raw!G44)*2)","v":140.25882577000002},{"$f":"Calc_Raw!H44*Escalation","v":165.45882577},{"$f":"H44+((Calc_Raw!I44-Calc_Raw!H44)*2)","v":197.89882577000006},{"$f":"K44-((Calc_Raw!K44-Calc_Raw!J44)*2)","v":167.2239225575},{"$f":"Calc_Raw!K44*Escalation","v":197.94392255750003},{"$f":"K44+((Calc_Raw!L44-Calc_Raw!K44)*2)","v":233.28392255750001},{"$f":"N44-((Calc_Raw!N44-Calc_Raw!M44)*2)","v":197.35512686750008},{"$f":"Calc_Raw!N44*Escalation","v":236.69512686750005},{"$f":"N44+((Calc_Raw!O44-Calc_Raw!N44)*2)","v":282.15512686750009},{"$f":"Q44-((Calc_Raw!Q44-Calc_Raw!P44)*2)","v":227.25215766000002},{"$f":"Calc_Raw!Q44*Escalation","v":271.97215766000005},{"$f":"Q44+((Calc_Raw!R44-Calc_Raw!Q44)*2)","v":316.6721576600001}]
[{"$f":"Config_RawLabor!A45","v":"Expert"},{"$f":"Config_RawLabor!B45","v":"Network Engineer "},{"$f":"Config_RawLabor!C45","v":"Evaluates network systems and communications. May review issues such as network traffic, potential security risk, etc. Reviews network architecture design and optimization. Must have extensive knowledge of Internet, computer, routers, switches, firewall, etc. "},{"$f":"E45-((Calc_Raw!E45-Calc_Raw!D45)*2)","v":108.25369411000003},{"$f":"Calc_Raw!E45*Escalation","v":136.99369411000004},{"$f":"E45+((Calc_Raw!F45-Calc_Raw!E45)*2)","v":177.81369411000003},{"$f":"H45-((Calc_Raw!H45-Calc_Raw!G45)*2)","v":131.50538400750003},{"$f":"Calc_Raw!H45*Escalation","v":167.92538400750004},{"$f":"H45+((Calc_Raw!I45-Calc_Raw!H45)*2)","v":210.94538400750002},{"$f":"K45-((Calc_Raw!K45-Calc_Raw!J45)*2)","v":158.38795555500005},{"$f":"Calc_Raw!K45*Escalation","v":196.54795555500002},{"$f":"K45+((Calc_Raw!L45-Calc_Raw!K45)*2)","v":236.34795555500003},{"$f":"N45-((Calc_Raw!N45-Calc_Raw!M45)*2)","v":194.96210094750009},{"$f":"Calc_Raw!N45*Escalation","v":239.38210094750005},{"$f":"N45+((Calc_Raw!O45-Calc_Raw!N45)*2)","v":290.44210094750008},{"$f":"Q45-((Calc_Raw!Q45-Calc_Raw!P45)*2)","v":210.01159558000003},{"$f":"Calc_Raw!Q45*Escalation","v":252.49159558000005},{"$f":"Q45+((Calc_Raw!R45-Calc_Raw!Q45)*2)","v":303.03159558000004}]
[{"$f":"Config_RawLabor!A46","v":"Expert"},{"$f":"Config_RawLabor!B46","v":"Nuclear Engineer "},{"$f":"Config_RawLabor!C46","v":"Reviews processes related to nuclear energy and radiation. Familiar with problems of nuclear energy systems. Reviews design of nuclear equipment. Reviews testing, operation, and maintenance of nuclear reactors. "},{"$f":"E46-((Calc_Raw!E46-Calc_Raw!D46)*2)","v":135.05189125000004},{"$f":"Calc_Raw!E46*Escalation","v":152.19189125000003},{"$f":"E46+((Calc_Raw!F46-Calc_Raw!E46)*2)","v":196.39189125000001},{"$f":"H46-((Calc_Raw!H46-Calc_Raw!G46)*2)","v":145.85157739750005},{"$f":"Calc_Raw!H46*Escalation","v":188.37157739750003},{"$f":"H46+((Calc_Raw!I46-Calc_Raw!H46)*2)","v":222.81157739750003},{"$f":"K46-((Calc_Raw!K46-Calc_Raw!J46)*2)","v":169.49290141750004},{"$f":"Calc_Raw!K46*Escalation","v":216.33290141750007},{"$f":"K46+((Calc_Raw!L46-Calc_Raw!K46)*2)","v":259.95290141750002},{"$f":"N46-((Calc_Raw!N46-Calc_Raw!M46)*2)","v":195.91404432750005},{"$f":"Calc_Raw!N46*Escalation","v":229.05404432750004},{"$f":"N46+((Calc_Raw!O46-Calc_Raw!N46)*2)","v":276.75404432750008},{"$f":"Q46-((Calc_Raw!Q46-Calc_Raw!P46)*2)","v":208.10045370000006},{"$f":"Calc_Raw!Q46*Escalation","v":260.72045370000006},{"$f":"Q46+((Calc_Raw!R46-Calc_Raw!Q46)*2)","v":315.72045370000001}]
[{"$f":"Config_RawLabor!A47","v":"Expert"},{"$f":"Config_RawLabor!B47","v":"Physicist"},{"$f":"Config_RawLabor!C47","v":"Provide reports regarding experimental physicists, force analysis, health physics, and high-energy physics. Provide expert witness testimony on issues regarding nuclear physics, optics, particle physics, quantum computing, quantum physics, radiation exposure, the science of matter and energy, shock physics, stress on materials, superconductivity, thermal exposure, and thermodynamics, as well as related topics."},{"$f":"E47-((Calc_Raw!E47-Calc_Raw!D47)*2)","v":138.87665131500003},{"$f":"Calc_Raw!E47*Escalation","v":163.29665131500005},{"$f":"E47+((Calc_Raw!F47-Calc_Raw!E47)*2)","v":259.71665131500004},{"$f":"H47-((Calc_Raw!H47-Calc_Raw!G47)*2)","v":146.35271562000003},{"$f":"Calc_Raw!H47*Escalation","v":207.65271562000004},{"$f":"H47+((Calc_Raw!I47-Calc_Raw!H47)*2)","v":330.59271562000004},{"$f":"K47-((Calc_Raw!K47-Calc_Raw!J47)*2)","v":168.81775203750007},{"$f":"Calc_Raw!K47*Escalation","v":235.05775203750002},{"$f":"K47+((Calc_Raw!L47-Calc_Raw!K47)*2)","v":346.33775203749997},{"$f":"N47-((Calc_Raw!N47-Calc_Raw!M47)*2)","v":208.97649719500009},{"$f":"Calc_Raw!N47*Escalation","v":289.41649719500009},{"$f":"N47+((Calc_Raw!O47-Calc_Raw!N47)*2)","v":397.21649719500004},{"$f":"Q47-((Calc_Raw!Q47-Calc_Raw!P47)*2)","v":260.95545627500007},{"$f":"Calc_Raw!Q47*Escalation","v":313.09545627500006},{"$f":"Q47+((Calc_Raw!R47-Calc_Raw!Q47)*2)","v":433.11545627500004}]
[{"$f":"Config_RawLabor!A48","v":"Expert"},{"$f":"Config_RawLabor!B48","v":"Process Engineer "},{"$f":"Config_RawLabor!C48","v":"Reviews continuous production and manufacturing processes with respect to output, quality, and cost. Reviews production data and applies standard scientific and statistical methods to analyze, document, and diagram production processes. Identifies process bottlenecks and recommended solutions to resolve. Recommends changes or upgrades to equipment, work methods, or other aspects of the process to improve efficiency and utilization of resources including labor, energy and raw materials."},{"$f":"E48-((Calc_Raw!E48-Calc_Raw!D48)*2)","v":117.63500669500002},{"$f":"Calc_Raw!E48*Escalation","v":136.17500669500004},{"$f":"E48+((Calc_Raw!F48-Calc_Raw!E48)*2)","v":159.23500669500004},{"$f":"H48-((Calc_Raw!H48-Calc_Raw!G48)*2)","v":137.68903603500002},{"$f":"Calc_Raw!H48*Escalation","v":162.28903603500004},{"$f":"H48+((Calc_Raw!I48-Calc_Raw!H48)*2)","v":185.12903603500001},{"$f":"K48-((Calc_Raw!K48-Calc_Raw!J48)*2)","v":161.71426293750002},{"$f":"Calc_Raw!K48*Escalation","v":191.81426293750005},{"$f":"K48+((Calc_Raw!L48-Calc_Raw!K48)*2)","v":219.05426293750006},{"$f":"N48-((Calc_Raw!N48-Calc_Raw!M48)*2)","v":192.71337294250003},{"$f":"Calc_Raw!N48*Escalation","v":228.19337294250005},{"$f":"N48+((Calc_Raw!O48-Calc_Raw!N48)*2)","v":266.87337294250005},{"$f":"Q48-((Calc_Raw!Q48-Calc_Raw!P48)*2)","v":217.07735231750002},{"$f":"Calc_Raw!Q48*Escalation","v":257.05735231750003},{"$f":"Q48+((Calc_Raw!R48-Calc_Raw!Q48)*2)","v":300.61735231750004}]
[{"$f":"Config_RawLabor!A49","v":"Expert"},{"$f":"Config_RawLabor!B49","v":"Professor - Law"},{"$f":"Config_RawLabor!C49","v":"Current or former law professor with knowledge of CPUC regulatory proceedings."},{"$f":"E49-((Calc_Raw!E49-Calc_Raw!D49)*2)","v":121.31617453500004},{"$f":"Calc_Raw!E49*Escalation","v":248.35617453500006},{"$f":"E49+((Calc_Raw!F49-Calc_Raw!E49)*2)","v":391.81617453500007},{"$f":"H49-((Calc_Raw!H49-Calc_Raw!G49)*2)","v":132.13110061750007},{"$f":"Calc_Raw!H49*Escalation","v":273.43110061750002},{"$f":"H49+((Calc_Raw!I49-Calc_Raw!H49)*2)","v":434.47110061749999},{"$f":"K49-((Calc_Raw!K49-Calc_Raw!J49)*2)","v":142.77866696250004},{"$f":"Calc_Raw!K49*Escalation","v":298.13866696250005},{"$f":"K49+((Calc_Raw!L49-Calc_Raw!K49)*2)","v":476.49866696250007},{"$f":"N49-((Calc_Raw!N49-Calc_Raw!M49)*2)","v":155.66989677000004},{"$f":"Calc_Raw!N49*Escalation","v":345.98989677000003},{"$f":"N49+((Calc_Raw!O49-Calc_Raw!N49)*2)","v":578.28989677000004},{"$f":"Q49-((Calc_Raw!Q49-Calc_Raw!P49)*2)","v":168.32243916250013},{"$f":"Calc_Raw!Q49*Escalation","v":393.02243916250006},{"$f":"Q49+((Calc_Raw!R49-Calc_Raw!Q49)*2)","v":678.34243916250011}]
[{"$f":"Config_RawLabor!A50","v":"Expert"},{"$f":"Config_RawLabor!B50","v":"Program Design/Evaluation Specialist"},{"$f":"Config_RawLabor!C50","v":"Designs marketing strategies and programs for a utility product or product line. Evaluates utility product performance, and recommends changes to current products based on market research and new trends. "},{"$f":"E50-((Calc_Raw!E50-Calc_Raw!D50)*2)","v":100.96892935750003},{"$f":"Calc_Raw!E50*Escalation","v":132.44892935750002},{"$f":"E50+((Calc_Raw!F50-Calc_Raw!E50)*2)","v":169.16892935750005},{"$f":"H50-((Calc_Raw!H50-Calc_Raw!G50)*2)","v":113.70216188500004},{"$f":"Calc_Raw!H50*Escalation","v":154.10216188500002},{"$f":"H50+((Calc_Raw!I50-Calc_Raw!H50)*2)","v":204.302161885},{"$f":"K50-((Calc_Raw!K50-Calc_Raw!J50)*2)","v":143.01321058250002},{"$f":"Calc_Raw!K50*Escalation","v":186.71321058250001},{"$f":"K50+((Calc_Raw!L50-Calc_Raw!K50)*2)","v":235.39321058250002},{"$f":"N50-((Calc_Raw!N50-Calc_Raw!M50)*2)","v":182.33957570750007},{"$f":"Calc_Raw!N50*Escalation","v":235.51957570750002},{"$f":"N50+((Calc_Raw!O50-Calc_Raw!N50)*2)","v":298.29957570750003},{"$f":"Q50-((Calc_Raw!Q50-Calc_Raw!P50)*2)","v":182.06599914250006},{"$f":"Calc_Raw!Q50*Escalation","v":247.50599914250006},{"$f":"Q50+((Calc_Raw!R50-Calc_Raw!Q50)*2)","v":295.9459991425}]
[{"$f":"Config_RawLabor!A51","v":"Expert"},{"$f":"Config_RawLabor!B51","v":"Project Engineer "},{"$f":"Config_RawLabor!C51","v":"Reviews engineering designs and implementation plans for reasonableness. Reviews industry policies and procedures to ensure data accuracy, security, and regulatory compliance. Reviews reports of production, malfunction, and maintenance to determine or address problems. Provides recommendations regarding engineering process. Coordinates with other engineering experts and coordinates their specialized contributions to the proceeding. Reviews and opins on operational plans for completing the project. Reviews progress and performance against the project plan and recommends actions to resolve operational problems and minimize delays. Develops alternate or comparative project schedules, budgets, and forecasts. "},{"$f":"E51-((Calc_Raw!E51-Calc_Raw!D51)*2)","v":124.12891998250004},{"$f":"Calc_Raw!E51*Escalation","v":145.56891998250003},{"$f":"E51+((Calc_Raw!F51-Calc_Raw!E51)*2)","v":183.06891998250003},{"$f":"H51-((Calc_Raw!H51-Calc_Raw!G51)*2)","v":143.21430718500005},{"$f":"Calc_Raw!H51*Escalation","v":174.67430718500003},{"$f":"H51+((Calc_Raw!I51-Calc_Raw!H51)*2)","v":215.31430718500008},{"$f":"K51-((Calc_Raw!K51-Calc_Raw!J51)*2)","v":167.9729409775},{"$f":"Calc_Raw!K51*Escalation","v":205.75294097750003},{"$f":"K51+((Calc_Raw!L51-Calc_Raw!K51)*2)","v":252.83294097750002},{"$f":"N51-((Calc_Raw!N51-Calc_Raw!M51)*2)","v":197.97595386500004},{"$f":"Calc_Raw!N51*Escalation","v":243.69595386500006},{"$f":"N51+((Calc_Raw!O51-Calc_Raw!N51)*2)","v":300.29595386500012},{"$f":"Q51-((Calc_Raw!Q51-Calc_Raw!P51)*2)","v":215.41481770250005},{"$f":"Calc_Raw!Q51*Escalation","v":266.31481770250002},{"$f":"Q51+((Calc_Raw!R51-Calc_Raw!Q51)*2)","v":332.55481770250009}]
[{"$f":"Config_RawLabor!A52","v":"Expert"},{"$f":"Config_RawLabor!B52","v":"Project Engineer - Construction"},{"$f":"Config_RawLabor!C52","v":"Interviews construction staff. Reviews plans and other technical documents, answers questions regarding the scope and/or scheduling of the project. Develops cost estimates or appropriate schedules. "},{"$f":"E52-((Calc_Raw!E52-Calc_Raw!D52)*2)","v":104.66704063000003},{"$f":"Calc_Raw!E52*Escalation","v":133.46704063000001},{"$f":"E52+((Calc_Raw!F52-Calc_Raw!E52)*2)","v":169.90704063000001},{"$f":"H52-((Calc_Raw!H52-Calc_Raw!G52)*2)","v":104.66704063000003},{"$f":"Calc_Raw!H52*Escalation","v":133.46704063000001},{"$f":"H52+((Calc_Raw!I52-Calc_Raw!H52)*2)","v":169.90704063000001},{"$f":"K52-((Calc_Raw!K52-Calc_Raw!J52)*2)","v":104.66704063000003},{"$f":"Calc_Raw!K52*Escalation","v":133.46704063000001},{"$f":"K52+((Calc_Raw!L52-Calc_Raw!K52)*2)","v":169.90704063000001},{"$f":"N52-((Calc_Raw!N52-Calc_Raw!M52)*2)","v":104.66704063000003},{"$f":"Calc_Raw!N52*Escalation","v":133.46704063000001},{"$f":"N52+((Calc_Raw!O52-Calc_Raw!N52)*2)","v":169.90704063000001},{"$f":"Q52-((Calc_Raw!Q52-Calc_Raw!P52)*2)","v":104.66704063000003},{"$f":"Calc_Raw!Q52*Escalation","v":133.46704063000001},{"$f":"Q52+((Calc_Raw!R52-Calc_Raw!Q52)*2)","v":169.90704063000001}]
[{"$f":"Config_RawLabor!A53","v":"Expert"},{"$f":"Config_RawLabor!B53","v":"Public Policy Analyst"},{"$f":"Config_RawLabor!C53","v":"Reviews the impact of state government policies and regulations. Analyzes proposed legislative actions and determines the potential impact. Reviews policies, plans, and programs to ensure consistency with corresponding government regulations and laws."},{"$f":"E53-((Calc_Raw!E53-Calc_Raw!D53)*2)","v":148.11341719000006},{"$f":"Calc_Raw!E53*Escalation","v":211.05341719000006},{"$f":"E53+((Calc_Raw!F53-Calc_Raw!E53)*2)","v":278.85341719000002},{"$f":"H53-((Calc_Raw!H53-Calc_Raw!G53)*2)","v":167.07964076500005},{"$f":"Calc_Raw!H53*Escalation","v":234.03964076500003},{"$f":"H53+((Calc_Raw!I53-Calc_Raw!H53)*2)","v":310.49964076499998},{"$f":"K53-((Calc_Raw!K53-Calc_Raw!J53)*2)","v":231.53483588500006},{"$f":"Calc_Raw!K53*Escalation","v":330.43483588500004},{"$f":"K53+((Calc_Raw!L53-Calc_Raw!K53)*2)","v":437.05483588500005},{"$f":"N53-((Calc_Raw!N53-Calc_Raw!M53)*2)","v":263.71550933000003},{"$f":"Calc_Raw!N53*Escalation","v":373.19550933000005},{"$f":"N53+((Calc_Raw!O53-Calc_Raw!N53)*2)","v":493.97550933000002},{"$f":"Q53-((Calc_Raw!Q53-Calc_Raw!P53)*2)","v":491.98798290249999},{"$f":"Calc_Raw!Q53*Escalation","v":650.88798290250008},{"$f":"Q53+((Calc_Raw!R53-Calc_Raw!Q53)*2)","v":868.70798290250002}]
[{"$f":"Config_RawLabor!A54","v":"Expert"},{"$f":"Config_RawLabor!B54","v":"Regulatory Affairs Specialist"},{"$f":"Config_RawLabor!C54","v":"Familiar with regulatory forms, policies, and procedures and capable of reviewing regulatory compliance. "},{"$f":"E54-((Calc_Raw!E54-Calc_Raw!D54)*2)","v":120.30180641250004},{"$f":"Calc_Raw!E54*Escalation","v":158.96180641250001},{"$f":"E54+((Calc_Raw!F54-Calc_Raw!E54)*2)","v":197.02180641250001},{"$f":"H54-((Calc_Raw!H54-Calc_Raw!G54)*2)","v":142.28852701000002},{"$f":"Calc_Raw!H54*Escalation","v":202.90852701000003},{"$f":"H54+((Calc_Raw!I54-Calc_Raw!H54)*2)","v":265.66852701000005},{"$f":"K54-((Calc_Raw!K54-Calc_Raw!J54)*2)","v":178.72294200750002},{"$f":"Calc_Raw!K54*Escalation","v":226.70294200750004},{"$f":"K54+((Calc_Raw!L54-Calc_Raw!K54)*2)","v":292.22294200750002},{"$f":"N54-((Calc_Raw!N54-Calc_Raw!M54)*2)","v":237.51378147000008},{"$f":"Calc_Raw!N54*Escalation","v":283.4337814700001},{"$f":"N54+((Calc_Raw!O54-Calc_Raw!N54)*2)","v":343.57378147000009},{"$f":"Q54-((Calc_Raw!Q54-Calc_Raw!P54)*2)","v":267.45164394750014},{"$f":"Calc_Raw!Q54*Escalation","v":319.15164394750008},{"$f":"Q54+((Calc_Raw!R54-Calc_Raw!Q54)*2)","v":386.89164394750009}]
[{"$f":"Config_RawLabor!A55","v":"Expert"},{"$f":"Config_RawLabor!B55","v":"Reliability Engineer "},{"$f":"Config_RawLabor!C55","v":"Analyzes the reliability in design, cost, weight, production and consumer satisfaction of company products. Develops the methods and measures of analysis based on customer and contractual obligations. Prepares reports, charts and diagrams to disclose results and highlight areas for further investigation. Performs root cause analysis to determine product design flaws"},{"$f":"E55-((Calc_Raw!E55-Calc_Raw!D55)*2)","v":114.34447583000002},{"$f":"Calc_Raw!E55*Escalation","v":140.18447583000003},{"$f":"E55+((Calc_Raw!F55-Calc_Raw!E55)*2)","v":156.82447583000001},{"$f":"H55-((Calc_Raw!H55-Calc_Raw!G55)*2)","v":149.49895119750002},{"$f":"Calc_Raw!H55*Escalation","v":169.05895119750002},{"$f":"H55+((Calc_Raw!I55-Calc_Raw!H55)*2)","v":192.35895119750003},{"$f":"K55-((Calc_Raw!K55-Calc_Raw!J55)*2)","v":169.96967929500002},{"$f":"Calc_Raw!K55*Escalation","v":202.50967929500004},{"$f":"K55+((Calc_Raw!L55-Calc_Raw!K55)*2)","v":230.62967929500005},{"$f":"N55-((Calc_Raw!N55-Calc_Raw!M55)*2)","v":216.42420565750007},{"$f":"Calc_Raw!N55*Escalation","v":249.58420565750004},{"$f":"N55+((Calc_Raw!O55-Calc_Raw!N55)*2)","v":286.98420565750007},{"$f":"Q55-((Calc_Raw!Q55-Calc_Raw!P55)*2)","v":213.24262815500003},{"$f":"Calc_Raw!Q55*Escalation","v":262.88262815500008},{"$f":"Q55+((Calc_Raw!R55-Calc_Raw!Q55)*2)","v":300.86262815500004}]
[{"$f":"Config_RawLabor!A56","v":"Expert"},{"$f":"Config_RawLabor!B56","v":"Reservoir Engineer "},{"$f":"Config_RawLabor!C56","v":"Responsible for identifying oil and gas reserves and developing strategies to maximize recovery. Reviews testing results for  new wells and monitors and predicts performance."},{"$f":"E56-((Calc_Raw!E56-Calc_Raw!D56)*2)","v":221.28852907000001},{"$f":"Calc_Raw!E56*Escalation","v":244.80852907000005},{"$f":"E56+((Calc_Raw!F56-Calc_Raw!E56)*2)","v":298.70852907000005},{"$f":"H56-((Calc_Raw!H56-Calc_Raw!G56)*2)","v":227.51497331500008},{"$f":"Calc_Raw!H56*Escalation","v":272.45497331500002},{"$f":"H56+((Calc_Raw!I56-Calc_Raw!H56)*2)","v":330.6149733150001},{"$f":"K56-((Calc_Raw!K56-Calc_Raw!J56)*2)","v":270.36390324000001},{"$f":"Calc_Raw!K56*Escalation","v":314.54390324000008},{"$f":"K56+((Calc_Raw!L56-Calc_Raw!K56)*2)","v":395.70390324000005},{"$f":"N56-((Calc_Raw!N56-Calc_Raw!M56)*2)","v":365.75979993000016},{"$f":"Calc_Raw!N56*Escalation","v":414.33979993000008},{"$f":"N56+((Calc_Raw!O56-Calc_Raw!N56)*2)","v":454.09979993000007},{"$f":"Q56-((Calc_Raw!Q56-Calc_Raw!P56)*2)","v":454.0302396725001},{"$f":"Calc_Raw!Q56*Escalation","v":493.07023967250007},{"$f":"Q56+((Calc_Raw!R56-Calc_Raw!Q56)*2)","v":548.25023967250013}]
[{"$f":"Config_RawLabor!A57","v":"Expert"},{"$f":"Config_RawLabor!B57","v":"Reservoir Engineering Manager"},{"$f":"Config_RawLabor!C57","v":"Reviews all aspects of engineering studies regarding the identification, evaluation, and development of oil and gas reserves within a region. Oversees the process of estimating, assessing, and planning oil and gas production and development projects. Ensures all projects, initiatives, and processes are in conformance with an organization's established policies and objectives"},{"$f":"E57-((Calc_Raw!E57-Calc_Raw!D57)*2)","v":194.22452157000001},{"$f":"Calc_Raw!E57*Escalation","v":255.30452157000005},{"$f":"E57+((Calc_Raw!F57-Calc_Raw!E57)*2)","v":339.58452156999999},{"$f":"H57-((Calc_Raw!H57-Calc_Raw!G57)*2)","v":225.99088669500009},{"$f":"Calc_Raw!H57*Escalation","v":304.11088669500009},{"$f":"H57+((Calc_Raw!I57-Calc_Raw!H57)*2)","v":406.41088669500004},{"$f":"K57-((Calc_Raw!K57-Calc_Raw!J57)*2)","v":269.28387042750001},{"$f":"Calc_Raw!K57*Escalation","v":360.46387042750007},{"$f":"K57+((Calc_Raw!L57-Calc_Raw!K57)*2)","v":477.98387042750005},{"$f":"N57-((Calc_Raw!N57-Calc_Raw!M57)*2)","v":318.43000082000009},{"$f":"Calc_Raw!N57*Escalation","v":424.2900008200001},{"$f":"N57+((Calc_Raw!O57-Calc_Raw!N57)*2)","v":556.27000082000018},{"$f":"Q57-((Calc_Raw!Q57-Calc_Raw!P57)*2)","v":359.23357578750006},{"$f":"Calc_Raw!Q57*Escalation","v":481.71357578750008},{"$f":"Q57+((Calc_Raw!R57-Calc_Raw!Q57)*2)","v":627.83357578750008}]
[{"$f":"Config_RawLabor!A58","v":"Expert"},{"$f":"Config_RawLabor!B58","v":"Sociologist"},{"$f":"Config_RawLabor!C58","v":"Provides expertise in the discipline area of sociology, including evaluating qualitative research methods in a proposed study..  Familiar with current literature and research in the selected field."},{"$f":"E58-((Calc_Raw!E58-Calc_Raw!D58)*2)","v":84.516609695000028},{"$f":"Calc_Raw!E58*Escalation","v":131.97660969500001},{"$f":"E58+((Calc_Raw!F58-Calc_Raw!E58)*2)","v":268.076609695},{"$f":"H58-((Calc_Raw!H58-Calc_Raw!G58)*2)","v":98.088975665000021},{"$f":"Calc_Raw!H58*Escalation","v":157.20897566500003},{"$f":"H58+((Calc_Raw!I58-Calc_Raw!H58)*2)","v":320.608975665},{"$f":"K58-((Calc_Raw!K58-Calc_Raw!J58)*2)","v":116.94585084500005},{"$f":"Calc_Raw!K58*Escalation","v":186.34585084500003},{"$f":"K58+((Calc_Raw!L58-Calc_Raw!K58)*2)","v":377.48585084500007},{"$f":"N58-((Calc_Raw!N58-Calc_Raw!M58)*2)","v":138.35475527250003},{"$f":"Calc_Raw!N58*Escalation","v":219.33475527250005},{"$f":"N58+((Calc_Raw!O58-Calc_Raw!N58)*2)","v":440.01475527250005},{"$f":"Q58-((Calc_Raw!Q58-Calc_Raw!P58)*2)","v":155.97742206250004},{"$f":"Calc_Raw!Q58*Escalation","v":249.01742206250006},{"$f":"Q58+((Calc_Raw!R58-Calc_Raw!Q58)*2)","v":497.03742206250001}]
[{"$f":"Config_RawLabor!A59","v":"Expert"},{"$f":"Config_RawLabor!B59","v":"Software Engineer "},{"$f":"Config_RawLabor!C59","v":"Reviews the design and code of software applications. Reviews s coding, debugging, testing and troubleshooting procedures throughout the application development process. Provides consultation on software application components of complex projects. "},{"$f":"E59-((Calc_Raw!E59-Calc_Raw!D59)*2)","v":105.44550268750001},{"$f":"Calc_Raw!E59*Escalation","v":136.18550268750002},{"$f":"E59+((Calc_Raw!F59-Calc_Raw!E59)*2)","v":180.36550268750003},{"$f":"H59-((Calc_Raw!H59-Calc_Raw!G59)*2)","v":139.28189228000002},{"$f":"Calc_Raw!H59*Escalation","v":173.14189228000004},{"$f":"H59+((Calc_Raw!I59-Calc_Raw!H59)*2)","v":210.34189228000002},{"$f":"K59-((Calc_Raw!K59-Calc_Raw!J59)*2)","v":175.39347756000006},{"$f":"Calc_Raw!K59*Escalation","v":216.13347756000002},{"$f":"K59+((Calc_Raw!L59-Calc_Raw!K59)*2)","v":260.09347756000005},{"$f":"N59-((Calc_Raw!N59-Calc_Raw!M59)*2)","v":216.10890066500008},{"$f":"Calc_Raw!N59*Escalation","v":262.16890066500008},{"$f":"N59+((Calc_Raw!O59-Calc_Raw!N59)*2)","v":314.12890066500006},{"$f":"Q59-((Calc_Raw!Q59-Calc_Raw!P59)*2)","v":233.49598611000005},{"$f":"Calc_Raw!Q59*Escalation","v":288.13598611000003},{"$f":"Q59+((Calc_Raw!R59-Calc_Raw!Q59)*2)","v":354.97598611000006}]
[{"$f":"Config_RawLabor!A60","v":"Expert"},{"$f":"Config_RawLabor!B60","v":"Statistician "},{"$f":"Config_RawLabor!C60","v":"Analyzes and interprets data from various sources. Compiles reports, charts, and tables based on established statistical methods."},{"$f":"E60-((Calc_Raw!E60-Calc_Raw!D60)*2)","v":97.610511547500025},{"$f":"Calc_Raw!E60*Escalation","v":112.59051154750001},{"$f":"E60+((Calc_Raw!F60-Calc_Raw!E60)*2)","v":128.39051154750001},{"$f":"H60-((Calc_Raw!H60-Calc_Raw!G60)*2)","v":113.99183088000001},{"$f":"Calc_Raw!H60*Escalation","v":147.11183088000001},{"$f":"H60+((Calc_Raw!I60-Calc_Raw!H60)*2)","v":199.85183088000002},{"$f":"K60-((Calc_Raw!K60-Calc_Raw!J60)*2)","v":117.38964705000001},{"$f":"Calc_Raw!K60*Escalation","v":158.06964705000001},{"$f":"K60+((Calc_Raw!L60-Calc_Raw!K60)*2)","v":196.18964705000002},{"$f":"N60-((Calc_Raw!N60-Calc_Raw!M60)*2)","v":150.26904747},{"$f":"Calc_Raw!N60*Escalation","v":191.06904747000002},{"$f":"N60+((Calc_Raw!O60-Calc_Raw!N60)*2)","v":237.72904747000004},{"$f":"Q60-((Calc_Raw!Q60-Calc_Raw!P60)*2)","v":203.54308824500004},{"$f":"Calc_Raw!Q60*Escalation","v":245.96308824500005},{"$f":"Q60+((Calc_Raw!R60-Calc_Raw!Q60)*2)","v":326.32308824500001}]
[{"$f":"Config_RawLabor!A61","v":"Expert"},{"$f":"Config_RawLabor!B61","v":"Structural Engineer "},{"$f":"Config_RawLabor!C61","v":"Reviews load-bearing structures or structural elements, such as buildings, bridges, or roadways. Performs analysis of building materials used in construction. Reviews  blueprints or specifications used during construction and ensures all projects comply with applicable codes and regulations. Determines cause of structural failures, damages, and defects through site investigations. Provides reports detailing investigations and assessment of damages to the structure."},{"$f":"E61-((Calc_Raw!E61-Calc_Raw!D61)*2)","v":84.76301232000003},{"$f":"Calc_Raw!E61*Escalation","v":128.30301232000002},{"$f":"E61+((Calc_Raw!F61-Calc_Raw!E61)*2)","v":143.42301232000005},{"$f":"H61-((Calc_Raw!H61-Calc_Raw!G61)*2)","v":136.9203684},{"$f":"Calc_Raw!H61*Escalation","v":156.18036840000005},{"$f":"H61+((Calc_Raw!I61-Calc_Raw!H61)*2)","v":191.20036840000003},{"$f":"K61-((Calc_Raw!K61-Calc_Raw!J61)*2)","v":149.91928323250005},{"$f":"Calc_Raw!K61*Escalation","v":196.99928323250003},{"$f":"K61+((Calc_Raw!L61-Calc_Raw!K61)*2)","v":234.67928323250004},{"$f":"N61-((Calc_Raw!N61-Calc_Raw!M61)*2)","v":166.06064681250004},{"$f":"Calc_Raw!N61*Escalation","v":214.38064681250003},{"$f":"N61+((Calc_Raw!O61-Calc_Raw!N61)*2)","v":244.14064681250002},{"$f":"Q61-((Calc_Raw!Q61-Calc_Raw!P61)*2)","v":193.11130985250006},{"$f":"Calc_Raw!Q61*Escalation","v":249.31130985250005},{"$f":"Q61+((Calc_Raw!R61-Calc_Raw!Q61)*2)","v":283.91130985250004}]
[{"$f":"Config_RawLabor!A62","v":"Expert"},{"$f":"Config_RawLabor!B62","v":"Systems Engineer "},{"$f":"Config_RawLabor!C62","v":"Reviews the plan and design of an organization's systems infrastructure. Ensures the accuracy and effectiveness of the system to meet business/customers' requirements. Monitors the performance of systems and suggests improvements. Verifies and reviews system related documents/reports including installation procedures. "},{"$f":"E62-((Calc_Raw!E62-Calc_Raw!D62)*2)","v":108.37823350500003},{"$f":"Calc_Raw!E62*Escalation","v":143.43823350500003},{"$f":"E62+((Calc_Raw!F62-Calc_Raw!E62)*2)","v":173.29823350500004},{"$f":"H62-((Calc_Raw!H62-Calc_Raw!G62)*2)","v":134.51584512750006},{"$f":"Calc_Raw!H62*Escalation","v":171.95584512750006},{"$f":"H62+((Calc_Raw!I62-Calc_Raw!H62)*2)","v":211.59584512750004},{"$f":"K62-((Calc_Raw!K62-Calc_Raw!J62)*2)","v":173.67745018750003},{"$f":"Calc_Raw!K62*Escalation","v":209.65745018750005},{"$f":"K62+((Calc_Raw!L62-Calc_Raw!K62)*2)","v":252.21745018750005},{"$f":"N62-((Calc_Raw!N62-Calc_Raw!M62)*2)","v":204.56814341250004},{"$f":"Calc_Raw!N62*Escalation","v":247.12814341250004},{"$f":"N62+((Calc_Raw!O62-Calc_Raw!N62)*2)","v":295.00814341250003},{"$f":"Q62-((Calc_Raw!Q62-Calc_Raw!P62)*2)","v":229.14335053500002},{"$f":"Calc_Raw!Q62*Escalation","v":281.94335053500004},{"$f":"Q62+((Calc_Raw!R62-Calc_Raw!Q62)*2)","v":341.30335053500005}]
[{"$f":"Config_RawLabor!A63","v":"Expert"},{"$f":"Config_RawLabor!B63","v":"Telecommunications Economist"},{"$f":"Config_RawLabor!C63","v":"Reviews and analyzes telecommunication rating schedules and schedule tables. Reviews billing and compliance to ensure conformance to company and government standards. "},{"$f":"E63-((Calc_Raw!E63-Calc_Raw!D63)*2)","v":116.082942575},{"$f":"Calc_Raw!E63*Escalation","v":136.34294257500002},{"$f":"E63+((Calc_Raw!F63-Calc_Raw!E63)*2)","v":169.20294257500004},{"$f":"H63-((Calc_Raw!H63-Calc_Raw!G63)*2)","v":135.23498794500003},{"$f":"Calc_Raw!H63*Escalation","v":162.41498794500004},{"$f":"H63+((Calc_Raw!I63-Calc_Raw!H63)*2)","v":202.514987945},{"$f":"K63-((Calc_Raw!K63-Calc_Raw!J63)*2)","v":161.10699844250004},{"$f":"Calc_Raw!K63*Escalation","v":192.50699844250002},{"$f":"K63+((Calc_Raw!L63-Calc_Raw!K63)*2)","v":238.14699844250001},{"$f":"N63-((Calc_Raw!N63-Calc_Raw!M63)*2)","v":190.71608866750003},{"$f":"Calc_Raw!N63*Escalation","v":234.17608866750007},{"$f":"N63+((Calc_Raw!O63-Calc_Raw!N63)*2)","v":279.85608866749999},{"$f":"Q63-((Calc_Raw!Q63-Calc_Raw!P63)*2)","v":223.89375128500006},{"$f":"Calc_Raw!Q63*Escalation","v":280.89375128500006},{"$f":"Q63+((Calc_Raw!R63-Calc_Raw!Q63)*2)","v":326.61375128500009}]
[{"$f":"Config_RawLabor!A64","v":"Expert"},{"$f":"Config_RawLabor!B64","v":"Telecommunications Engineer "},{"$f":"Config_RawLabor!C64","v":"Reviews the design, implementation and maintenance of telecommunication networks, systems and equipment,. Analyzes existing networks and equipment and identifies opportunities for improvement. Recommends alternate solutions that better meet consumer requirements."},{"$f":"E64-((Calc_Raw!E64-Calc_Raw!D64)*2)","v":107.71747156500001},{"$f":"Calc_Raw!E64*Escalation","v":134.95747156500005},{"$f":"E64+((Calc_Raw!F64-Calc_Raw!E64)*2)","v":168.077471565},{"$f":"H64-((Calc_Raw!H64-Calc_Raw!G64)*2)","v":126.42724255000002},{"$f":"Calc_Raw!H64*Escalation","v":164.36724255000001},{"$f":"H64+((Calc_Raw!I64-Calc_Raw!H64)*2)","v":203.78724255000003},{"$f":"K64-((Calc_Raw!K64-Calc_Raw!J64)*2)","v":156.00613188500006},{"$f":"Calc_Raw!K64*Escalation","v":196.08613188500004},{"$f":"K64+((Calc_Raw!L64-Calc_Raw!K64)*2)","v":238.28613188500003},{"$f":"N64-((Calc_Raw!N64-Calc_Raw!M64)*2)","v":170.77991037000001},{"$f":"Calc_Raw!N64*Escalation","v":214.99991037000004},{"$f":"N64+((Calc_Raw!O64-Calc_Raw!N64)*2)","v":252.27991037000001},{"$f":"Q64-((Calc_Raw!Q64-Calc_Raw!P64)*2)","v":189.17813300750007},{"$f":"Calc_Raw!Q64*Escalation","v":239.29813300750007},{"$f":"Q64+((Calc_Raw!R64-Calc_Raw!Q64)*2)","v":285.99813300750009}]
[{"$f":"Config_RawLabor!A65","v":"Expert"},{"$f":"Config_RawLabor!B65","v":"Top Economic Executive"},{"$f":"Config_RawLabor!C65","v":"Provides economic data, prepares interpretative reports, and provides leadership for the use of economic data and adaptation of economic models. Communicates the results of economic studies to the stakeholders and sets guidelines for proceeding economic strategies. Understands the macro and micro economic environment and its impact on the industry."},{"$f":"E65-((Calc_Raw!E65-Calc_Raw!D65)*2)","v":380.71811518250013},{"$f":"Calc_Raw!E65*Escalation","v":488.15811518250007},{"$f":"E65+((Calc_Raw!F65-Calc_Raw!E65)*2)","v":564.33811518250013},{"$f":"H65-((Calc_Raw!H65-Calc_Raw!G65)*2)","v":459.08733289500015},{"$f":"Calc_Raw!H65*Escalation","v":575.32733289500015},{"$f":"H65+((Calc_Raw!I65-Calc_Raw!H65)*2)","v":681.12733289500011},{"$f":"K65-((Calc_Raw!K65-Calc_Raw!J65)*2)","v":542.64299954000001},{"$f":"Calc_Raw!K65*Escalation","v":683.58299954000006},{"$f":"K65+((Calc_Raw!L65-Calc_Raw!K65)*2)","v":799.26299954000012},{"$f":"N65-((Calc_Raw!N65-Calc_Raw!M65)*2)","v":637.23164785750009},{"$f":"Calc_Raw!N65*Escalation","v":806.29164785750027},{"$f":"N65+((Calc_Raw!O65-Calc_Raw!N65)*2)","v":928.09164785750022},{"$f":"Q65-((Calc_Raw!Q65-Calc_Raw!P65)*2)","v":725.84398776250009},{"$f":"Calc_Raw!Q65*Escalation","v":912.78398776250015},{"$f":"Q65+((Calc_Raw!R65-Calc_Raw!Q65)*2)","v":1049.5239877625002}]
[{"$f":"Config_RawLabor!A66","v":"Expert"},{"$f":"Config_RawLabor!B66","v":"Urban Planner"},{"$f":"Config_RawLabor!C66","v":"Reviews  land-use plans for the beneficial development of urban areas."},{"$f":"E66-((Calc_Raw!E66-Calc_Raw!D66)*2)","v":62.693134657500011},{"$f":"Calc_Raw!E66*Escalation","v":69.053134657500024},{"$f":"E66+((Calc_Raw!F66-Calc_Raw!E66)*2)","v":87.753134657500013},{"$f":"H66-((Calc_Raw!H66-Calc_Raw!G66)*2)","v":73.097093222500021},{"$f":"Calc_Raw!H66*Escalation","v":82.257093222500018},{"$f":"H66+((Calc_Raw!I66-Calc_Raw!H66)*2)","v":105.01709322250001},{"$f":"K66-((Calc_Raw!K66-Calc_Raw!J66)*2)","v":87.057274332500029},{"$f":"Calc_Raw!K66*Escalation","v":97.497274332500027},{"$f":"K66+((Calc_Raw!L66-Calc_Raw!K66)*2)","v":123.49727433250003},{"$f":"N66-((Calc_Raw!N66-Calc_Raw!M66)*2)","v":102.90318199500001},{"$f":"Calc_Raw!N66*Escalation","v":114.76318199500002},{"$f":"N66+((Calc_Raw!O66-Calc_Raw!N66)*2)","v":143.68318199500001},{"$f":"Q66-((Calc_Raw!Q66-Calc_Raw!P66)*2)","v":116.157250895},{"$f":"Calc_Raw!Q66*Escalation","v":130.29725089500002},{"$f":"Q66+((Calc_Raw!R66-Calc_Raw!Q66)*2)","v":162.157250895}]
[{"$f":"Config_RawLabor!A67","v":"Expert"},{"$f":"Config_RawLabor!B67","v":"Utility Rate Analyst"},{"$f":"Config_RawLabor!C67","v":"Monitors, reviews, and evaluates service rates and charges for various public utilities. Calculates cost-of-service and performs related rate analysis. Ensures filings comply with the Federal Energy Regulatory Commission requirements."},{"$f":"E67-((Calc_Raw!E67-Calc_Raw!D67)*2)","v":121.39336413500001},{"$f":"Calc_Raw!E67*Escalation","v":150.95336413500002},{"$f":"E67+((Calc_Raw!F67-Calc_Raw!E67)*2)","v":174.77336413500001},{"$f":"H67-((Calc_Raw!H67-Calc_Raw!G67)*2)","v":141.34684751750007},{"$f":"Calc_Raw!H67*Escalation","v":179.80684751750005},{"$f":"H67+((Calc_Raw!I67-Calc_Raw!H67)*2)","v":209.22684751750006},{"$f":"K67-((Calc_Raw!K67-Calc_Raw!J67)*2)","v":168.42112771250001},{"$f":"Calc_Raw!K67*Escalation","v":213.12112771250005},{"$f":"K67+((Calc_Raw!L67-Calc_Raw!K67)*2)","v":245.96112771250003},{"$f":"N67-((Calc_Raw!N67-Calc_Raw!M67)*2)","v":199.12471674250003},{"$f":"Calc_Raw!N67*Escalation","v":250.86471674250004},{"$f":"N67+((Calc_Raw!O67-Calc_Raw!N67)*2)","v":286.0447167425001},{"$f":"Q67-((Calc_Raw!Q67-Calc_Raw!P67)*2)","v":224.68875648750003},{"$f":"Calc_Raw!Q67*Escalation","v":284.80875648750009},{"$f":"Q67+((Calc_Raw!R67-Calc_Raw!Q67)*2)","v":322.72875648750005}]
[{"$f":"Config_RawLabor!A68","v":"Expert"},{"$f":"Config_RawLabor!B68","v":"Utility System Planner/Operator/Manager"},{"$f":"Config_RawLabor!C68","v":"Familiar with the proper operation of utility plant equipment including controls, operation, repairs, and perventive maintenance. Equipment may include bioenergy, hydro, nuclear, solar, thermal or wind generation or gas storage and transport."},{"$f":"E68-((Calc_Raw!E68-Calc_Raw!D68)*2)","v":111.92184128500003},{"$f":"Calc_Raw!E68*Escalation","v":154.94184128500004},{"$f":"E68+((Calc_Raw!F68-Calc_Raw!E68)*2)","v":218.44184128500004},{"$f":"H68-((Calc_Raw!H68-Calc_Raw!G68)*2)","v":144.47148215500002},{"$f":"Calc_Raw!H68*Escalation","v":187.31148215500005},{"$f":"H68+((Calc_Raw!I68-Calc_Raw!H68)*2)","v":232.99148215500006},{"$f":"K68-((Calc_Raw!K68-Calc_Raw!J68)*2)","v":177.66605276500005},{"$f":"Calc_Raw!K68*Escalation","v":217.24605276500003},{"$f":"K68+((Calc_Raw!L68-Calc_Raw!K68)*2)","v":270.00605276500005},{"$f":"N68-((Calc_Raw!N68-Calc_Raw!M68)*2)","v":197.18966054500004},{"$f":"Calc_Raw!N68*Escalation","v":228.74966054500004},{"$f":"N68+((Calc_Raw!O68-Calc_Raw!N68)*2)","v":264.46966054500007},{"$f":"Q68-((Calc_Raw!Q68-Calc_Raw!P68)*2)","v":217.25997280000007},{"$f":"Calc_Raw!Q68*Escalation","v":261.97997280000004},{"$f":"Q68+((Calc_Raw!R68-Calc_Raw!Q68)*2)","v":318.21997280000011}]
[{"$f":"Config_RawLabor!A69","v":"Expert"},{"$f":"Config_RawLabor!B69","v":"Wildfire Scientist"},{"$f":"Config_RawLabor!C69","v":"Uses analysis software to analyze wildfire risks and likely paths. Reviews approaches to preventing, controlling, or mitigating wildfire damage."},{"$f":"E69-((Calc_Raw!E69-Calc_Raw!D69)*2)","v":74.676177730000035},{"$f":"Calc_Raw!E69*Escalation","v":109.53617773000002},{"$f":"E69+((Calc_Raw!F69-Calc_Raw!E69)*2)","v":157.11617773000003},{"$f":"H69-((Calc_Raw!H69-Calc_Raw!G69)*2)","v":86.755682767500019},{"$f":"Calc_Raw!H69*Escalation","v":130.47568276750002},{"$f":"H69+((Calc_Raw!I69-Calc_Raw!H69)*2)","v":188.01568276750004},{"$f":"K69-((Calc_Raw!K69-Calc_Raw!J69)*2)","v":103.42795349500003},{"$f":"Calc_Raw!K69*Escalation","v":154.64795349500002},{"$f":"K69+((Calc_Raw!L69-Calc_Raw!K69)*2)","v":221.18795349500004},{"$f":"N69-((Calc_Raw!N69-Calc_Raw!M69)*2)","v":122.33199792750005},{"$f":"Calc_Raw!N69*Escalation","v":182.03199792750004},{"$f":"N69+((Calc_Raw!O69-Calc_Raw!N69)*2)","v":257.49199792750005},{"$f":"Q69-((Calc_Raw!Q69-Calc_Raw!P69)*2)","v":137.96609232500006},{"$f":"Calc_Raw!Q69*Escalation","v":206.66609232500005},{"$f":"Q69+((Calc_Raw!R69-Calc_Raw!Q69)*2)","v":290.66609232500002}]
[{"$f":"Config_RawLabor!A70","v":"Legal"},{"$f":"Config_RawLabor!B70","v":"Attorney "},{"$f":"Config_RawLabor!C70","v":"Attorney authorized by the California Bar to practice law in California. Higher experience levels should have experience with areas of law and procedures relevant to CPUC matters, such as environmental law or utility regulation."},{"$f":"E70-((Calc_Raw!E70-Calc_Raw!D70)*2)","v":174.96888923000003},{"$f":"Calc_Raw!E70*Escalation","v":233.38888923000005},{"$f":"E70+((Calc_Raw!F70-Calc_Raw!E70)*2)","v":299.46888923000006},{"$f":"H70-((Calc_Raw!H70-Calc_Raw!G70)*2)","v":215.06966935250006},{"$f":"Calc_Raw!H70*Escalation","v":305.98966935250002},{"$f":"H70+((Calc_Raw!I70-Calc_Raw!H70)*2)","v":404.22966935250003},{"$f":"K70-((Calc_Raw!K70-Calc_Raw!J70)*2)","v":309.75797626000008},{"$f":"Calc_Raw!K70*Escalation","v":413.87797626000008},{"$f":"K70+((Calc_Raw!L70-Calc_Raw!K70)*2)","v":519.4779762600001},{"$f":"N70-((Calc_Raw!N70-Calc_Raw!M70)*2)","v":381.81318075500008},{"$f":"Calc_Raw!N70*Escalation","v":497.15318075500011},{"$f":"N70+((Calc_Raw!O70-Calc_Raw!N70)*2)","v":619.29318075500009},{"$f":"Q70-((Calc_Raw!Q70-Calc_Raw!P70)*2)","v":486.31150275500011},{"$f":"Calc_Raw!Q70*Escalation","v":606.31150275500011},{"$f":"Q70+((Calc_Raw!R70-Calc_Raw!Q70)*2)","v":699.03150275500013}]
[{"$f":"Config_RawLabor!A71","v":"Legal"},{"$f":"Config_RawLabor!B71","v":"Legal Director"},{"$f":"Config_RawLabor!C71","v":"Oversees the legal work of the organization, including providing strategic direction. Alternate title may be General Counsel. Responsible for coordinating and supervising a legal team. Participates in the most complex legal actions. Oversees all legal operations including case assignment, hiring, supervision and professional development of the legal staff, as well as budgeting."},{"$f":"E71-((Calc_Raw!E71-Calc_Raw!D71)*2)","v":286.19189217500008},{"$f":"Calc_Raw!E71*Escalation","v":374.81189217500008},{"$f":"E71+((Calc_Raw!F71-Calc_Raw!E71)*2)","v":478.35189217500005},{"$f":"H71-((Calc_Raw!H71-Calc_Raw!G71)*2)","v":333.00803297250008},{"$f":"Calc_Raw!H71*Escalation","v":446.46803297250011},{"$f":"H71+((Calc_Raw!I71-Calc_Raw!H71)*2)","v":572.50803297250013},{"$f":"K71-((Calc_Raw!K71-Calc_Raw!J71)*2)","v":396.84694986500006},{"$f":"Calc_Raw!K71*Escalation","v":529.18694986500009},{"$f":"K71+((Calc_Raw!L71-Calc_Raw!K71)*2)","v":673.24694986500015},{"$f":"N71-((Calc_Raw!N71-Calc_Raw!M71)*2)","v":469.23517090500013},{"$f":"Calc_Raw!N71*Escalation","v":622.89517090500021},{"$f":"N71+((Calc_Raw!O71-Calc_Raw!N71)*2)","v":783.35517090500025},{"$f":"Q71-((Calc_Raw!Q71-Calc_Raw!P71)*2)","v":529.37898266500019},{"$f":"Calc_Raw!Q71*Escalation","v":707.19898266500013},{"$f":"Q71+((Calc_Raw!R71-Calc_Raw!Q71)*2)","v":884.05898266500026}]
[{"$f":"Config_RawLabor!A72","v":"Legal"},{"$f":"Config_RawLabor!B72","v":"Paralegal "},{"$f":"Config_RawLabor!C72","v":"Assists and supports attorneys with research. Researches and analyzes law sources such as statutes, recorded judicial decisions, legal articles, treaties, constitutions, and legal codes. Prepares legal documents. May direct the work of clerical or other support staff. May be responsible for the creation and administration of legal databases. Has complete understanding of technical legal terminology."},{"$f":"E72-((Calc_Raw!E72-Calc_Raw!D72)*2)","v":88.52663885000004},{"$f":"Calc_Raw!E72*Escalation","v":113.56663885000003},{"$f":"E72+((Calc_Raw!F72-Calc_Raw!E72)*2)","v":141.48663885000002},{"$f":"H72-((Calc_Raw!H72-Calc_Raw!G72)*2)","v":102.22717074500002},{"$f":"Calc_Raw!H72*Escalation","v":130.50717074500002},{"$f":"H72+((Calc_Raw!I72-Calc_Raw!H72)*2)","v":163.18717074500003},{"$f":"K72-((Calc_Raw!K72-Calc_Raw!J72)*2)","v":122.73537829000003},{"$f":"Calc_Raw!K72*Escalation","v":153.53537829000004},{"$f":"K72+((Calc_Raw!L72-Calc_Raw!K72)*2)","v":186.55537829000002},{"$f":"N72-((Calc_Raw!N72-Calc_Raw!M72)*2)","v":139.11161695750008},{"$f":"Calc_Raw!N72*Escalation","v":177.79161695750003},{"$f":"N72+((Calc_Raw!O72-Calc_Raw!N72)*2)","v":218.51161695750005},{"$f":"Q72-((Calc_Raw!Q72-Calc_Raw!P72)*2)","v":154.50110690250006},{"$f":"Calc_Raw!Q72*Escalation","v":197.46110690250003},{"$f":"Q72+((Calc_Raw!R72-Calc_Raw!Q72)*2)","v":242.70110690250004}]
[{"$f":"Config_RawLabor!A73","v":"Legal"},{"$f":"Config_RawLabor!B73","v":"Paralegal Manager"},{"$f":"Config_RawLabor!C73","v":"Often the most senior Paralegal individual. Validates and oversees the preparation of legal documents. Provides research utilizing databases and legal libraries. Coordinates with attorneys on special requests or highly complex projects. Note that supervisory and training support is not reimbursable."},{"$f":"E73-((Calc_Raw!E73-Calc_Raw!D73)*2)","v":114.04392518500003},{"$f":"Calc_Raw!E73*Escalation","v":149.483925185},{"$f":"E73+((Calc_Raw!F73-Calc_Raw!E73)*2)","v":199.423925185},{"$f":"H73-((Calc_Raw!H73-Calc_Raw!G73)*2)","v":132.70451276250003},{"$f":"Calc_Raw!H73*Escalation","v":178.06451276250004},{"$f":"H73+((Calc_Raw!I73-Calc_Raw!H73)*2)","v":238.64451276250003},{"$f":"K73-((Calc_Raw!K73-Calc_Raw!J73)*2)","v":158.13341719000005},{"$f":"Calc_Raw!K73*Escalation","v":211.05341719000006},{"$f":"K73+((Calc_Raw!L73-Calc_Raw!K73)*2)","v":280.69341719000005},{"$f":"N73-((Calc_Raw!N73-Calc_Raw!M73)*2)","v":186.99915049000003},{"$f":"Calc_Raw!N73*Escalation","v":248.41915049000005},{"$f":"N73+((Calc_Raw!O73-Calc_Raw!N73)*2)","v":326.65915049000006},{"$f":"Q73-((Calc_Raw!Q73-Calc_Raw!P73)*2)","v":210.95781446750004},{"$f":"Calc_Raw!Q73*Escalation","v":282.03781446750003},{"$f":"Q73+((Calc_Raw!R73-Calc_Raw!Q73)*2)","v":368.69781446750011}]
[{"$f":"Config_RawLabor!A74","v":"Legal"},{"$f":"Config_RawLabor!B74","v":"Paralegal Supervisor"},{"$f":"Config_RawLabor!C74","v":"Reviews prepared legal documents to ensure the work is complete and accurate. Prepares complex documents. Note that supervisory and training time is not reimbursable."},{"$f":"E74-((Calc_Raw!E74-Calc_Raw!D74)*2)","v":97.370857645000029},{"$f":"Calc_Raw!E74*Escalation","v":120.85085764500002},{"$f":"E74+((Calc_Raw!F74-Calc_Raw!E74)*2)","v":194.95085764500001},{"$f":"H74-((Calc_Raw!H74-Calc_Raw!G74)*2)","v":113.37253713750002},{"$f":"Calc_Raw!H74*Escalation","v":143.95253713750003},{"$f":"H74+((Calc_Raw!I74-Calc_Raw!H74)*2)","v":233.2325371375},{"$f":"K74-((Calc_Raw!K74-Calc_Raw!J74)*2)","v":135.10285408000004},{"$f":"Calc_Raw!K74*Escalation","v":170.62285408000002},{"$f":"K74+((Calc_Raw!L74-Calc_Raw!K74)*2)","v":274.46285408},{"$f":"N74-((Calc_Raw!N74-Calc_Raw!M74)*2)","v":159.72081648750003},{"$f":"Calc_Raw!N74*Escalation","v":200.84081648750004},{"$f":"N74+((Calc_Raw!O74-Calc_Raw!N74)*2)","v":319.66081648750003},{"$f":"Q74-((Calc_Raw!Q74-Calc_Raw!P74)*2)","v":180.23494107000002},{"$f":"Calc_Raw!Q74*Escalation","v":228.01494107000005},{"$f":"Q74+((Calc_Raw!R74-Calc_Raw!Q74)*2)","v":360.95494107000002}]
[{"$f":"Config_RawLabor!A75","v":"School"},{"$f":"Config_RawLabor!B75","v":"Assistant School Principal"},{"$f":"Config_RawLabor!C75","v":"Assists the school principal in the management of education and teaching programs for an assigned school. Coordinates school activities and ensures that budgetary guidelines are met. May help in developing the curriculum, staffing, reviewing faculty performance, and creating an atmosphere conducive to scholarly pursuits. "},{"$f":"E75-((Calc_Raw!E75-Calc_Raw!D75)*2)","v":65.003235617500025},{"$f":"Calc_Raw!E75*Escalation","v":84.503235617500025},{"$f":"E75+((Calc_Raw!F75-Calc_Raw!E75)*2)","v":112.00323561750002},{"$f":"H75-((Calc_Raw!H75-Calc_Raw!G75)*2)","v":75.656568075000024},{"$f":"Calc_Raw!H75*Escalation","v":100.65656807500002},{"$f":"H75+((Calc_Raw!I75-Calc_Raw!H75)*2)","v":134.03656807500002},{"$f":"K75-((Calc_Raw!K75-Calc_Raw!J75)*2)","v":90.147946747500029},{"$f":"Calc_Raw!K75*Escalation","v":119.30794674750003},{"$f":"K75+((Calc_Raw!L75-Calc_Raw!K75)*2)","v":157.64794674750004},{"$f":"N75-((Calc_Raw!N75-Calc_Raw!M75)*2)","v":106.59637965000002},{"$f":"Calc_Raw!N75*Escalation","v":140.43637965000005},{"$f":"N75+((Calc_Raw!O75-Calc_Raw!N75)*2)","v":183.45637965000003},{"$f":"Q75-((Calc_Raw!Q75-Calc_Raw!P75)*2)","v":120.274126075},{"$f":"Calc_Raw!Q75*Escalation","v":159.43412607500002},{"$f":"Q75+((Calc_Raw!R75-Calc_Raw!Q75)*2)","v":207.05412607500003}]
[{"$f":"Config_RawLabor!A76","v":"School"},{"$f":"Config_RawLabor!B76","v":"Public School Teacher"},{"$f":"Config_RawLabor!C76","v":"Prepares lesson plans and instructs students in an assigned school. Develops and implements grade appropriate course work to meet the academic of children in a K-12 classroom setting. Evaluates and monitors student's performance. Assesses and documents students' progress. Participates in development and implementation of Individual Education Plans for specific students. May participate in implementing special programs for students. May supervise teaching assistants. "},{"$f":"E76-((Calc_Raw!E76-Calc_Raw!D76)*2)","v":44.078199200000014},{"$f":"Calc_Raw!E76*Escalation","v":57.09819920000001},{"$f":"E76+((Calc_Raw!F76-Calc_Raw!E76)*2)","v":74.158199200000013},{"$f":"H76-((Calc_Raw!H76-Calc_Raw!G76)*2)","v":51.294031400000009},{"$f":"Calc_Raw!H76*Escalation","v":68.014031400000007},{"$f":"H76+((Calc_Raw!I76-Calc_Raw!H76)*2)","v":88.734031400000006},{"$f":"K76-((Calc_Raw!K76-Calc_Raw!J76)*2)","v":61.099718392500009},{"$f":"Calc_Raw!K76*Escalation","v":80.619718392500019},{"$f":"K76+((Calc_Raw!L76-Calc_Raw!K76)*2)","v":104.35971839250003},{"$f":"N76-((Calc_Raw!N76-Calc_Raw!M76)*2)","v":72.254268192500035},{"$f":"Calc_Raw!N76*Escalation","v":94.894268192500022},{"$f":"N76+((Calc_Raw!O76-Calc_Raw!N76)*2)","v":121.43426819250004},{"$f":"Q76-((Calc_Raw!Q76-Calc_Raw!P76)*2)","v":81.521363012500032},{"$f":"Calc_Raw!Q76*Escalation","v":107.74136301250003},{"$f":"Q76+((Calc_Raw!R76-Calc_Raw!Q76)*2)","v":137.06136301250001}]
[{"$f":"Config_RawLabor!A77","v":"School"},{"$f":"Config_RawLabor!B77","v":"School Principal"},{"$f":"Config_RawLabor!C77","v":"Directs and oversees education and teaching programs for an assigned school. Responsibilities include developing the curriculum, staffing departments, reviewing faculty performance, and creating an atmosphere conducive to scholarly pursuits. Ensures all school activities are within budgetary guidelines. "},{"$f":"E77-((Calc_Raw!E77-Calc_Raw!D77)*2)","v":80.792535077500006},{"$f":"Calc_Raw!E77*Escalation","v":102.05253507750002},{"$f":"E77+((Calc_Raw!F77-Calc_Raw!E77)*2)","v":126.77253507750002},{"$f":"H77-((Calc_Raw!H77-Calc_Raw!G77)*2)","v":94.035081127500035},{"$f":"Calc_Raw!H77*Escalation","v":121.57508112750003},{"$f":"H77+((Calc_Raw!I77-Calc_Raw!H77)*2)","v":151.73508112750002},{"$f":"K77-((Calc_Raw!K77-Calc_Raw!J77)*2)","v":112.03948103250005},{"$f":"Calc_Raw!K77*Escalation","v":144.09948103250002},{"$f":"K77+((Calc_Raw!L77-Calc_Raw!K77)*2)","v":178.41948103250002},{"$f":"N77-((Calc_Raw!N77-Calc_Raw!M77)*2)","v":132.48474280750003},{"$f":"Calc_Raw!N77*Escalation","v":169.60474280750003},{"$f":"N77+((Calc_Raw!O77-Calc_Raw!N77)*2)","v":207.56474280750001},{"$f":"Q77-((Calc_Raw!Q77-Calc_Raw!P77)*2)","v":149.47947840500001},{"$f":"Calc_Raw!Q77*Escalation","v":192.55947840500005},{"$f":"Q77+((Calc_Raw!R77-Calc_Raw!Q77)*2)","v":234.23947840500006}]
[{"$f":"Config_RawLabor!A78","v":"School"},{"$f":"Config_RawLabor!B78","v":"School Superintendent"},{"$f":"Config_RawLabor!C78","v":"Directs and manages a school district. Oversees all aspects of the district's operational policies, objectives, initiatives. Responsible for the attainment of short- and long-term financial and operational goals for the school system. "},{"$f":"E78-((Calc_Raw!E78-Calc_Raw!D78)*2)","v":99.912532450000015},{"$f":"Calc_Raw!E78*Escalation","v":150.51253245000004},{"$f":"E78+((Calc_Raw!F78-Calc_Raw!E78)*2)","v":210.41253245000001},{"$f":"H78-((Calc_Raw!H78-Calc_Raw!G78)*2)","v":116.04204789250002},{"$f":"Calc_Raw!H78*Escalation","v":179.28204789250003},{"$f":"H78+((Calc_Raw!I78-Calc_Raw!H78)*2)","v":251.78204789250003},{"$f":"K78-((Calc_Raw!K78-Calc_Raw!J78)*2)","v":138.34186415500002},{"$f":"Calc_Raw!K78*Escalation","v":212.50186415500005},{"$f":"K78+((Calc_Raw!L78-Calc_Raw!K78)*2)","v":296.18186415500008},{"$f":"N78-((Calc_Raw!N78-Calc_Raw!M78)*2)","v":163.64999726750003},{"$f":"Calc_Raw!N78*Escalation","v":250.12999726750004},{"$f":"N78+((Calc_Raw!O78-Calc_Raw!N78)*2)","v":344.7699972675},{"$f":"Q78-((Calc_Raw!Q78-Calc_Raw!P78)*2)","v":184.5195730800001},{"$f":"Calc_Raw!Q78*Escalation","v":283.97957308000008},{"$f":"Q78+((Calc_Raw!R78-Calc_Raw!Q78)*2)","v":389.15957308000003}]

{"sheet":"Calc_Raw","index":6,"n_rows":78,"n_cols":18,"rows_kept":78,"cut":false,"hidden":true,"merged":[]}
["Category","CPUC Role","Description","Min 1","Med 1","Max 1","Min 2","Med 2","Max 2","Min 3","Med 3","Max 3","Min 4","Med 4","Max 4","Min 5","Med 5","Max 5"]
[{"$f":"Config_RawLabor!A2","v":"Advocate"},{"$f":"Config_RawLabor!B2","v":"Administrative Analyst"},{"$f":"Config_RawLabor!C2","v":"Assist in the planning, development and management of a comprehensive  program within the eight county service area. Assist in the administration and development of specific programs and projects. Specific areas of focus include human resources, information systems, or grant writing. Represent orgination to community groups, partners, and funders. Coordinate community events, public relations activities. "},{"$f":"ROUND(((Config_RawLabor!D2/Config!$B$7)/Config_RawLabor!$G2)*VLOOKUP($A2,Config!$A$2:$B$5,2,0),2)","v":47.25},{"$f":"ROUND(((Config_RawLabor!E2/Config!$B$7)/Config_RawLabor!$G2)*VLOOKUP($A2,Config!$A$2:$B$5,2,0),2)","v":51.46},{"$f":"ROUND(((Config_RawLabor!F2/Config!$B$7)/Config_RawLabor!$G2)*VLOOKUP($A2,Config!$A$2:$B$5,2,0),2)","v":57.18},{"$f":"ROUND(((Config_RawLabor!H2/Config!$B$7)/Config_RawLabor!$K2)*VLOOKUP($A2,Config!$A$2:$B$5,2,0),2)","v":55.69},{"$f":"ROUND(((Config_RawLabor!I2/Config!$B$7)/Config_RawLabor!$K2)*VLOOKUP($A2,Config!$A$2:$B$5,2,0),2)","v":61.3},{"$f":"ROUND(((Config_RawLabor!J2/Config!$B$7)/Config_RawLabor!$K2)*VLOOKUP($A2,Config!$A$2:$B$5,2,0),2)","v":68.3},{"$f":"ROUND(((Config_RawLabor!L2/Config!$B$7)/Config_RawLabor!$O2)*VLOOKUP($A2,Config!$A$2:$B$5,2,0),2)","v":66.17},{"$f":"ROUND(((Config_RawLabor!M2/Config!$B$7)/Config_RawLabor!$O2)*VLOOKUP($A2,Config!$A$2:$B$5,2,0),2)","v":72.66},{"$f":"ROUND(((Config_RawLabor!N2/Config!$B$7)/Config_RawLabor!$O2)*VLOOKUP($A2,Config!$A$2:$B$5,2,0),2)","v":80.58},{"$f":"ROUND(((Config_RawLabor!P2/Config!$B$7)/Config_RawLabor!$S2)*VLOOKUP($A2,Config!$A$2:$B$5,2,0),2)","v":78.05},{"$f":"ROUND(((Config_RawLabor!Q2/Config!$B$7)/Config_RawLabor!$S2)*VLOOKUP($A2,Config!$A$2:$B$5,2,0),2)","v":85.52},{"$f":"ROUND(((Config_RawLabor!R2/Config!$B$7)/Config_RawLabor!$S2)*VLOOKUP($A2,Config!$A$2:$B$5,2,0),2)","v":94.21},{"$f":"ROUND(((Config_RawLabor!T2/Config!$B$7)/Config_RawLabor!$W2)*VLOOKUP($A2,Config!$A$2:$B$5,2,0),2)","v":88.35},{"$f":"ROUND(((Config_RawLabor!U2/Config!$B$7)/Config_RawLabor!$W2)*VLOOKUP($A2,Config!$A$2:$B$5,2,0),2)","v":97.1},{"$f":"ROUND(((Config_RawLabor!V2/Config!$B$7)/Config_RawLabor!$W2)*VLOOKUP($A2,Config!$A$2:$B$5,2,0),2)","v":106.59}]
[{"$f":"Config_RawLabor!A3","v":"Advocate"},{"$f":"Config_RawLabor!B3","v":"Advocate - Not Otherwise Classified"},{"$f":"Config_RawLabor!C3","v":"Used for advocate roles that are not better classified as one of the more detailed roles, including for example consumer advocates. May also be used for advocates that fill multiple subroles."},{"$f":"ROUND(((Config_RawLabor!D3/Config!$B$7)/Config_RawLabor!$G3)*VLOOKUP($A3,Config!$A$2:$B$5,2,0),2)","v":67.63},{"$f":"ROUND(((Config_RawLabor!E3/Config!$B$7)/Config_RawLabor!$G3)*VLOOKUP($A3,Config!$A$2:$B$5,2,0),2)","v":79.33},{"$f":"ROUND(((Config_RawLabor!F3/Config!$B$7)/Config_RawLabor!$G3)*VLOOKUP($A3,Config!$A$2:$B$5,2,0),2)","v":94.45},{"$f":"ROUND(((Config_RawLabor!H3/Config!$B$7)/Config_RawLabor!$K3)*VLOOKUP($A3,Config!$A$2:$B$5,2,0),2)","v":79.22},{"$f":"ROUND(((Config_RawLabor!I3/Config!$B$7)/Config_RawLabor!$K3)*VLOOKUP($A3,Config!$A$2:$B$5,2,0),2)","v":93.9},{"$f":"ROUND(((Config_RawLabor!J3/Config!$B$7)/Config_RawLabor!$K3)*VLOOKUP($A3,Config!$A$2:$B$5,2,0),2)","v":112.09},{"$f":"ROUND(((Config_RawLabor!L3/Config!$B$7)/Config_RawLabor!$O3)*VLOOKUP($A3,Config!$A$2:$B$5,2,0),2)","v":94.41},{"$f":"ROUND(((Config_RawLabor!M3/Config!$B$7)/Config_RawLabor!$O3)*VLOOKUP($A3,Config!$A$2:$B$5,2,0),2)","v":111.59},{"$f":"ROUND(((Config_RawLabor!N3/Config!$B$7)/Config_RawLabor!$O3)*VLOOKUP($A3,Config!$A$2:$B$5,2,0),2)","v":132.49},{"$f":"ROUND(((Config_RawLabor!P3/Config!$B$7)/Config_RawLabor!$S3)*VLOOKUP($A3,Config!$A$2:$B$5,2,0),2)","v":111.2},{"$f":"ROUND(((Config_RawLabor!Q3/Config!$B$7)/Config_RawLabor!$S3)*VLOOKUP($A3,Config!$A$2:$B$5,2,0),2)","v":131.28},{"$f":"ROUND(((Config_RawLabor!R3/Config!$B$7)/Config_RawLabor!$S3)*VLOOKUP($A3,Config!$A$2:$B$5,2,0),2)","v":154.97},{"$f":"ROUND(((Config_RawLabor!T3/Config!$B$7)/Config_RawLabor!$W3)*VLOOKUP($A3,Config!$A$2:$B$5,2,0),2)","v":125.69},{"$f":"ROUND(((Config_RawLabor!U3/Config!$B$7)/Config_RawLabor!$W3)*VLOOKUP($A3,Config!$A$2:$B$5,2,0),2)","v":148.77000000000001},{"$f":"ROUND(((Config_RawLabor!V3/Config!$B$7)/Config_RawLabor!$W3)*VLOOKUP($A3,Config!$A$2:$B$5,2,0),2)","v":175.08}]
[{"$f":"Config_RawLabor!A4","v":"Advocate"},{"$f":"Config_RawLabor!B4","v":"Community Development Manager"},{"$f":"Config_RawLabor!C4","v":"Responsible for the supervision, support, and training of staff within a specific program, and for providing operational and program support to the program director. Meets program and organizational goals. Model and support organization's values."},{"$f":"ROUND(((Config_RawLabor!D4/Config!$B$7)/Config_RawLabor!$G4)*VLOOKUP($A4,Config!$A$2:$B$5,2,0),2)","v":61.61},{"$f":"ROUND(((Config_RawLabor!E4/Config!$B$7)/Config_RawLabor!$G4)*VLOOKUP($A4,Config!$A$2:$B$5,2,0),2)","v":71.400000000000006},{"$f":"ROUND(((Config_RawLabor!F4/Config!$B$7)/Config_RawLabor!$G4)*VLOOKUP($A4,Config!$A$2:$B$5,2,0),2)","v":82.42},{"$f":"ROUND(((Config_RawLabor!H4/Config!$B$7)/Config_RawLabor!$K4)*VLOOKUP($A4,Config!$A$2:$B$5,2,0),2)","v":72.61},{"$f":"ROUND(((Config_RawLabor!I4/Config!$B$7)/Config_RawLabor!$K4)*VLOOKUP($A4,Config!$A$2:$B$5,2,0),2)","v":85.05},{"$f":"ROUND(((Config_RawLabor!J4/Config!$B$7)/Config_RawLabor!$K4)*VLOOKUP($A4,Config!$A$2:$B$5,2,0),2)","v":98.45},{"$f":"ROUND(((Config_RawLabor!L4/Config!$B$7)/Config_RawLabor!$O4)*VLOOKUP($A4,Config!$A$2:$B$5,2,0),2)","v":86.27},{"$f":"ROUND(((Config_RawLabor!M4/Config!$B$7)/Config_RawLabor!$O4)*VLOOKUP($A4,Config!$A$2:$B$5,2,0),2)","v":100.8},{"$f":"ROUND(((Config_RawLabor!N4/Config!$B$7)/Config_RawLabor!$O4)*VLOOKUP($A4,Config!$A$2:$B$5,2,0),2)","v":116.16},{"$f":"ROUND(((Config_RawLabor!P4/Config!$B$7)/Config_RawLabor!$S4)*VLOOKUP($A4,Config!$A$2:$B$5,2,0),2)","v":101.76},{"$f":"ROUND(((Config_RawLabor!Q4/Config!$B$7)/Config_RawLabor!$S4)*VLOOKUP($A4,Config!$A$2:$B$5,2,0),2)","v":118.65},{"$f":"ROUND(((Config_RawLabor!R4/Config!$B$7)/Config_RawLabor!$S4)*VLOOKUP($A4,Config!$A$2:$B$5,2,0),2)","v":135.81},{"$f":"ROUND(((Config_RawLabor!T4/Config!$B$7)/Config_RawLabor!$W4)*VLOOKUP($A4,Config!$A$2:$B$5,2,0),2)","v":115.2},{"$f":"ROUND(((Config_RawLabor!U4/Config!$B$7)/Config_RawLabor!$W4)*VLOOKUP($A4,Config!$A$2:$B$5,2,0),2)","v":134.71},{"$f":"ROUND(((Config_RawLabor!V4/Config!$B$7)/Config_RawLabor!$W4)*VLOOKUP($A4,Config!$A$2:$B$5,2,0),2)","v":153.65}]
[{"$f":"Config_RawLabor!A5","v":"Advocate"},{"$f":"Config_RawLabor!B5","v":"Community Development Program Director"},{"$f":"Config_RawLabor!C5","v":"A senior management position which provides leadership and management to one or more programs and participates in the overall management of (non-profit) organization. Coordinate, plan and develop comprehensive programs for implementing the organization's goals. On-going in-depth review and analysis of program operations, community needs and program resources. Represents the organization to community, agencies, the media, and participants. "},{"$f":"ROUND(((Config_RawLabor!D5/Config!$B$7)/Config_RawLabor!$G5)*VLOOKUP($A5,Config!$A$2:$B$5,2,0),2)","v":87.22},{"$f":"ROUND(((Config_RawLabor!E5/Config!$B$7)/Config_RawLabor!$G5)*VLOOKUP($A5,Config!$A$2:$B$5,2,0),2)","v":99.43},{"$f":"ROUND(((Config_RawLabor!F5/Config!$B$7)/Config_RawLabor!$G5)*VLOOKUP($A5,Config!$A$2:$B$5,2,0),2)","v":113.72},{"$f":"ROUND(((Config_RawLabor!H5/Config!$B$7)/Config_RawLabor!$K5)*VLOOKUP($A5,Config!$A$2:$B$5,2,0),2)","v":102.79},{"$f":"ROUND(((Config_RawLabor!I5/Config!$B$7)/Config_RawLabor!$K5)*VLOOKUP($A5,Config!$A$2:$B$5,2,0),2)","v":118.44},{"$f":"ROUND(((Config_RawLabor!J5/Config!$B$7)/Config_RawLabor!$K5)*VLOOKUP($A5,Config!$A$2:$B$5,2,0),2)","v":135.84},{"$f":"ROUND(((Config_RawLabor!L5/Config!$B$7)/Config_RawLabor!$O5)*VLOOKUP($A5,Config!$A$2:$B$5,2,0),2)","v":122.13},{"$f":"ROUND(((Config_RawLabor!M5/Config!$B$7)/Config_RawLabor!$O5)*VLOOKUP($A5,Config!$A$2:$B$5,2,0),2)","v":140.38999999999999},{"$f":"ROUND(((Config_RawLabor!N5/Config!$B$7)/Config_RawLabor!$O5)*VLOOKUP($A5,Config!$A$2:$B$5,2,0),2)","v":160.26},{"$f":"ROUND(((Config_RawLabor!P5/Config!$B$7)/Config_RawLabor!$S5)*VLOOKUP($A5,Config!$A$2:$B$5,2,0),2)","v":144.06},{"$f":"ROUND(((Config_RawLabor!Q5/Config!$B$7)/Config_RawLabor!$S5)*VLOOKUP($A5,Config!$A$2:$B$5,2,0),2)","v":165.25},{"$f":"ROUND(((Config_RawLabor!R5/Config!$B$7)/Config_RawLabor!$S5)*VLOOKUP($A5,Config!$A$2:$B$5,2,0),2)","v":187.37},{"$f":"ROUND(((Config_RawLabor!T5/Config!$B$7)/Config_RawLabor!$W5)*VLOOKUP($A5,Config!$A$2:$B$5,2,0),2)","v":163.09},{"$f":"ROUND(((Config_RawLabor!U5/Config!$B$7)/Config_RawLabor!$W5)*VLOOKUP($A5,Config!$A$2:$B$5,2,0),2)","v":187.61},{"$f":"ROUND(((Config_RawLabor!V5/Config!$B$7)/Config_RawLabor!$W5)*VLOOKUP($A5,Config!$A$2:$B$5,2,0),2)","v":211.99}]
[{"$f":"Config_RawLabor!A6","v":"Advocate"},{"$f":"Config_RawLabor!B6","v":"Community Development Senior Specialist"},{"$f":"Config_RawLabor!C6","v":"Work closely with low-income, rural residents to assist them in the development and management of community facilities. Perform advocacy and technical assistance role regarding the needs of rural, low income people for safe and affordable water, waste water and energyfacilities. Responsible for multiple community development projects. Can include organizing, research, loan and grant writing. In addition, the SR CD Specialist provides leadership and support to CD staff, serves as a resource for other staff and effectively and positively represents the organization to staff, participants and the community "},{"$f":"ROUND(((Config_RawLabor!D6/Config!$B$7)/Config_RawLabor!$G6)*VLOOKUP($A6,Config!$A$2:$B$5,2,0),2)","v":70.099999999999994},{"$f":"ROUND(((Config_RawLabor!E6/Config!$B$7)/Config_RawLabor!$G6)*VLOOKUP($A6,Config!$A$2:$B$5,2,0),2)","v":89.36},{"$f":"ROUND(((Config_RawLabor!F6/Config!$B$7)/Config_RawLabor!$G6)*VLOOKUP($A6,Config!$A$2:$B$5,2,0),2)","v":108.54},{"$f":"ROUND(((Config_RawLabor!H6/Config!$B$7)/Config_RawLabor!$K6)*VLOOKUP($A6,Config!$A$2:$B$5,2,0),2)","v":82.61},{"$f":"ROUND(((Config_RawLabor!I6/Config!$B$7)/Config_RawLabor!$K6)*VLOOKUP($A6,Config!$A$2:$B$5,2,0),2)","v":106.45},{"$f":"ROUND(((Config_RawLabor!J6/Config!$B$7)/Config_RawLabor!$K6)*VLOOKUP($A6,Config!$A$2:$B$5,2,0),2)","v":129.65},{"$f":"ROUND(((Config_RawLabor!L6/Config!$B$7)/Config_RawLabor!$O6)*VLOOKUP($A6,Config!$A$2:$B$5,2,0),2)","v":98.16},{"$f":"ROUND(((Config_RawLabor!M6/Config!$B$7)/Config_RawLabor!$O6)*VLOOKUP($A6,Config!$A$2:$B$5,2,0),2)","v":126.17},{"$f":"ROUND(((Config_RawLabor!N6/Config!$B$7)/Config_RawLabor!$O6)*VLOOKUP($A6,Config!$A$2:$B$5,2,0),2)","v":152.96},{"$f":"ROUND(((Config_RawLabor!P6/Config!$B$7)/Config_RawLabor!$S6)*VLOOKUP($A6,Config!$A$2:$B$5,2,0),2)","v":115.78},{"$f":"ROUND(((Config_RawLabor!Q6/Config!$B$7)/Config_RawLabor!$S6)*VLOOKUP($A6,Config!$A$2:$B$5,2,0),2)","v":148.51},{"$f":"ROUND(((Config_RawLabor!R6/Config!$B$7)/Config_RawLabor!$S6)*VLOOKUP($A6,Config!$A$2:$B$5,2,0),2)","v":178.84},{"$f":"ROUND(((Config_RawLabor!T6/Config!$B$7)/Config_RawLabor!$W6)*VLOOKUP($A6,Config!$A$2:$B$5,2,0),2)","v":131.07},{"$f":"ROUND(((Config_RawLabor!U6/Config!$B$7)/Config_RawLabor!$W6)*VLOOKUP($A6,Config!$A$2:$B$5,2,0),2)","v":168.61},{"$f":"ROUND(((Config_RawLabor!V6/Config!$B$7)/Config_RawLabor!$W6)*VLOOKUP($A6,Config!$A$2:$B$5,2,0),2)","v":202.34}]
[{"$f":"Config_RawLabor!A7","v":"Advocate"},{"$f":"Config_RawLabor!B7","v":"Community Development Specialist"},{"$f":"Config_RawLabor!C7","v":"Work closely with low-income, rural residents to assist them in the development and management of community facilities. Perform advocacy and technical assistance role regarding the needs of rural, low income people for safe and affordable water,waste water and energy facilities. Responsible for multiple community development projects. Can include organizing, research, loan and grant writing. "},{"$f":"ROUND(((Config_RawLabor!D7/Config!$B$7)/Config_RawLabor!$G7)*VLOOKUP($A7,Config!$A$2:$B$5,2,0),2)","v":35.67},{"$f":"ROUND(((Config_RawLabor!E7/Config!$B$7)/Config_RawLabor!$G7)*VLOOKUP($A7,Config!$A$2:$B$5,2,0),2)","v":41.57},{"$f":"ROUND(((Config_RawLabor!F7/Config!$B$7)/Config_RawLabor!$G7)*VLOOKUP($A7,Config!$A$2:$B$5,2,0),2)","v":48.08},{"$f":"ROUND(((Config_RawLabor!H7/Config!$B$7)/Config_RawLabor!$K7)*VLOOKUP($A7,Config!$A$2:$B$5,2,0),2)","v":42.04},{"$f":"ROUND(((Config_RawLabor!I7/Config!$B$7)/Config_RawLabor!$K7)*VLOOKUP($A7,Config!$A$2:$B$5,2,0),2)","v":49.52},{"$f":"ROUND(((Config_RawLabor!J7/Config!$B$7)/Config_RawLabor!$K7)*VLOOKUP($A7,Config!$A$2:$B$5,2,0),2)","v":57.44},{"$f":"ROUND(((Config_RawLabor!L7/Config!$B$7)/Config_RawLabor!$O7)*VLOOKUP($A7,Config!$A$2:$B$5,2,0),2)","v":49.96},{"$f":"ROUND(((Config_RawLabor!M7/Config!$B$7)/Config_RawLabor!$O7)*VLOOKUP($A7,Config!$A$2:$B$5,2,0),2)","v":58.69},{"$f":"ROUND(((Config_RawLabor!N7/Config!$B$7)/Config_RawLabor!$O7)*VLOOKUP($A7,Config!$A$2:$B$5,2,0),2)","v":67.760000000000005},{"$f":"ROUND(((Config_RawLabor!P7/Config!$B$7)/Config_RawLabor!$S7)*VLOOKUP($A7,Config!$A$2:$B$5,2,0),2)","v":58.92},{"$f":"ROUND(((Config_RawLabor!Q7/Config!$B$7)/Config_RawLabor!$S7)*VLOOKUP($A7,Config!$A$2:$B$5,2,0),2)","v":69.08},{"$f":"ROUND(((Config_RawLabor!R7/Config!$B$7)/Config_RawLabor!$S7)*VLOOKUP($A7,Config!$A$2:$B$5,2,0),2)","v":79.23},{"$f":"ROUND(((Config_RawLabor!T7/Config!$B$7)/Config_RawLabor!$W7)*VLOOKUP($A7,Config!$A$2:$B$5,2,0),2)","v":66.709999999999994},{"$f":"ROUND(((Config_RawLabor!U7/Config!$B$7)/Config_RawLabor!$W7)*VLOOKUP($A7,Config!$A$2:$B$5,2,0),2)","v":78.430000000000007},{"$f":"ROUND(((Config_RawLabor!V7/Config!$B$7)/Config_RawLabor!$W7)*VLOOKUP($A7,Config!$A$2:$B$5,2,0),2)","v":89.64}]
[{"$f":"Config_RawLabor!A8","v":"Advocate"},{"$f":"Config_RawLabor!B8","v":"Executive Director"},{"$f":"Config_RawLabor!C8","v":"Provides overall direction and guidance to a non-profit organization's programs. Responsible for the success of special events, community outreach initiatives, and fundraising activities. Acts as a spokesperson and represents the organization's programs to the public. Assesses needs and ensures that program objectives are met, initiates changes to maintain member satisfaction and engagement. "},{"$f":"ROUND(((Config_RawLabor!D8/Config!$B$7)/Config_RawLabor!$G8)*VLOOKUP($A8,Config!$A$2:$B$5,2,0),2)","v":113.82},{"$f":"ROUND(((Config_RawLabor!E8/Config!$B$7)/Config_RawLabor!$G8)*VLOOKUP($A8,Config!$A$2:$B$5,2,0),2)","v":143.1},{"$f":"ROUND(((Config_RawLabor!F8/Config!$B$7)/Config_RawLabor!$G8)*VLOOKUP($A8,Config!$A$2:$B$5,2,0),2)","v":187.47},{"$f":"ROUND(((Config_RawLabor!H8/Config!$B$7)/Config_RawLabor!$K8)*VLOOKUP($A8,Config!$A$2:$B$5,2,0),2)","v":134.15},{"$f":"ROUND(((Config_RawLabor!I8/Config!$B$7)/Config_RawLabor!$K8)*VLOOKUP($A8,Config!$A$2:$B$5,2,0),2)","v":170.46},{"$f":"ROUND(((Config_RawLabor!J8/Config!$B$7)/Config_RawLabor!$K8)*VLOOKUP($A8,Config!$A$2:$B$5,2,0),2)","v":223.94},{"$f":"ROUND(((Config_RawLabor!L8/Config!$B$7)/Config_RawLabor!$O8)*VLOOKUP($A8,Config!$A$2:$B$5,2,0),2)","v":159.38999999999999},{"$f":"ROUND(((Config_RawLabor!M8/Config!$B$7)/Config_RawLabor!$O8)*VLOOKUP($A8,Config!$A$2:$B$5,2,0),2)","v":202.04},{"$f":"ROUND(((Config_RawLabor!N8/Config!$B$7)/Config_RawLabor!$O8)*VLOOKUP($A8,Config!$A$2:$B$5,2,0),2)","v":264.2},{"$f":"ROUND(((Config_RawLabor!P8/Config!$B$7)/Config_RawLabor!$S8)*VLOOKUP($A8,Config!$A$2:$B$5,2,0),2)","v":188},{"$f":"ROUND(((Config_RawLabor!Q8/Config!$B$7)/Config_RawLabor!$S8)*VLOOKUP($A8,Config!$A$2:$B$5,2,0),2)","v":237.82},{"$f":"ROUND(((Config_RawLabor!R8/Config!$B$7)/Config_RawLabor!$S8)*VLOOKUP($A8,Config!$A$2:$B$5,2,0),2)","v":308.89999999999998},{"$f":"ROUND(((Config_RawLabor!T8/Config!$B$7)/Config_RawLabor!$W8)*VLOOKUP($A8,Config!$A$2:$B$5,2,0),2)","v":212.83},{"$f":"ROUND(((Config_RawLabor!U8/Config!$B$7)/Config_RawLabor!$W8)*VLOOKUP($A8,Config!$A$2:$B$5,2,0),2)","v":270},{"$f":"ROUND(((Config_RawLabor!V8/Config!$B$7)/Config_RawLabor!$W8)*VLOOKUP($A8,Config!$A$2:$B$5,2,0),2)","v":349.49}]
[{"$f":"Config_RawLabor!A9","v":"Advocate"},{"$f":"Config_RawLabor!B9","v":"Housing Program Manager"},{"$f":"Config_RawLabor!C9","v":"Oversees operations of a housing program. Sets budget and policies, hires and trains staff, and oversees occupancy eligibility/operations. Develops and provides reports or documentation needed to secure/maintain funding or grants. May lead the work of others. "},{"$f":"ROUND(((Config_RawLabor!D9/Config!$B$7)/Config_RawLabor!$G9)*VLOOKUP($A9,Config!$A$2:$B$5,2,0),2)","v":32.619999999999997},{"$f":"ROUND(((Config_RawLabor!E9/Config!$B$7)/Config_RawLabor!$G9)*VLOOKUP($A9,Config!$A$2:$B$5,2,0),2)","v":45.61},{"$f":"ROUND(((Config_RawLabor!F9/Config!$B$7)/Config_RawLabor!$G9)*VLOOKUP($A9,Config!$A$2:$B$5,2,0),2)","v":60.1},{"$f":"ROUND(((Config_RawLabor!H9/Config!$B$7)/Config_RawLabor!$K9)*VLOOKUP($A9,Config!$A$2:$B$5,2,0),2)","v":38.44},{"$f":"ROUND(((Config_RawLabor!I9/Config!$B$7)/Config_RawLabor!$K9)*VLOOKUP($A9,Config!$A$2:$B$5,2,0),2)","v":54.34},{"$f":"ROUND(((Config_RawLabor!J9/Config!$B$7)/Config_RawLabor!$K9)*VLOOKUP($A9,Config!$A$2:$B$5,2,0),2)","v":71.790000000000006},{"$f":"ROUND(((Config_RawLabor!L9/Config!$B$7)/Config_RawLabor!$O9)*VLOOKUP($A9,Config!$A$2:$B$5,2,0),2)","v":45.68},{"$f":"ROUND(((Config_RawLabor!M9/Config!$B$7)/Config_RawLabor!$O9)*VLOOKUP($A9,Config!$A$2:$B$5,2,0),2)","v":64.400000000000006},{"$f":"ROUND(((Config_RawLabor!N9/Config!$B$7)/Config_RawLabor!$O9)*VLOOKUP($A9,Config!$A$2:$B$5,2,0),2)","v":84.7},{"$f":"ROUND(((Config_RawLabor!P9/Config!$B$7)/Config_RawLabor!$S9)*VLOOKUP($A9,Config!$A$2:$B$5,2,0),2)","v":53.88},{"$f":"ROUND(((Config_RawLabor!Q9/Config!$B$7)/Config_RawLabor!$S9)*VLOOKUP($A9,Config!$A$2:$B$5,2,0),2)","v":75.81},{"$f":"ROUND(((Config_RawLabor!R9/Config!$B$7)/Config_RawLabor!$S9)*VLOOKUP($A9,Config!$A$2:$B$5,2,0),2)","v":99.03},{"$f":"ROUND(((Config_RawLabor!T9/Config!$B$7)/Config_RawLabor!$W9)*VLOOKUP($A9,Config!$A$2:$B$5,2,0),2)","v":60.99},{"$f":"ROUND(((Config_RawLabor!U9/Config!$B$7)/Config_RawLabor!$W9)*VLOOKUP($A9,Config!$A$2:$B$5,2,0),2)","v":86.07},{"$f":"ROUND(((Config_RawLabor!V9/Config!$B$7)/Config_RawLabor!$W9)*VLOOKUP($A9,Config!$A$2:$B$5,2,0),2)","v":112.04}]
[{"$f":"Config_RawLabor!A10","v":"Advocate"},{"$f":"Config_RawLabor!B10","v":"Program Coordinator"},{"$f":"Config_RawLabor!C10","v":"Plans and coordinates one or more programs for a non-profit organization, including fundraising, budgeting, and community outreach. Develops and implements programs that align with the organization's mission and support the organization's goals. Creates program materials, establishes staffing requirements, and ensures that program achieves stated objectives. May be responsible for special events that publicize the organization and its programs to the community. "},{"$f":"ROUND(((Config_RawLabor!D10/Config!$B$7)/Config_RawLabor!$G10)*VLOOKUP($A10,Config!$A$2:$B$5,2,0),2)","v":60.19},{"$f":"ROUND(((Config_RawLabor!E10/Config!$B$7)/Config_RawLabor!$G10)*VLOOKUP($A10,Config!$A$2:$B$5,2,0),2)","v":68.290000000000006},{"$f":"ROUND(((Config_RawLabor!F10/Config!$B$7)/Config_RawLabor!$G10)*VLOOKUP($A10,Config!$A$2:$B$5,2,0),2)","v":79.17},{"$f":"ROUND(((Config_RawLabor!H10/Config!$B$7)/Config_RawLabor!$K10)*VLOOKUP($A10,Config!$A$2:$B$5,2,0),2)","v":70.94},{"$f":"ROUND(((Config_RawLabor!I10/Config!$B$7)/Config_RawLabor!$K10)*VLOOKUP($A10,Config!$A$2:$B$5,2,0),2)","v":81.34},{"$f":"ROUND(((Config_RawLabor!J10/Config!$B$7)/Config_RawLabor!$K10)*VLOOKUP($A10,Config!$A$2:$B$5,2,0),2)","v":94.56},{"$f":"ROUND(((Config_RawLabor!L10/Config!$B$7)/Config_RawLabor!$O10)*VLOOKUP($A10,Config!$A$2:$B$5,2,0),2)","v":84.29},{"$f":"ROUND(((Config_RawLabor!M10/Config!$B$7)/Config_RawLabor!$O10)*VLOOKUP($A10,Config!$A$2:$B$5,2,0),2)","v":96.41},{"$f":"ROUND(((Config_RawLabor!N10/Config!$B$7)/Config_RawLabor!$O10)*VLOOKUP($A10,Config!$A$2:$B$5,2,0),2)","v":111.57},{"$f":"ROUND(((Config_RawLabor!P10/Config!$B$7)/Config_RawLabor!$S10)*VLOOKUP($A10,Config!$A$2:$B$5,2,0),2)","v":99.42},{"$f":"ROUND(((Config_RawLabor!Q10/Config!$B$7)/Config_RawLabor!$S10)*VLOOKUP($A10,Config!$A$2:$B$5,2,0),2)","v":113.48},{"$f":"ROUND(((Config_RawLabor!R10/Config!$B$7)/Config_RawLabor!$S10)*VLOOKUP($A10,Config!$A$2:$B$5,2,0),2)","v":130.44},{"$f":"ROUND(((Config_RawLabor!T10/Config!$B$7)/Config_RawLabor!$W10)*VLOOKUP($A10,Config!$A$2:$B$5,2,0),2)","v":112.55},{"$f":"ROUND(((Config_RawLabor!U10/Config!$B$7)/Config_RawLabor!$W10)*VLOOKUP($A10,Config!$A$2:$B$5,2,0),2)","v":128.84},{"$f":"ROUND(((Config_RawLabor!V10/Config!$B$7)/Config_RawLabor!$W10)*VLOOKUP($A10,Config!$A$2:$B$5,2,0),2)","v":147.58000000000001}]
[{"$f":"Config_RawLabor!A11","v":"Advocate"},{"$f":"Config_RawLabor!B11","v":"Program Manager"},{"$f":"Config_RawLabor!C11","v":"Manages a team that coordinates programs for a non-profit organization. Designs programs that align with the organization's mission and support the organization's goals. Establishes fundraising and development goals, identifies potential donors or sources of funding, and plans outreach strategies. Schedules and forecasts planning for special events that publicize the organization and its programs to the community. May assist in the development of grants applications or proposals. "},{"$f":"ROUND(((Config_RawLabor!D11/Config!$B$7)/Config_RawLabor!$G11)*VLOOKUP($A11,Config!$A$2:$B$5,2,0),2)","v":86.93},{"$f":"ROUND(((Config_RawLabor!E11/Config!$B$7)/Config_RawLabor!$G11)*VLOOKUP($A11,Config!$A$2:$B$5,2,0),2)","v":92.1},{"$f":"ROUND(((Config_RawLabor!F11/Config!$B$7)/Config_RawLabor!$G11)*VLOOKUP($A11,Config!$A$2:$B$5,2,0),2)","v":103.5},{"$f":"ROUND(((Config_RawLabor!H11/Config!$B$7)/Config_RawLabor!$K11)*VLOOKUP($A11,Config!$A$2:$B$5,2,0),2)","v":102.45},{"$f":"ROUND(((Config_RawLabor!I11/Config!$B$7)/Config_RawLabor!$K11)*VLOOKUP($A11,Config!$A$2:$B$5,2,0),2)","v":109.71},{"$f":"ROUND(((Config_RawLabor!J11/Config!$B$7)/Config_RawLabor!$K11)*VLOOKUP($A11,Config!$A$2:$B$5,2,0),2)","v":123.63},{"$f":"ROUND(((Config_RawLabor!L11/Config!$B$7)/Config_RawLabor!$O11)*VLOOKUP($A11,Config!$A$2:$B$5,2,0),2)","v":121.73},{"$f":"ROUND(((Config_RawLabor!M11/Config!$B$7)/Config_RawLabor!$O11)*VLOOKUP($A11,Config!$A$2:$B$5,2,0),2)","v":130.03},{"$f":"ROUND(((Config_RawLabor!N11/Config!$B$7)/Config_RawLabor!$O11)*VLOOKUP($A11,Config!$A$2:$B$5,2,0),2)","v":145.87},{"$f":"ROUND(((Config_RawLabor!P11/Config!$B$7)/Config_RawLabor!$S11)*VLOOKUP($A11,Config!$A$2:$B$5,2,0),2)","v":143.58000000000001},{"$f":"ROUND(((Config_RawLabor!Q11/Config!$B$7)/Config_RawLabor!$S11)*VLOOKUP($A11,Config!$A$2:$B$5,2,0),2)","v":153.06},{"$f":"ROUND(((Config_RawLabor!R11/Config!$B$7)/Config_RawLabor!$S11)*VLOOKUP($A11,Config!$A$2:$B$5,2,0),2)","v":170.54},{"$f":"ROUND(((Config_RawLabor!T11/Config!$B$7)/Config_RawLabor!$W11)*VLOOKUP($A11,Config!$A$2:$B$5,2,0),2)","v":162.54},{"$f":"ROUND(((Config_RawLabor!U11/Config!$B$7)/Config_RawLabor!$W11)*VLOOKUP($A11,Config!$A$2:$B$5,2,0),2)","v":173.77},{"$f":"ROUND(((Config_RawLabor!V11/Config!$B$7)/Config_RawLabor!$W11)*VLOOKUP($A11,Config!$A$2:$B$5,2,0),2)","v":192.95}]
[{"$f":"Config_RawLabor!A12","v":"Expert"},{"$f":"Config_RawLabor!B12","v":"Accountant"},{"$f":"Config_RawLabor!C12","v":"Prepares complex balance sheets, profit and loss statements and other financial reports. Analyzes current costs, revenues, financial commitments, and obligations incurred to predict future revenues and expenses. "},{"$f":"ROUND(((Config_RawLabor!D12/Config!$B$7)/Config_RawLabor!$G12)*VLOOKUP($A12,Config!$A$2:$B$5,2,0),2)","v":93.06},{"$f":"ROUND(((Config_RawLabor!E12/Config!$B$7)/Config_RawLabor!$G12)*VLOOKUP($A12,Config!$A$2:$B$5,2,0),2)","v":102.23},{"$f":"ROUND(((Config_RawLabor!F12/Config!$B$7)/Config_RawLabor!$G12)*VLOOKUP($A12,Config!$A$2:$B$5,2,0),2)","v":112.57},{"$f":"ROUND(((Config_RawLabor!H12/Config!$B$7)/Config_RawLabor!$K12)*VLOOKUP($A12,Config!$A$2:$B$5,2,0),2)","v":108.92},{"$f":"ROUND(((Config_RawLabor!I12/Config!$B$7)/Config_RawLabor!$K12)*VLOOKUP($A12,Config!$A$2:$B$5,2,0),2)","v":120.38},{"$f":"ROUND(((Config_RawLabor!J12/Config!$B$7)/Config_RawLabor!$K12)*VLOOKUP($A12,Config!$A$2:$B$5,2,0),2)","v":132.97999999999999},{"$f":"ROUND(((Config_RawLabor!L12/Config!$B$7)/Config_RawLabor!$O12)*VLOOKUP($A12,Config!$A$2:$B$5,2,0),2)","v":135.47},{"$f":"ROUND(((Config_RawLabor!M12/Config!$B$7)/Config_RawLabor!$O12)*VLOOKUP($A12,Config!$A$2:$B$5,2,0),2)","v":149.66999999999999},{"$f":"ROUND(((Config_RawLabor!N12/Config!$B$7)/Config_RawLabor!$O12)*VLOOKUP($A12,Config!$A$2:$B$5,2,0),2)","v":165.91},{"$f":"ROUND(((Config_RawLabor!P12/Config!$B$7)/Config_RawLabor!$S12)*VLOOKUP($A12,Config!$A$2:$B$5,2,0),2)","v":167.35},{"$f":"ROUND(((Config_RawLabor!Q12/Config!$B$7)/Config_RawLabor!$S12)*VLOOKUP($A12,Config!$A$2:$B$5,2,0),2)","v":183.52},{"$f":"ROUND(((Config_RawLabor!R12/Config!$B$7)/Config_RawLabor!$S12)*VLOOKUP($A12,Config!$A$2:$B$5,2,0),2)","v":201.51},{"$f":"ROUND(((Config_RawLabor!T12/Config!$B$7)/Config_RawLabor!$W12)*VLOOKUP($A12,Config!$A$2:$B$5,2,0),2)","v":188.59},{"$f":"ROUND(((Config_RawLabor!U12/Config!$B$7)/Config_RawLabor!$W12)*VLOOKUP($A12,Config!$A$2:$B$5,2,0),2)","v":206.82},{"$f":"ROUND(((Config_RawLabor!V12/Config!$B$7)/Config_RawLabor!$W12)*VLOOKUP($A12,Config!$A$2:$B$5,2,0),2)","v":227.09}]
[{"$f":"Config_RawLabor!A13","v":"Expert"},{"$f":"Config_RawLabor!B13","v":"Biologist"},{"$f":"Config_RawLabor!C13","v":"Analyzes specific regional environments as well as the organisms and wildlife that inhabit those locations. Aids in the protection and survival of wildlife within any given ecosystem, and assesses the impact of human activity on the environment."},{"$f":"ROUND(((Config_RawLabor!D13/Config!$B$7)/Config_RawLabor!$G13)*VLOOKUP($A13,Config!$A$2:$B$5,2,0),2)","v":90.26},{"$f":"ROUND(((Config_RawLabor!E13/Config!$B$7)/Config_RawLabor!$G13)*VLOOKUP($A13,Config!$A$2:$B$5,2,0),2)","v":99.64},{"$f":"ROUND(((Config_RawLabor!F13/Config!$B$7)/Config_RawLabor!$G13)*VLOOKUP($A13,Config!$A$2:$B$5,2,0),2)","v":112.5},{"$f":"ROUND(((Config_RawLabor!H13/Config!$B$7)/Config_RawLabor!$K13)*VLOOKUP($A13,Config!$A$2:$B$5,2,0),2)","v":100.3},{"$f":"ROUND(((Config_RawLabor!I13/Config!$B$7)/Config_RawLabor!$K13)*VLOOKUP($A13,Config!$A$2:$B$5,2,0),2)","v":115.21},{"$f":"ROUND(((Config_RawLabor!J13/Config!$B$7)/Config_RawLabor!$K13)*VLOOKUP($A13,Config!$A$2:$B$5,2,0),2)","v":130.35},{"$f":"ROUND(((Config_RawLabor!L13/Config!$B$7)/Config_RawLabor!$O13)*VLOOKUP($A13,Config!$A$2:$B$5,2,0),2)","v":121.65},{"$f":"ROUND(((Config_RawLabor!M13/Config!$B$7)/Config_RawLabor!$O13)*VLOOKUP($A13,Config!$A$2:$B$5,2,0),2)","v":140.44999999999999},{"$f":"ROUND(((Config_RawLabor!N13/Config!$B$7)/Config_RawLabor!$O13)*VLOOKUP($A13,Config!$A$2:$B$5,2,0),2)","v":164.95},{"$f":"ROUND(((Config_RawLabor!P13/Config!$B$7)/Config_RawLabor!$S13)*VLOOKUP($A13,Config!$A$2:$B$5,2,0),2)","v":172.48},{"$f":"ROUND(((Config_RawLabor!Q13/Config!$B$7)/Config_RawLabor!$S13)*VLOOKUP($A13,Config!$A$2:$B$5,2,0),2)","v":201.1},{"$f":"ROUND(((Config_RawLabor!R13/Config!$B$7)/Config_RawLabor!$S13)*VLOOKUP($A13,Config!$A$2:$B$5,2,0),2)","v":234.86},{"$f":"ROUND(((Config_RawLabor!T13/Config!$B$7)/Config_RawLabor!$W13)*VLOOKUP($A13,Config!$A$2:$B$5,2,0),2)","v":178.76},{"$f":"ROUND(((Config_RawLabor!U13/Config!$B$7)/Config_RawLabor!$W13)*VLOOKUP($A13,Config!$A$2:$B$5,2,0),2)","v":206.12},{"$f":"ROUND(((Config_RawLabor!V13/Config!$B$7)/Config_RawLabor!$W13)*VLOOKUP($A13,Config!$A$2:$B$5,2,0),2)","v":226.1}]
[{"$f":"Config_RawLabor!A14","v":"Expert"},{"$f":"Config_RawLabor!B14","v":"Certified Depreciation Professional"},{"$f":"Config_RawLabor!C14","v":"Specialist in calculating depreciation."},{"$f":"ROUND(((Config_RawLabor!D14/Config!$B$7)/Config_RawLabor!$G14)*VLOOKUP($A14,Config!$A$2:$B$5,2,0),2)","v":104.75},{"$f":"ROUND(((Config_RawLabor!E14/Config!$B$7)/Config_RawLabor!$G14)*VLOOKUP($A14,Config!$A$2:$B$5,2,0),2)","v":115.95},{"$f":"ROUND(((Config_RawLabor!F14/Config!$B$7)/Config_RawLabor!$G14)*VLOOKUP($A14,Config!$A$2:$B$5,2,0),2)","v":127.51},{"$f":"ROUND(((Config_RawLabor!H14/Config!$B$7)/Config_RawLabor!$K14)*VLOOKUP($A14,Config!$A$2:$B$5,2,0),2)","v":124.58},{"$f":"ROUND(((Config_RawLabor!I14/Config!$B$7)/Config_RawLabor!$K14)*VLOOKUP($A14,Config!$A$2:$B$5,2,0),2)","v":136.24},{"$f":"ROUND(((Config_RawLabor!J14/Config!$B$7)/Config_RawLabor!$K14)*VLOOKUP($A14,Config!$A$2:$B$5,2,0),2)","v":150.38},{"$f":"ROUND(((Config_RawLabor!L14/Config!$B$7)/Config_RawLabor!$O14)*VLOOKUP($A14,Config!$A$2:$B$5,2,0),2)","v":146.19},{"$f":"ROUND(((Config_RawLabor!M14/Config!$B$7)/Config_RawLabor!$O14)*VLOOKUP($A14,Config!$A$2:$B$5,2,0),2)","v":160.66},{"$f":"ROUND(((Config_RawLabor!N14/Config!$B$7)/Config_RawLabor!$O14)*VLOOKUP($A14,Config!$A$2:$B$5,2,0),2)","v":175.94},{"$f":"ROUND(((Config_RawLabor!P14/Config!$B$7)/Config_RawLabor!$S14)*VLOOKUP($A14,Config!$A$2:$B$5,2,0),2)","v":175.88},{"$f":"ROUND(((Config_RawLabor!Q14/Config!$B$7)/Config_RawLabor!$S14)*VLOOKUP($A14,Config!$A$2:$B$5,2,0),2)","v":193.35},{"$f":"ROUND(((Config_RawLabor!R14/Config!$B$7)/Config_RawLabor!$S14)*VLOOKUP($A14,Config!$A$2:$B$5,2,0),2)","v":215.67},{"$f":"ROUND(((Config_RawLabor!T14/Config!$B$7)/Config_RawLabor!$W14)*VLOOKUP($A14,Config!$A$2:$B$5,2,0),2)","v":199.13},{"$f":"ROUND(((Config_RawLabor!U14/Config!$B$7)/Config_RawLabor!$W14)*VLOOKUP($A14,Config!$A$2:$B$5,2,0),2)","v":218.91},{"$f":"ROUND(((Config_RawLabor!V14/Config!$B$7)/Config_RawLabor!$W14)*VLOOKUP($A14,Config!$A$2:$B$5,2,0),2)","v":244.19}]
[{"$f":"Config_RawLabor!A15","v":"Expert"},{"$f":"Config_RawLabor!B15","v":"Chemical Engineer"},{"$f":"Config_RawLabor!C15","v":"Analyzes processes for the transport and storage of chemicals, including gases. "},{"$f":"ROUND(((Config_RawLabor!D15/Config!$B$7)/Config_RawLabor!$G15)*VLOOKUP($A15,Config!$A$2:$B$5,2,0),2)","v":133.4},{"$f":"ROUND(((Config_RawLabor!E15/Config!$B$7)/Config_RawLabor!$G15)*VLOOKUP($A15,Config!$A$2:$B$5,2,0),2)","v":146.05000000000001},{"$f":"ROUND(((Config_RawLabor!F15/Config!$B$7)/Config_RawLabor!$G15)*VLOOKUP($A15,Config!$A$2:$B$5,2,0),2)","v":161.44999999999999},{"$f":"ROUND(((Config_RawLabor!H15/Config!$B$7)/Config_RawLabor!$K15)*VLOOKUP($A15,Config!$A$2:$B$5,2,0),2)","v":151.08000000000001},{"$f":"ROUND(((Config_RawLabor!I15/Config!$B$7)/Config_RawLabor!$K15)*VLOOKUP($A15,Config!$A$2:$B$5,2,0),2)","v":167.51},{"$f":"ROUND(((Config_RawLabor!J15/Config!$B$7)/Config_RawLabor!$K15)*VLOOKUP($A15,Config!$A$2:$B$5,2,0),2)","v":186.77},{"$f":"ROUND(((Config_RawLabor!L15/Config!$B$7)/Config_RawLabor!$O15)*VLOOKUP($A15,Config!$A$2:$B$5,2,0),2)","v":176.8},{"$f":"ROUND(((Config_RawLabor!M15/Config!$B$7)/Config_RawLabor!$O15)*VLOOKUP($A15,Config!$A$2:$B$5,2,0),2)","v":199.76},{"$f":"ROUND(((Config_RawLabor!N15/Config!$B$7)/Config_RawLabor!$O15)*VLOOKUP($A15,Config!$A$2:$B$5,2,0),2)","v":224.12},{"$f":"ROUND(((Config_RawLabor!P15/Config!$B$7)/Config_RawLabor!$S15)*VLOOKUP($A15,Config!$A$2:$B$5,2,0),2)","v":219.65},{"$f":"ROUND(((Config_RawLabor!Q15/Config!$B$7)/Config_RawLabor!$S15)*VLOOKUP($A15,Config!$A$2:$B$5,2,0),2)","v":242.6},{"$f":"ROUND(((Config_RawLabor!R15/Config!$B$7)/Config_RawLabor!$S15)*VLOOKUP($A15,Config!$A$2:$B$5,2,0),2)","v":272.02},{"$f":"ROUND(((Config_RawLabor!T15/Config!$B$7)/Config_RawLabor!$W15)*VLOOKUP($A15,Config!$A$2:$B$5,2,0),2)","v":236.42},{"$f":"ROUND(((Config_RawLabor!U15/Config!$B$7)/Config_RawLabor!$W15)*VLOOKUP($A15,Config!$A$2:$B$5,2,0),2)","v":260.13},{"$f":"ROUND(((Config_RawLabor!V15/Config!$B$7)/Config_RawLabor!$W15)*VLOOKUP($A15,Config!$A$2:$B$5,2,0),2)","v":283.39999999999998}]
[{"$f":"Config_RawLabor!A16","v":"Expert"},{"$f":"Config_RawLabor!B16","v":"Civil Engineer"},{"$f":"Config_RawLabor!C16","v":"Analyzes construction projects such as channels, dams, and roads. Responsibilities also include estimating costs, personnel, material and schedule needs."},{"$f":"ROUND(((Config_RawLabor!D16/Config!$B$7)/Config_RawLabor!$G16)*VLOOKUP($A16,Config!$A$2:$B$5,2,0),2)","v":118.55},{"$f":"ROUND(((Config_RawLabor!E16/Config!$B$7)/Config_RawLabor!$G16)*VLOOKUP($A16,Config!$A$2:$B$5,2,0),2)","v":129.51},{"$f":"ROUND(((Config_RawLabor!F16/Config!$B$7)/Config_RawLabor!$G16)*VLOOKUP($A16,Config!$A$2:$B$5,2,0),2)","v":146.16999999999999},{"$f":"ROUND(((Config_RawLabor!H16/Config!$B$7)/Config_RawLabor!$K16)*VLOOKUP($A16,Config!$A$2:$B$5,2,0),2)","v":141.82},{"$f":"ROUND(((Config_RawLabor!I16/Config!$B$7)/Config_RawLabor!$K16)*VLOOKUP($A16,Config!$A$2:$B$5,2,0),2)","v":158.35},{"$f":"ROUND(((Config_RawLabor!J16/Config!$B$7)/Config_RawLabor!$K16)*VLOOKUP($A16,Config!$A$2:$B$5,2,0),2)","v":176.51},{"$f":"ROUND(((Config_RawLabor!L16/Config!$B$7)/Config_RawLabor!$O16)*VLOOKUP($A16,Config!$A$2:$B$5,2,0),2)","v":171.23},{"$f":"ROUND(((Config_RawLabor!M16/Config!$B$7)/Config_RawLabor!$O16)*VLOOKUP($A16,Config!$A$2:$B$5,2,0),2)","v":191.86},{"$f":"ROUND(((Config_RawLabor!N16/Config!$B$7)/Config_RawLabor!$O16)*VLOOKUP($A16,Config!$A$2:$B$5,2,0),2)","v":216.13},{"$f":"ROUND(((Config_RawLabor!P16/Config!$B$7)/Config_RawLabor!$S16)*VLOOKUP($A16,Config!$A$2:$B$5,2,0),2)","v":178.57},{"$f":"ROUND(((Config_RawLabor!Q16/Config!$B$7)/Config_RawLabor!$S16)*VLOOKUP($A16,Config!$A$2:$B$5,2,0),2)","v":200.25},{"$f":"ROUND(((Config_RawLabor!R16/Config!$B$7)/Config_RawLabor!$S16)*VLOOKUP($A16,Config!$A$2:$B$5,2,0),2)","v":224.84},{"$f":"ROUND(((Config_RawLabor!T16/Config!$B$7)/Config_RawLabor!$W16)*VLOOKUP($A16,Config!$A$2:$B$5,2,0),2)","v":210.27},{"$f":"ROUND(((Config_RawLabor!U16/Config!$B$7)/Config_RawLabor!$W16)*VLOOKUP($A16,Config!$A$2:$B$5,2,0),2)","v":237.15},{"$f":"ROUND(((Config_RawLabor!V16/Config!$B$7)/Config_RawLabor!$W16)*VLOOKUP($A16,Config!$A$2:$B$5,2,0),2)","v":266.16000000000003}]
[{"$f":"Config_RawLabor!A17","v":"Expert"},{"$f":"Config_RawLabor!B17","v":"Climate Scientist"},{"$f":"Config_RawLabor!C17","v":"Analyze and interpret data obtained from meteorological stations, radar and satellite imagery, and computer models.\nAnalyze past climate conditions and use models to predict future climate trends.\nExpert on factors that affect climate and cause climate change. Provides information and advises policy-makers on environmental topics such as climate change and air quality. Uses impact models to illustrate how human or natural activities respond to climate, for example crop yields, wetland ecology, biodiversity, and human health. "},{"$f":"ROUND(((Config_RawLabor!D17/Config!$B$7)/Config_RawLabor!$G17)*VLOOKUP($A17,Config!$A$2:$B$5,2,0),2)","v":108.1},{"$f":"ROUND(((Config_RawLabor!E17/Config!$B$7)/Config_RawLabor!$G17)*VLOOKUP($A17,Config!$A$2:$B$5,2,0),2)","v":121.99},{"$f":"ROUND(((Config_RawLabor!F17/Config!$B$7)/Config_RawLabor!$G17)*VLOOKUP($A17,Config!$A$2:$B$5,2,0),2)","v":137.66},{"$f":"ROUND(((Config_RawLabor!H17/Config!$B$7)/Config_RawLabor!$K17)*VLOOKUP($A17,Config!$A$2:$B$5,2,0),2)","v":138.1},{"$f":"ROUND(((Config_RawLabor!I17/Config!$B$7)/Config_RawLabor!$K17)*VLOOKUP($A17,Config!$A$2:$B$5,2,0),2)","v":152.85},{"$f":"ROUND(((Config_RawLabor!J17/Config!$B$7)/Config_RawLabor!$K17)*VLOOKUP($A17,Config!$A$2:$B$5,2,0),2)","v":170.93},{"$f":"ROUND(((Config_RawLabor!L17/Config!$B$7)/Config_RawLabor!$O17)*VLOOKUP($A17,Config!$A$2:$B$5,2,0),2)","v":159.83000000000001},{"$f":"ROUND(((Config_RawLabor!M17/Config!$B$7)/Config_RawLabor!$O17)*VLOOKUP($A17,Config!$A$2:$B$5,2,0),2)","v":180.95},{"$f":"ROUND(((Config_RawLabor!N17/Config!$B$7)/Config_RawLabor!$O17)*VLOOKUP($A17,Config!$A$2:$B$5,2,0),2)","v":204.7},{"$f":"ROUND(((Config_RawLabor!P17/Config!$B$7)/Config_RawLabor!$S17)*VLOOKUP($A17,Config!$A$2:$B$5,2,0),2)","v":171.17},{"$f":"ROUND(((Config_RawLabor!Q17/Config!$B$7)/Config_RawLabor!$S17)*VLOOKUP($A17,Config!$A$2:$B$5,2,0),2)","v":195.3},{"$f":"ROUND(((Config_RawLabor!R17/Config!$B$7)/Config_RawLabor!$S17)*VLOOKUP($A17,Config!$A$2:$B$5,2,0),2)","v":219.45},{"$f":"ROUND(((Config_RawLabor!T17/Config!$B$7)/Config_RawLabor!$W17)*VLOOKUP($A17,Config!$A$2:$B$5,2,0),2)","v":191.77},{"$f":"ROUND(((Config_RawLabor!U17/Config!$B$7)/Config_RawLabor!$W17)*VLOOKUP($A17,Config!$A$2:$B$5,2,0),2)","v":227.93},{"$f":"ROUND(((Config_RawLabor!V17/Config!$B$7)/Config_RawLabor!$W17)*VLOOKUP($A17,Config!$A$2:$B$5,2,0),2)","v":259.92}]
[{"$f":"Config_RawLabor!A18","v":"Expert"},{"$f":"Config_RawLabor!B18","v":"Communication Specialist"},{"$f":"Config_RawLabor!C18","v":"Defines, designs and implements communications strategy and programs. Evaluates and assist in establishing standard operating procedures regarding communications. Reviews and edits communications submitted for organizational issues. Works closely with various business departments to ensure messages are delivered clearly and effectively."},{"$f":"ROUND(((Config_RawLabor!D18/Config!$B$7)/Config_RawLabor!$G18)*VLOOKUP($A18,Config!$A$2:$B$5,2,0),2)","v":116.17},{"$f":"ROUND(((Config_RawLabor!E18/Config!$B$7)/Config_RawLabor!$G18)*VLOOKUP($A18,Config!$A$2:$B$5,2,0),2)","v":133.02000000000001},{"$f":"ROUND(((Config_RawLabor!F18/Config!$B$7)/Config_RawLabor!$G18)*VLOOKUP($A18,Config!$A$2:$B$5,2,0),2)","v":151.31},{"$f":"ROUND(((Config_RawLabor!H18/Config!$B$7)/Config_RawLabor!$K18)*VLOOKUP($A18,Config!$A$2:$B$5,2,0),2)","v":142.57},{"$f":"ROUND(((Config_RawLabor!I18/Config!$B$7)/Config_RawLabor!$K18)*VLOOKUP($A18,Config!$A$2:$B$5,2,0),2)","v":162.33000000000001},{"$f":"ROUND(((Config_RawLabor!J18/Config!$B$7)/Config_RawLabor!$K18)*VLOOKUP($A18,Config!$A$2:$B$5,2,0),2)","v":184.21},{"$f":"ROUND(((Config_RawLabor!L18/Config!$B$7)/Config_RawLabor!$O18)*VLOOKUP($A18,Config!$A$2:$B$5,2,0),2)","v":178.57},{"$f":"ROUND(((Config_RawLabor!M18/Config!$B$7)/Config_RawLabor!$O18)*VLOOKUP($A18,Config!$A$2:$B$5,2,0),2)","v":201.74},{"$f":"ROUND(((Config_RawLabor!N18/Config!$B$7)/Config_RawLabor!$O18)*VLOOKUP($A18,Config!$A$2:$B$5,2,0),2)","v":232.22},{"$f":"ROUND(((Config_RawLabor!P18/Config!$B$7)/Config_RawLabor!$S18)*VLOOKUP($A18,Config!$A$2:$B$5,2,0),2)","v":219.69},{"$f":"ROUND(((Config_RawLabor!Q18/Config!$B$7)/Config_RawLabor!$S18)*VLOOKUP($A18,Config!$A$2:$B$5,2,0),2)","v":246.99},{"$f":"ROUND(((Config_RawLabor!R18/Config!$B$7)/Config_RawLabor!$S18)*VLOOKUP($A18,Config!$A$2:$B$5,2,0),2)","v":280.70999999999998},{"$f":"ROUND(((Config_RawLabor!T18/Config!$B$7)/Config_RawLabor!$W18)*VLOOKUP($A18,Config!$A$2:$B$5,2,0),2)","v":284.01},{"$f":"ROUND(((Config_RawLabor!U18/Config!$B$7)/Config_RawLabor!$W18)*VLOOKUP($A18,Config!$A$2:$B$5,2,0),2)","v":327.52},{"$f":"ROUND(((Config_RawLabor!V18/Config!$B$7)/Config_RawLabor!$W18)*VLOOKUP($A18,Config!$A$2:$B$5,2,0),2)","v":385.7}]
[{"$f":"Config_RawLabor!A19","v":"Expert"},{"$f":"Config_RawLabor!B19","v":"Cost Accountant"},{"$f":"Config_RawLabor!C19","v":"Reviews cost accounting procedures and methods. Responsible for the preparation and analysis of cost reports and costing audits. Examines and reviews unusual cost records and ensures cost data is allocated correctly. "},{"$f":"ROUND(((Config_RawLabor!D19/Config!$B$7)/Config_RawLabor!$G19)*VLOOKUP($A19,Config!$A$2:$B$5,2,0),2)","v":104.75},{"$f":"ROUND(((Config_RawLabor!E19/Config!$B$7)/Config_RawLabor!$G19)*VLOOKUP($A19,Config!$A$2:$B$5,2,0),2)","v":115.95},{"$f":"ROUND(((Config_RawLabor!F19/Config!$B$7)/Config_RawLabor!$G19)*VLOOKUP($A19,Config!$A$2:$B$5,2,0),2)","v":127.51},{"$f":"ROUND(((Config_RawLabor!H19/Config!$B$7)/Config_RawLabor!$K19)*VLOOKUP($A19,Config!$A$2:$B$5,2,0),2)","v":124.58},{"$f":"ROUND(((Config_RawLabor!I19/Config!$B$7)/Config_RawLabor!$K19)*VLOOKUP($A19,Config!$A$2:$B$5,2,0),2)","v":136.24},{"$f":"ROUND(((Config_RawLabor!J19/Config!$B$7)/Config_RawLabor!$K19)*VLOOKUP($A19,Config!$A$2:$B$5,2,0),2)","v":150.38},{"$f":"ROUND(((Config_RawLabor!L19/Config!$B$7)/Config_RawLabor!$O19)*VLOOKUP($A19,Config!$A$2:$B$5,2,0),2)","v":146.19},{"$f":"ROUND(((Config_RawLabor!M19/Config!$B$7)/Config_RawLabor!$O19)*VLOOKUP($A19,Config!$A$2:$B$5,2,0),2)","v":160.66},{"$f":"ROUND(((Config_RawLabor!N19/Config!$B$7)/Config_RawLabor!$O19)*VLOOKUP($A19,Config!$A$2:$B$5,2,0),2)","v":175.94},{"$f":"ROUND(((Config_RawLabor!P19/Config!$B$7)/Config_RawLabor!$S19)*VLOOKUP($A19,Config!$A$2:$B$5,2,0),2)","v":175.88},{"$f":"ROUND(((Config_RawLabor!Q19/Config!$B$7)/Config_RawLabor!$S19)*VLOOKUP($A19,Config!$A$2:$B$5,2,0),2)","v":193.35},{"$f":"ROUND(((Config_RawLabor!R19/Config!$B$7)/Config_RawLabor!$S19)*VLOOKUP($A19,Config!$A$2:$B$5,2,0),2)","v":215.67},{"$f":"ROUND(((Config_RawLabor!T19/Config!$B$7)/Config_RawLabor!$W19)*VLOOKUP($A19,Config!$A$2:$B$5,2,0),2)","v":199.13},{"$f":"ROUND(((Config_RawLabor!U19/Config!$B$7)/Config_RawLabor!$W19)*VLOOKUP($A19,Config!$A$2:$B$5,2,0),2)","v":218.91},{"$f":"ROUND(((Config_RawLabor!V19/Config!$B$7)/Config_RawLabor!$W19)*VLOOKUP($A19,Config!$A$2:$B$5,2,0),2)","v":244.19}]
[{"$f":"Config_RawLabor!A20","v":"Expert"},{"$f":"Config_RawLabor!B20","v":"Cost Estimation Analyst"},{"$f":"Config_RawLabor!C20","v":"Reviews project cost estimates, expenditures, and forecasts. Prepares should cost estimates for comparison as part of cost reasonableness analysis. Requires technical knowledge of the construction work involved, and the ability to use cost-estimating methods."},{"$f":"ROUND(((Config_RawLabor!D20/Config!$B$7)/Config_RawLabor!$G20)*VLOOKUP($A20,Config!$A$2:$B$5,2,0),2)","v":113.55},{"$f":"ROUND(((Config_RawLabor!E20/Config!$B$7)/Config_RawLabor!$G20)*VLOOKUP($A20,Config!$A$2:$B$5,2,0),2)","v":124.36},{"$f":"ROUND(((Config_RawLabor!F20/Config!$B$7)/Config_RawLabor!$G20)*VLOOKUP($A20,Config!$A$2:$B$5,2,0),2)","v":138.47},{"$f":"ROUND(((Config_RawLabor!H20/Config!$B$7)/Config_RawLabor!$K20)*VLOOKUP($A20,Config!$A$2:$B$5,2,0),2)","v":140.08000000000001},{"$f":"ROUND(((Config_RawLabor!I20/Config!$B$7)/Config_RawLabor!$K20)*VLOOKUP($A20,Config!$A$2:$B$5,2,0),2)","v":153.94999999999999},{"$f":"ROUND(((Config_RawLabor!J20/Config!$B$7)/Config_RawLabor!$K20)*VLOOKUP($A20,Config!$A$2:$B$5,2,0),2)","v":173.19},{"$f":"ROUND(((Config_RawLabor!L20/Config!$B$7)/Config_RawLabor!$O20)*VLOOKUP($A20,Config!$A$2:$B$5,2,0),2)","v":156.04},{"$f":"ROUND(((Config_RawLabor!M20/Config!$B$7)/Config_RawLabor!$O20)*VLOOKUP($A20,Config!$A$2:$B$5,2,0),2)","v":174.84},{"$f":"ROUND(((Config_RawLabor!N20/Config!$B$7)/Config_RawLabor!$O20)*VLOOKUP($A20,Config!$A$2:$B$5,2,0),2)","v":198.71},{"$f":"ROUND(((Config_RawLabor!P20/Config!$B$7)/Config_RawLabor!$S20)*VLOOKUP($A20,Config!$A$2:$B$5,2,0),2)","v":189.01},{"$f":"ROUND(((Config_RawLabor!Q20/Config!$B$7)/Config_RawLabor!$S20)*VLOOKUP($A20,Config!$A$2:$B$5,2,0),2)","v":217.87},{"$f":"ROUND(((Config_RawLabor!R20/Config!$B$7)/Config_RawLabor!$S20)*VLOOKUP($A20,Config!$A$2:$B$5,2,0),2)","v":243.32},{"$f":"ROUND(((Config_RawLabor!T20/Config!$B$7)/Config_RawLabor!$W20)*VLOOKUP($A20,Config!$A$2:$B$5,2,0),2)","v":259.01},{"$f":"ROUND(((Config_RawLabor!U20/Config!$B$7)/Config_RawLabor!$W20)*VLOOKUP($A20,Config!$A$2:$B$5,2,0),2)","v":299.32},{"$f":"ROUND(((Config_RawLabor!V20/Config!$B$7)/Config_RawLabor!$W20)*VLOOKUP($A20,Config!$A$2:$B$5,2,0),2)","v":337.07}]
[{"$f":"Config_RawLabor!A21","v":"Expert"},{"$f":"Config_RawLabor!B21","v":"Design Engineer"},{"$f":"Config_RawLabor!C21","v":"Evaluates products, parts, or processes for cost efficiency and reliability and to estimate project completion status. "},{"$f":"ROUND(((Config_RawLabor!D21/Config!$B$7)/Config_RawLabor!$G21)*VLOOKUP($A21,Config!$A$2:$B$5,2,0),2)","v":120.08},{"$f":"ROUND(((Config_RawLabor!E21/Config!$B$7)/Config_RawLabor!$G21)*VLOOKUP($A21,Config!$A$2:$B$5,2,0),2)","v":130.47999999999999},{"$f":"ROUND(((Config_RawLabor!F21/Config!$B$7)/Config_RawLabor!$G21)*VLOOKUP($A21,Config!$A$2:$B$5,2,0),2)","v":141.96},{"$f":"ROUND(((Config_RawLabor!H21/Config!$B$7)/Config_RawLabor!$K21)*VLOOKUP($A21,Config!$A$2:$B$5,2,0),2)","v":129.91},{"$f":"ROUND(((Config_RawLabor!I21/Config!$B$7)/Config_RawLabor!$K21)*VLOOKUP($A21,Config!$A$2:$B$5,2,0),2)","v":143.36000000000001},{"$f":"ROUND(((Config_RawLabor!J21/Config!$B$7)/Config_RawLabor!$K21)*VLOOKUP($A21,Config!$A$2:$B$5,2,0),2)","v":159.80000000000001},{"$f":"ROUND(((Config_RawLabor!L21/Config!$B$7)/Config_RawLabor!$O21)*VLOOKUP($A21,Config!$A$2:$B$5,2,0),2)","v":175.69},{"$f":"ROUND(((Config_RawLabor!M21/Config!$B$7)/Config_RawLabor!$O21)*VLOOKUP($A21,Config!$A$2:$B$5,2,0),2)","v":190.41},{"$f":"ROUND(((Config_RawLabor!N21/Config!$B$7)/Config_RawLabor!$O21)*VLOOKUP($A21,Config!$A$2:$B$5,2,0),2)","v":211.51},{"$f":"ROUND(((Config_RawLabor!P21/Config!$B$7)/Config_RawLabor!$S21)*VLOOKUP($A21,Config!$A$2:$B$5,2,0),2)","v":212.87},{"$f":"ROUND(((Config_RawLabor!Q21/Config!$B$7)/Config_RawLabor!$S21)*VLOOKUP($A21,Config!$A$2:$B$5,2,0),2)","v":239.84},{"$f":"ROUND(((Config_RawLabor!R21/Config!$B$7)/Config_RawLabor!$S21)*VLOOKUP($A21,Config!$A$2:$B$5,2,0),2)","v":278.08},{"$f":"ROUND(((Config_RawLabor!T21/Config!$B$7)/Config_RawLabor!$W21)*VLOOKUP($A21,Config!$A$2:$B$5,2,0),2)","v":237.55},{"$f":"ROUND(((Config_RawLabor!U21/Config!$B$7)/Config_RawLabor!$W21)*VLOOKUP($A21,Config!$A$2:$B$5,2,0),2)","v":267.64},{"$f":"ROUND(((Config_RawLabor!V21/Config!$B$7)/Config_RawLabor!$W21)*VLOOKUP($A21,Config!$A$2:$B$5,2,0),2)","v":310.33}]
[{"$f":"Config_RawLabor!A22","v":"Expert"},{"$f":"Config_RawLabor!B22","v":"Drilling Engineer "},{"$f":"Config_RawLabor!C22","v":"Provides expert judgment for the design and implementation of oil and gas wells. Resolves highly complex technical issues and conducts advanced research into emerging technology in the field. Recommends alterations to development and design to improve safety, costs, and efficiency. "},{"$f":"ROUND(((Config_RawLabor!D22/Config!$B$7)/Config_RawLabor!$G22)*VLOOKUP($A22,Config!$A$2:$B$5,2,0),2)","v":172.81},{"$f":"ROUND(((Config_RawLabor!E22/Config!$B$7)/Config_RawLabor!$G22)*VLOOKUP($A22,Config!$A$2:$B$5,2,0),2)","v":187.3},{"$f":"ROUND(((Config_RawLabor!F22/Config!$B$7)/Config_RawLabor!$G22)*VLOOKUP($A22,Config!$A$2:$B$5,2,0),2)","v":205.73},{"$f":"ROUND(((Config_RawLabor!H22/Config!$B$7)/Config_RawLabor!$K22)*VLOOKUP($A22,Config!$A$2:$B$5,2,0),2)","v":210.09},{"$f":"ROUND(((Config_RawLabor!I22/Config!$B$7)/Config_RawLabor!$K22)*VLOOKUP($A22,Config!$A$2:$B$5,2,0),2)","v":234.23},{"$f":"ROUND(((Config_RawLabor!J22/Config!$B$7)/Config_RawLabor!$K22)*VLOOKUP($A22,Config!$A$2:$B$5,2,0),2)","v":255.25},{"$f":"ROUND(((Config_RawLabor!L22/Config!$B$7)/Config_RawLabor!$O22)*VLOOKUP($A22,Config!$A$2:$B$5,2,0),2)","v":241.83},{"$f":"ROUND(((Config_RawLabor!M22/Config!$B$7)/Config_RawLabor!$O22)*VLOOKUP($A22,Config!$A$2:$B$5,2,0),2)","v":276.32},{"$f":"ROUND(((Config_RawLabor!N22/Config!$B$7)/Config_RawLabor!$O22)*VLOOKUP($A22,Config!$A$2:$B$5,2,0),2)","v":303.27},{"$f":"ROUND(((Config_RawLabor!P22/Config!$B$7)/Config_RawLabor!$S22)*VLOOKUP($A22,Config!$A$2:$B$5,2,0),2)","v":310.99},{"$f":"ROUND(((Config_RawLabor!Q22/Config!$B$7)/Config_RawLabor!$S22)*VLOOKUP($A22,Config!$A$2:$B$5,2,0),2)","v":349.2},{"$f":"ROUND(((Config_RawLabor!R22/Config!$B$7)/Config_RawLabor!$S22)*VLOOKUP($A22,Config!$A$2:$B$5,2,0),2)","v":380.47},{"$f":"ROUND(((Config_RawLabor!T22/Config!$B$7)/Config_RawLabor!$W22)*VLOOKUP($A22,Config!$A$2:$B$5,2,0),2)","v":340.62},{"$f":"ROUND(((Config_RawLabor!U22/Config!$B$7)/Config_RawLabor!$W22)*VLOOKUP($A22,Config!$A$2:$B$5,2,0),2)","v":397.98},{"$f":"ROUND(((Config_RawLabor!V22/Config!$B$7)/Config_RawLabor!$W22)*VLOOKUP($A22,Config!$A$2:$B$5,2,0),2)","v":423.82}]
[{"$f":"Config_RawLabor!A23","v":"Expert"},{"$f":"Config_RawLabor!B23","v":"Ecologist"},{"$f":"Config_RawLabor!C23","v":"Investigates the factors at play in a disturbed ecosystem, anticipates potential effects of proposed actions, and recommends sustainable practices. Work may include fieldwork to collect and analyze data on environmental conditions, or to assess or certify a habitat. May plan or review habitat management or environmental restoration projects, including procedures, resources, schedules, and budgets."},{"$f":"ROUND(((Config_RawLabor!D23/Config!$B$7)/Config_RawLabor!$G23)*VLOOKUP($A23,Config!$A$2:$B$5,2,0),2)","v":90.26},{"$f":"ROUND(((Config_RawLabor!E23/Config!$B$7)/Config_RawLabor!$G23)*VLOOKUP($A23,Config!$A$2:$B$5,2,0),2)","v":99.64},{"$f":"ROUND(((Config_RawLabor!F23/Config!$B$7)/Config_RawLabor!$G23)*VLOOKUP($A23,Config!$A$2:$B$5,2,0),2)","v":112.5},{"$f":"ROUND(((Config_RawLabor!H23/Config!$B$7)/Config_RawLabor!$K23)*VLOOKUP($A23,Config!$A$2:$B$5,2,0),2)","v":100.3},{"$f":"ROUND(((Config_RawLabor!I23/Config!$B$7)/Config_RawLabor!$K23)*VLOOKUP($A23,Config!$A$2:$B$5,2,0),2)","v":115.21},{"$f":"ROUND(((Config_RawLabor!J23/Config!$B$7)/Config_RawLabor!$K23)*VLOOKUP($A23,Config!$A$2:$B$5,2,0),2)","v":130.35},{"$f":"ROUND(((Config_RawLabor!L23/Config!$B$7)/Config_RawLabor!$O23)*VLOOKUP($A23,Config!$A$2:$B$5,2,0),2)","v":121.65},{"$f":"ROUND(((Config_RawLabor!M23/Config!$B$7)/Config_RawLabor!$O23)*VLOOKUP($A23,Config!$A$2:$B$5,2,0),2)","v":140.44999999999999},{"$f":"ROUND(((Config_RawLabor!N23/Config!$B$7)/Config_RawLabor!$O23)*VLOOKUP($A23,Config!$A$2:$B$5,2,0),2)","v":164.95},{"$f":"ROUND(((Config_RawLabor!P23/Config!$B$7)/Config_RawLabor!$S23)*VLOOKUP($A23,Config!$A$2:$B$5,2,0),2)","v":172.48},{"$f":"ROUND(((Config_RawLabor!Q23/Config!$B$7)/Config_RawLabor!$S23)*VLOOKUP($A23,Config!$A$2:$B$5,2,0),2)","v":201.1},{"$f":"ROUND(((Config_RawLabor!R23/Config!$B$7)/Config_RawLabor!$S23)*VLOOKUP($A23,Config!$A$2:$B$5,2,0),2)","v":234.86},{"$f":"ROUND(((Config_RawLabor!T23/Config!$B$7)/Config_RawLabor!$W23)*VLOOKUP($A23,Config!$A$2:$B$5,2,0),2)","v":178.76},{"$f":"ROUND(((Config_RawLabor!U23/Config!$B$7)/Config_RawLabor!$W23)*VLOOKUP($A23,Config!$A$2:$B$5,2,0),2)","v":206.12},{"$f":"ROUND(((Config_RawLabor!V23/Config!$B$7)/Config_RawLabor!$W23)*VLOOKUP($A23,Config!$A$2:$B$5,2,0),2)","v":226.1}]
[{"$f":"Config_RawLabor!A24","v":"Expert"},{"$f":"Config_RawLabor!B24","v":"Economist"},{"$f":"Config_RawLabor!C24","v":"Conducts research and analyses on economic data/trends and provides recommendations based on expertise. Researches and develops new data statistical models and technological innovations. Organizes data into report format and arranges graphic illustrations of research findings. Interprets and predicts economic conditions and advises management on implications. "},{"$f":"ROUND(((Config_RawLabor!D24/Config!$B$7)/Config_RawLabor!$G24)*VLOOKUP($A24,Config!$A$2:$B$5,2,0),2)","v":143.26},{"$f":"ROUND(((Config_RawLabor!E24/Config!$B$7)/Config_RawLabor!$G24)*VLOOKUP($A24,Config!$A$2:$B$5,2,0),2)","v":169.86},{"$f":"ROUND(((Config_RawLabor!F24/Config!$B$7)/Config_RawLabor!$G24)*VLOOKUP($A24,Config!$A$2:$B$5,2,0),2)","v":199.74},{"$f":"ROUND(((Config_RawLabor!H24/Config!$B$7)/Config_RawLabor!$K24)*VLOOKUP($A24,Config!$A$2:$B$5,2,0),2)","v":166.91},{"$f":"ROUND(((Config_RawLabor!I24/Config!$B$7)/Config_RawLabor!$K24)*VLOOKUP($A24,Config!$A$2:$B$5,2,0),2)","v":196.99},{"$f":"ROUND(((Config_RawLabor!J24/Config!$B$7)/Config_RawLabor!$K24)*VLOOKUP($A24,Config!$A$2:$B$5,2,0),2)","v":231.99},{"$f":"ROUND(((Config_RawLabor!L24/Config!$B$7)/Config_RawLabor!$O24)*VLOOKUP($A24,Config!$A$2:$B$5,2,0),2)","v":190.84},{"$f":"ROUND(((Config_RawLabor!M24/Config!$B$7)/Config_RawLabor!$O24)*VLOOKUP($A24,Config!$A$2:$B$5,2,0),2)","v":224.45},{"$f":"ROUND(((Config_RawLabor!N24/Config!$B$7)/Config_RawLabor!$O24)*VLOOKUP($A24,Config!$A$2:$B$5,2,0),2)","v":264.61},{"$f":"ROUND(((Config_RawLabor!P24/Config!$B$7)/Config_RawLabor!$S24)*VLOOKUP($A24,Config!$A$2:$B$5,2,0),2)","v":203.46},{"$f":"ROUND(((Config_RawLabor!Q24/Config!$B$7)/Config_RawLabor!$S24)*VLOOKUP($A24,Config!$A$2:$B$5,2,0),2)","v":240.36},{"$f":"ROUND(((Config_RawLabor!R24/Config!$B$7)/Config_RawLabor!$S24)*VLOOKUP($A24,Config!$A$2:$B$5,2,0),2)","v":285.85000000000002},{"$f":"ROUND(((Config_RawLabor!T24/Config!$B$7)/Config_RawLabor!$W24)*VLOOKUP($A24,Config!$A$2:$B$5,2,0),2)","v":216},{"$f":"ROUND(((Config_RawLabor!U24/Config!$B$7)/Config_RawLabor!$W24)*VLOOKUP($A24,Config!$A$2:$B$5,2,0),2)","v":256.18},{"$f":"ROUND(((Config_RawLabor!V24/Config!$B$7)/Config_RawLabor!$W24)*VLOOKUP($A24,Config!$A$2:$B$5,2,0),2)","v":306.95999999999998}]
[{"$f":"Config_RawLabor!A25","v":"Expert"},{"$f":"Config_RawLabor!B25","v":"Electrical Controls Engineer "},{"$f":"Config_RawLabor!C25","v":"Reviews design of electrical control systems, equipment, and machinery."},{"$f":"ROUND(((Config_RawLabor!D25/Config!$B$7)/Config_RawLabor!$G25)*VLOOKUP($A25,Config!$A$2:$B$5,2,0),2)","v":120.08},{"$f":"ROUND(((Config_RawLabor!E25/Config!$B$7)/Config_RawLabor!$G25)*VLOOKUP($A25,Config!$A$2:$B$5,2,0),2)","v":133.68},{"$f":"ROUND(((Config_RawLabor!F25/Config!$B$7)/Config_RawLabor!$G25)*VLOOKUP($A25,Config!$A$2:$B$5,2,0),2)","v":142.5},{"$f":"ROUND(((Config_RawLabor!H25/Config!$B$7)/Config_RawLabor!$K25)*VLOOKUP($A25,Config!$A$2:$B$5,2,0),2)","v":130.19999999999999},{"$f":"ROUND(((Config_RawLabor!I25/Config!$B$7)/Config_RawLabor!$K25)*VLOOKUP($A25,Config!$A$2:$B$5,2,0),2)","v":149.83000000000001},{"$f":"ROUND(((Config_RawLabor!J25/Config!$B$7)/Config_RawLabor!$K25)*VLOOKUP($A25,Config!$A$2:$B$5,2,0),2)","v":168.69},{"$f":"ROUND(((Config_RawLabor!L25/Config!$B$7)/Config_RawLabor!$O25)*VLOOKUP($A25,Config!$A$2:$B$5,2,0),2)","v":140.21},{"$f":"ROUND(((Config_RawLabor!M25/Config!$B$7)/Config_RawLabor!$O25)*VLOOKUP($A25,Config!$A$2:$B$5,2,0),2)","v":165.8},{"$f":"ROUND(((Config_RawLabor!N25/Config!$B$7)/Config_RawLabor!$O25)*VLOOKUP($A25,Config!$A$2:$B$5,2,0),2)","v":194.59},{"$f":"ROUND(((Config_RawLabor!P25/Config!$B$7)/Config_RawLabor!$S25)*VLOOKUP($A25,Config!$A$2:$B$5,2,0),2)","v":157.38},{"$f":"ROUND(((Config_RawLabor!Q25/Config!$B$7)/Config_RawLabor!$S25)*VLOOKUP($A25,Config!$A$2:$B$5,2,0),2)","v":181.1},{"$f":"ROUND(((Config_RawLabor!R25/Config!$B$7)/Config_RawLabor!$S25)*VLOOKUP($A25,Config!$A$2:$B$5,2,0),2)","v":209.37},{"$f":"ROUND(((Config_RawLabor!T25/Config!$B$7)/Config_RawLabor!$W25)*VLOOKUP($A25,Config!$A$2:$B$5,2,0),2)","v":174.3},{"$f":"ROUND(((Config_RawLabor!U25/Config!$B$7)/Config_RawLabor!$W25)*VLOOKUP($A25,Config!$A$2:$B$5,2,0),2)","v":196.17},{"$f":"ROUND(((Config_RawLabor!V25/Config!$B$7)/Config_RawLabor!$W25)*VLOOKUP($A25,Config!$A$2:$B$5,2,0),2)","v":223.93}]
[{"$f":"Config_RawLabor!A26","v":"Expert"},{"$f":"Config_RawLabor!B26","v":"Electrical Engineer "},{"$f":"Config_RawLabor!C26","v":"Reviews electrical equipment, components, or systems. Applies mathematical and engineering principles and methods to analysis of electrical system designs. Studies new technologies and researches innovative solutions and product designs to make alternate recommendations."},{"$f":"ROUND(((Config_RawLabor!D26/Config!$B$7)/Config_RawLabor!$G26)*VLOOKUP($A26,Config!$A$2:$B$5,2,0),2)","v":124.29},{"$f":"ROUND(((Config_RawLabor!E26/Config!$B$7)/Config_RawLabor!$G26)*VLOOKUP($A26,Config!$A$2:$B$5,2,0),2)","v":133.47},{"$f":"ROUND(((Config_RawLabor!F26/Config!$B$7)/Config_RawLabor!$G26)*VLOOKUP($A26,Config!$A$2:$B$5,2,0),2)","v":144.59},{"$f":"ROUND(((Config_RawLabor!H26/Config!$B$7)/Config_RawLabor!$K26)*VLOOKUP($A26,Config!$A$2:$B$5,2,0),2)","v":144.32},{"$f":"ROUND(((Config_RawLabor!I26/Config!$B$7)/Config_RawLabor!$K26)*VLOOKUP($A26,Config!$A$2:$B$5,2,0),2)","v":157.63999999999999},{"$f":"ROUND(((Config_RawLabor!J26/Config!$B$7)/Config_RawLabor!$K26)*VLOOKUP($A26,Config!$A$2:$B$5,2,0),2)","v":174.4},{"$f":"ROUND(((Config_RawLabor!L26/Config!$B$7)/Config_RawLabor!$O26)*VLOOKUP($A26,Config!$A$2:$B$5,2,0),2)","v":172.52},{"$f":"ROUND(((Config_RawLabor!M26/Config!$B$7)/Config_RawLabor!$O26)*VLOOKUP($A26,Config!$A$2:$B$5,2,0),2)","v":190.86},{"$f":"ROUND(((Config_RawLabor!N26/Config!$B$7)/Config_RawLabor!$O26)*VLOOKUP($A26,Config!$A$2:$B$5,2,0),2)","v":209.95},{"$f":"ROUND(((Config_RawLabor!P26/Config!$B$7)/Config_RawLabor!$S26)*VLOOKUP($A26,Config!$A$2:$B$5,2,0),2)","v":204.05},{"$f":"ROUND(((Config_RawLabor!Q26/Config!$B$7)/Config_RawLabor!$S26)*VLOOKUP($A26,Config!$A$2:$B$5,2,0),2)","v":221.09},{"$f":"ROUND(((Config_RawLabor!R26/Config!$B$7)/Config_RawLabor!$S26)*VLOOKUP($A26,Config!$A$2:$B$5,2,0),2)","v":241.82},{"$f":"ROUND(((Config_RawLabor!T26/Config!$B$7)/Config_RawLabor!$W26)*VLOOKUP($A26,Config!$A$2:$B$5,2,0),2)","v":238.69},{"$f":"ROUND(((Config_RawLabor!U26/Config!$B$7)/Config_RawLabor!$W26)*VLOOKUP($A26,Config!$A$2:$B$5,2,0),2)","v":264.32},{"$f":"ROUND(((Config_RawLabor!V26/Config!$B$7)/Config_RawLabor!$W26)*VLOOKUP($A26,Config!$A$2:$B$5,2,0),2)","v":284.61}]
[{"$f":"Config_RawLabor!A27","v":"Expert"},{"$f":"Config_RawLabor!B27","v":"Energy & Resources Expert"},{"$f":"Config_RawLabor!C27","v":"Offers broad, cross discipline expertise in analytic, methodological, theoretical, and practical approaches to problems in energy, resources, and the environment."},{"$f":"ROUND(((Config_RawLabor!D27/Config!$B$7)/Config_RawLabor!$G27)*VLOOKUP($A27,Config!$A$2:$B$5,2,0),2)","v":104.84},{"$f":"ROUND(((Config_RawLabor!E27/Config!$B$7)/Config_RawLabor!$G27)*VLOOKUP($A27,Config!$A$2:$B$5,2,0),2)","v":123.11},{"$f":"ROUND(((Config_RawLabor!F27/Config!$B$7)/Config_RawLabor!$G27)*VLOOKUP($A27,Config!$A$2:$B$5,2,0),2)","v":158.36000000000001},{"$f":"ROUND(((Config_RawLabor!H27/Config!$B$7)/Config_RawLabor!$K27)*VLOOKUP($A27,Config!$A$2:$B$5,2,0),2)","v":122.46},{"$f":"ROUND(((Config_RawLabor!I27/Config!$B$7)/Config_RawLabor!$K27)*VLOOKUP($A27,Config!$A$2:$B$5,2,0),2)","v":145.27000000000001},{"$f":"ROUND(((Config_RawLabor!J27/Config!$B$7)/Config_RawLabor!$K27)*VLOOKUP($A27,Config!$A$2:$B$5,2,0),2)","v":188.31},{"$f":"ROUND(((Config_RawLabor!L27/Config!$B$7)/Config_RawLabor!$O27)*VLOOKUP($A27,Config!$A$2:$B$5,2,0),2)","v":148.72999999999999},{"$f":"ROUND(((Config_RawLabor!M27/Config!$B$7)/Config_RawLabor!$O27)*VLOOKUP($A27,Config!$A$2:$B$5,2,0),2)","v":174.51},{"$f":"ROUND(((Config_RawLabor!N27/Config!$B$7)/Config_RawLabor!$O27)*VLOOKUP($A27,Config!$A$2:$B$5,2,0),2)","v":223.85},{"$f":"ROUND(((Config_RawLabor!P27/Config!$B$7)/Config_RawLabor!$S27)*VLOOKUP($A27,Config!$A$2:$B$5,2,0),2)","v":179.03},{"$f":"ROUND(((Config_RawLabor!Q27/Config!$B$7)/Config_RawLabor!$S27)*VLOOKUP($A27,Config!$A$2:$B$5,2,0),2)","v":211.15},{"$f":"ROUND(((Config_RawLabor!R27/Config!$B$7)/Config_RawLabor!$S27)*VLOOKUP($A27,Config!$A$2:$B$5,2,0),2)","v":266.33},{"$f":"ROUND(((Config_RawLabor!T27/Config!$B$7)/Config_RawLabor!$W27)*VLOOKUP($A27,Config!$A$2:$B$5,2,0),2)","v":193.8},{"$f":"ROUND(((Config_RawLabor!U27/Config!$B$7)/Config_RawLabor!$W27)*VLOOKUP($A27,Config!$A$2:$B$5,2,0),2)","v":229.98},{"$f":"ROUND(((Config_RawLabor!V27/Config!$B$7)/Config_RawLabor!$W27)*VLOOKUP($A27,Config!$A$2:$B$5,2,0),2)","v":287.86}]
[{"$f":"Config_RawLabor!A28","v":"Expert"},{"$f":"Config_RawLabor!B28","v":"Engineer "},{"$f":"Config_RawLabor!C28","v":"Provides expert consultation in one or more areas of engineering. Reviews highly complex technical issues and recommends alterations to development and design to improve quality of products and/or procedures. Has extensive engineering knowledge and is considered an expert in one or more engineering specialties. "},{"$f":"ROUND(((Config_RawLabor!D28/Config!$B$7)/Config_RawLabor!$G28)*VLOOKUP($A28,Config!$A$2:$B$5,2,0),2)","v":120.9},{"$f":"ROUND(((Config_RawLabor!E28/Config!$B$7)/Config_RawLabor!$G28)*VLOOKUP($A28,Config!$A$2:$B$5,2,0),2)","v":130.36000000000001},{"$f":"ROUND(((Config_RawLabor!F28/Config!$B$7)/Config_RawLabor!$G28)*VLOOKUP($A28,Config!$A$2:$B$5,2,0),2)","v":147.03},{"$f":"ROUND(((Config_RawLabor!H28/Config!$B$7)/Config_RawLabor!$K28)*VLOOKUP($A28,Config!$A$2:$B$5,2,0),2)","v":136.66999999999999},{"$f":"ROUND(((Config_RawLabor!I28/Config!$B$7)/Config_RawLabor!$K28)*VLOOKUP($A28,Config!$A$2:$B$5,2,0),2)","v":150.54},{"$f":"ROUND(((Config_RawLabor!J28/Config!$B$7)/Config_RawLabor!$K28)*VLOOKUP($A28,Config!$A$2:$B$5,2,0),2)","v":167.06},{"$f":"ROUND(((Config_RawLabor!L28/Config!$B$7)/Config_RawLabor!$O28)*VLOOKUP($A28,Config!$A$2:$B$5,2,0),2)","v":162.77000000000001},{"$f":"ROUND(((Config_RawLabor!M28/Config!$B$7)/Config_RawLabor!$O28)*VLOOKUP($A28,Config!$A$2:$B$5,2,0),2)","v":179.44},{"$f":"ROUND(((Config_RawLabor!N28/Config!$B$7)/Config_RawLabor!$O28)*VLOOKUP($A28,Config!$A$2:$B$5,2,0),2)","v":205.56},{"$f":"ROUND(((Config_RawLabor!P28/Config!$B$7)/Config_RawLabor!$S28)*VLOOKUP($A28,Config!$A$2:$B$5,2,0),2)","v":197.57},{"$f":"ROUND(((Config_RawLabor!Q28/Config!$B$7)/Config_RawLabor!$S28)*VLOOKUP($A28,Config!$A$2:$B$5,2,0),2)","v":219.81},{"$f":"ROUND(((Config_RawLabor!R28/Config!$B$7)/Config_RawLabor!$S28)*VLOOKUP($A28,Config!$A$2:$B$5,2,0),2)","v":244.24},{"$f":"ROUND(((Config_RawLabor!T28/Config!$B$7)/Config_RawLabor!$W28)*VLOOKUP($A28,Config!$A$2:$B$5,2,0),2)","v":233.32},{"$f":"ROUND(((Config_RawLabor!U28/Config!$B$7)/Config_RawLabor!$W28)*VLOOKUP($A28,Config!$A$2:$B$5,2,0),2)","v":261.07},{"$f":"ROUND(((Config_RawLabor!V28/Config!$B$7)/Config_RawLabor!$W28)*VLOOKUP($A28,Config!$A$2:$B$5,2,0),2)","v":297.22000000000003}]
[{"$f":"Config_RawLabor!A29","v":"Expert"},{"$f":"Config_RawLabor!B29","v":"Env., Health, and Safety Engineer "},{"$f":"Config_RawLabor!C29","v":"Provides review and expert recommendations with respect to local, state and federal environmental, health and safety regulations. May review the design of facilities, work areas and work procedures from an environmental, health and safety perspective. Reviews environmental policy and procedures. Ensures compliance with all environmental, health and safety regulations. "},{"$f":"ROUND(((Config_RawLabor!D29/Config!$B$7)/Config_RawLabor!$G29)*VLOOKUP($A29,Config!$A$2:$B$5,2,0),2)","v":104.02},{"$f":"ROUND(((Config_RawLabor!E29/Config!$B$7)/Config_RawLabor!$G29)*VLOOKUP($A29,Config!$A$2:$B$5,2,0),2)","v":112.24},{"$f":"ROUND(((Config_RawLabor!F29/Config!$B$7)/Config_RawLabor!$G29)*VLOOKUP($A29,Config!$A$2:$B$5,2,0),2)","v":130.52000000000001},{"$f":"ROUND(((Config_RawLabor!H29/Config!$B$7)/Config_RawLabor!$K29)*VLOOKUP($A29,Config!$A$2:$B$5,2,0),2)","v":127.95},{"$f":"ROUND(((Config_RawLabor!I29/Config!$B$7)/Config_RawLabor!$K29)*VLOOKUP($A29,Config!$A$2:$B$5,2,0),2)","v":137.88},{"$f":"ROUND(((Config_RawLabor!J29/Config!$B$7)/Config_RawLabor!$K29)*VLOOKUP($A29,Config!$A$2:$B$5,2,0),2)","v":145.43},{"$f":"ROUND(((Config_RawLabor!L29/Config!$B$7)/Config_RawLabor!$O29)*VLOOKUP($A29,Config!$A$2:$B$5,2,0),2)","v":151.46},{"$f":"ROUND(((Config_RawLabor!M29/Config!$B$7)/Config_RawLabor!$O29)*VLOOKUP($A29,Config!$A$2:$B$5,2,0),2)","v":166.39},{"$f":"ROUND(((Config_RawLabor!N29/Config!$B$7)/Config_RawLabor!$O29)*VLOOKUP($A29,Config!$A$2:$B$5,2,0),2)","v":179.97},{"$f":"ROUND(((Config_RawLabor!P29/Config!$B$7)/Config_RawLabor!$S29)*VLOOKUP($A29,Config!$A$2:$B$5,2,0),2)","v":178.7},{"$f":"ROUND(((Config_RawLabor!Q29/Config!$B$7)/Config_RawLabor!$S29)*VLOOKUP($A29,Config!$A$2:$B$5,2,0),2)","v":199.31},{"$f":"ROUND(((Config_RawLabor!R29/Config!$B$7)/Config_RawLabor!$S29)*VLOOKUP($A29,Config!$A$2:$B$5,2,0),2)","v":218.5},{"$f":"ROUND(((Config_RawLabor!T29/Config!$B$7)/Config_RawLabor!$W29)*VLOOKUP($A29,Config!$A$2:$B$5,2,0),2)","v":227.84},{"$f":"ROUND(((Config_RawLabor!U29/Config!$B$7)/Config_RawLabor!$W29)*VLOOKUP($A29,Config!$A$2:$B$5,2,0),2)","v":254.18},{"$f":"ROUND(((Config_RawLabor!V29/Config!$B$7)/Config_RawLabor!$W29)*VLOOKUP($A29,Config!$A$2:$B$5,2,0),2)","v":275.13}]
[{"$f":"Config_RawLabor!A30","v":"Expert"},{"$f":"Config_RawLabor!B30","v":"Environmental Engineer "},{"$f":"Config_RawLabor!C30","v":"Identifies, assesses and resolves problems concerning the environment. May review measuring approaches, equipment and results in areas such as pollutants involving air, land, and water. Provides reports findings on environmental consequences of equipment, tools, and procedures. Reviews conformance to federal, state, and local environmental legislation."},{"$f":"ROUND(((Config_RawLabor!D30/Config!$B$7)/Config_RawLabor!$G30)*VLOOKUP($A30,Config!$A$2:$B$5,2,0),2)","v":108.1},{"$f":"ROUND(((Config_RawLabor!E30/Config!$B$7)/Config_RawLabor!$G30)*VLOOKUP($A30,Config!$A$2:$B$5,2,0),2)","v":121.99},{"$f":"ROUND(((Config_RawLabor!F30/Config!$B$7)/Config_RawLabor!$G30)*VLOOKUP($A30,Config!$A$2:$B$5,2,0),2)","v":137.66},{"$f":"ROUND(((Config_RawLabor!H30/Config!$B$7)/Config_RawLabor!$K30)*VLOOKUP($A30,Config!$A$2:$B$5,2,0),2)","v":138.1},{"$f":"ROUND(((Config_RawLabor!I30/Config!$B$7)/Config_RawLabor!$K30)*VLOOKUP($A30,Config!$A$2:$B$5,2,0),2)","v":152.85},{"$f":"ROUND(((Config_RawLabor!J30/Config!$B$7)/Config_RawLabor!$K30)*VLOOKUP($A30,Config!$A$2:$B$5,2,0),2)","v":170.93},{"$f":"ROUND(((Config_RawLabor!L30/Config!$B$7)/Config_RawLabor!$O30)*VLOOKUP($A30,Config!$A$2:$B$5,2,0),2)","v":159.83000000000001},{"$f":"ROUND(((Config_RawLabor!M30/Config!$B$7)/Config_RawLabor!$O30)*VLOOKUP($A30,Config!$A$2:$B$5,2,0),2)","v":180.95},{"$f":"ROUND(((Config_RawLabor!N30/Config!$B$7)/Config_RawLabor!$O30)*VLOOKUP($A30,Config!$A$2:$B$5,2,0),2)","v":204.7},{"$f":"ROUND(((Config_RawLabor!P30/Config!$B$7)/Config_RawLabor!$S30)*VLOOKUP($A30,Config!$A$2:$B$5,2,0),2)","v":171.17},{"$f":"ROUND(((Config_RawLabor!Q30/Config!$B$7)/Config_RawLabor!$S30)*VLOOKUP($A30,Config!$A$2:$B$5,2,0),2)","v":195.3},{"$f":"ROUND(((Config_RawLabor!R30/Config!$B$7)/Config_RawLabor!$S30)*VLOOKUP($A30,Config!$A$2:$B$5,2,0),2)","v":219.45},{"$f":"ROUND(((Config_RawLabor!T30/Config!$B$7)/Config_RawLabor!$W30)*VLOOKUP($A30,Config!$A$2:$B$5,2,0),2)","v":191.77},{"$f":"ROUND(((Config_RawLabor!U30/Config!$B$7)/Config_RawLabor!$W30)*VLOOKUP($A30,Config!$A$2:$B$5,2,0),2)","v":227.93},{"$f":"ROUND(((Config_RawLabor!V30/Config!$B$7)/Config_RawLabor!$W30)*VLOOKUP($A30,Config!$A$2:$B$5,2,0),2)","v":259.92}]
[{"$f":"Config_RawLabor!A31","v":"Expert"},{"$f":"Config_RawLabor!B31","v":"Equipment Engineer "},{"$f":"Config_RawLabor!C31","v":"Provides expert consultation with respect to technical products and equipment. Recognized as technical leader and resource. Recommends alterations and enhancements to improve quality of products and/or procedures. "},{"$f":"ROUND(((Config_RawLabor!D31/Config!$B$7)/Config_RawLabor!$G31)*VLOOKUP($A31,Config!$A$2:$B$5,2,0),2)","v":119.38},{"$f":"ROUND(((Config_RawLabor!E31/Config!$B$7)/Config_RawLabor!$G31)*VLOOKUP($A31,Config!$A$2:$B$5,2,0),2)","v":132.66999999999999},{"$f":"ROUND(((Config_RawLabor!F31/Config!$B$7)/Config_RawLabor!$G31)*VLOOKUP($A31,Config!$A$2:$B$5,2,0),2)","v":145.25},{"$f":"ROUND(((Config_RawLabor!H31/Config!$B$7)/Config_RawLabor!$K31)*VLOOKUP($A31,Config!$A$2:$B$5,2,0),2)","v":148.99},{"$f":"ROUND(((Config_RawLabor!I31/Config!$B$7)/Config_RawLabor!$K31)*VLOOKUP($A31,Config!$A$2:$B$5,2,0),2)","v":165.69},{"$f":"ROUND(((Config_RawLabor!J31/Config!$B$7)/Config_RawLabor!$K31)*VLOOKUP($A31,Config!$A$2:$B$5,2,0),2)","v":185.83},{"$f":"ROUND(((Config_RawLabor!L31/Config!$B$7)/Config_RawLabor!$O31)*VLOOKUP($A31,Config!$A$2:$B$5,2,0),2)","v":162.53},{"$f":"ROUND(((Config_RawLabor!M31/Config!$B$7)/Config_RawLabor!$O31)*VLOOKUP($A31,Config!$A$2:$B$5,2,0),2)","v":180.73},{"$f":"ROUND(((Config_RawLabor!N31/Config!$B$7)/Config_RawLabor!$O31)*VLOOKUP($A31,Config!$A$2:$B$5,2,0),2)","v":204.85},{"$f":"ROUND(((Config_RawLabor!P31/Config!$B$7)/Config_RawLabor!$S31)*VLOOKUP($A31,Config!$A$2:$B$5,2,0),2)","v":195.17},{"$f":"ROUND(((Config_RawLabor!Q31/Config!$B$7)/Config_RawLabor!$S31)*VLOOKUP($A31,Config!$A$2:$B$5,2,0),2)","v":219.14},{"$f":"ROUND(((Config_RawLabor!R31/Config!$B$7)/Config_RawLabor!$S31)*VLOOKUP($A31,Config!$A$2:$B$5,2,0),2)","v":248.15},{"$f":"ROUND(((Config_RawLabor!T31/Config!$B$7)/Config_RawLabor!$W31)*VLOOKUP($A31,Config!$A$2:$B$5,2,0),2)","v":218.25},{"$f":"ROUND(((Config_RawLabor!U31/Config!$B$7)/Config_RawLabor!$W31)*VLOOKUP($A31,Config!$A$2:$B$5,2,0),2)","v":237.8},{"$f":"ROUND(((Config_RawLabor!V31/Config!$B$7)/Config_RawLabor!$W31)*VLOOKUP($A31,Config!$A$2:$B$5,2,0),2)","v":258.2}]
[{"$f":"Config_RawLabor!A32","v":"Expert"},{"$f":"Config_RawLabor!B32","v":"Expert - Not Otherwise Classified"},{"$f":"Config_RawLabor!C32","v":"Used for export roles that are not better classified as one of the more detailed roles. May also be used for experts that fill multiple subroles."},{"$f":"ROUND(((Config_RawLabor!D32/Config!$B$7)/Config_RawLabor!$G32)*VLOOKUP($A32,Config!$A$2:$B$5,2,0),2)","v":124.7},{"$f":"ROUND(((Config_RawLabor!E32/Config!$B$7)/Config_RawLabor!$G32)*VLOOKUP($A32,Config!$A$2:$B$5,2,0),2)","v":138.88},{"$f":"ROUND(((Config_RawLabor!F32/Config!$B$7)/Config_RawLabor!$G32)*VLOOKUP($A32,Config!$A$2:$B$5,2,0),2)","v":160.94999999999999},{"$f":"ROUND(((Config_RawLabor!H32/Config!$B$7)/Config_RawLabor!$K32)*VLOOKUP($A32,Config!$A$2:$B$5,2,0),2)","v":145.87},{"$f":"ROUND(((Config_RawLabor!I32/Config!$B$7)/Config_RawLabor!$K32)*VLOOKUP($A32,Config!$A$2:$B$5,2,0),2)","v":164.06},{"$f":"ROUND(((Config_RawLabor!J32/Config!$B$7)/Config_RawLabor!$K32)*VLOOKUP($A32,Config!$A$2:$B$5,2,0),2)","v":190.62},{"$f":"ROUND(((Config_RawLabor!L32/Config!$B$7)/Config_RawLabor!$O32)*VLOOKUP($A32,Config!$A$2:$B$5,2,0),2)","v":173.56},{"$f":"ROUND(((Config_RawLabor!M32/Config!$B$7)/Config_RawLabor!$O32)*VLOOKUP($A32,Config!$A$2:$B$5,2,0),2)","v":195.04},{"$f":"ROUND(((Config_RawLabor!N32/Config!$B$7)/Config_RawLabor!$O32)*VLOOKUP($A32,Config!$A$2:$B$5,2,0),2)","v":225.9},{"$f":"ROUND(((Config_RawLabor!P32/Config!$B$7)/Config_RawLabor!$S32)*VLOOKUP($A32,Config!$A$2:$B$5,2,0),2)","v":205.22},{"$f":"ROUND(((Config_RawLabor!Q32/Config!$B$7)/Config_RawLabor!$S32)*VLOOKUP($A32,Config!$A$2:$B$5,2,0),2)","v":230.29},{"$f":"ROUND(((Config_RawLabor!R32/Config!$B$7)/Config_RawLabor!$S32)*VLOOKUP($A32,Config!$A$2:$B$5,2,0),2)","v":264.66000000000003},{"$f":"ROUND(((Config_RawLabor!T32/Config!$B$7)/Config_RawLabor!$W32)*VLOOKUP($A32,Config!$A$2:$B$5,2,0),2)","v":235.63},{"$f":"ROUND(((Config_RawLabor!U32/Config!$B$7)/Config_RawLabor!$W32)*VLOOKUP($A32,Config!$A$2:$B$5,2,0),2)","v":265.3},{"$f":"ROUND(((Config_RawLabor!V32/Config!$B$7)/Config_RawLabor!$W32)*VLOOKUP($A32,Config!$A$2:$B$5,2,0),2)","v":304.32}]
[{"$f":"Config_RawLabor!A33","v":"Expert"},{"$f":"Config_RawLabor!B33","v":"Expert - Social Work"},{"$f":"Config_RawLabor!C33","v":"Provides expertise in the discipline area of social work.  Familiar with current literature and research in the selected field."},{"$f":"ROUND(((Config_RawLabor!D33/Config!$B$7)/Config_RawLabor!$G33)*VLOOKUP($A33,Config!$A$2:$B$5,2,0),2)","v":102.11},{"$f":"ROUND(((Config_RawLabor!E33/Config!$B$7)/Config_RawLabor!$G33)*VLOOKUP($A33,Config!$A$2:$B$5,2,0),2)","v":124.54},{"$f":"ROUND(((Config_RawLabor!F33/Config!$B$7)/Config_RawLabor!$G33)*VLOOKUP($A33,Config!$A$2:$B$5,2,0),2)","v":177.85},{"$f":"ROUND(((Config_RawLabor!H33/Config!$B$7)/Config_RawLabor!$K33)*VLOOKUP($A33,Config!$A$2:$B$5,2,0),2)","v":120.34},{"$f":"ROUND(((Config_RawLabor!I33/Config!$B$7)/Config_RawLabor!$K33)*VLOOKUP($A33,Config!$A$2:$B$5,2,0),2)","v":148.35},{"$f":"ROUND(((Config_RawLabor!J33/Config!$B$7)/Config_RawLabor!$K33)*VLOOKUP($A33,Config!$A$2:$B$5,2,0),2)","v":212.44},{"$f":"ROUND(((Config_RawLabor!L33/Config!$B$7)/Config_RawLabor!$O33)*VLOOKUP($A33,Config!$A$2:$B$5,2,0),2)","v":142.97999999999999},{"$f":"ROUND(((Config_RawLabor!M33/Config!$B$7)/Config_RawLabor!$O33)*VLOOKUP($A33,Config!$A$2:$B$5,2,0),2)","v":175.84},{"$f":"ROUND(((Config_RawLabor!N33/Config!$B$7)/Config_RawLabor!$O33)*VLOOKUP($A33,Config!$A$2:$B$5,2,0),2)","v":250.64},{"$f":"ROUND(((Config_RawLabor!P33/Config!$B$7)/Config_RawLabor!$S33)*VLOOKUP($A33,Config!$A$2:$B$5,2,0),2)","v":168.65},{"$f":"ROUND(((Config_RawLabor!Q33/Config!$B$7)/Config_RawLabor!$S33)*VLOOKUP($A33,Config!$A$2:$B$5,2,0),2)","v":206.97},{"$f":"ROUND(((Config_RawLabor!R33/Config!$B$7)/Config_RawLabor!$S33)*VLOOKUP($A33,Config!$A$2:$B$5,2,0),2)","v":293.04000000000002},{"$f":"ROUND(((Config_RawLabor!T33/Config!$B$7)/Config_RawLabor!$W33)*VLOOKUP($A33,Config!$A$2:$B$5,2,0),2)","v":190.93},{"$f":"ROUND(((Config_RawLabor!U33/Config!$B$7)/Config_RawLabor!$W33)*VLOOKUP($A33,Config!$A$2:$B$5,2,0),2)","v":234.98},{"$f":"ROUND(((Config_RawLabor!V33/Config!$B$7)/Config_RawLabor!$W33)*VLOOKUP($A33,Config!$A$2:$B$5,2,0),2)","v":331.55}]
[{"$f":"Config_RawLabor!A34","v":"Expert"},{"$f":"Config_RawLabor!B34","v":"Field Service Engineer "},{"$f":"Config_RawLabor!C34","v":"Reviews installation and maintenance of products/equipment. Identifies, analyzes, makes recommendations regarding product failures, installation of new components or parts. Develops creative recommendations for more unique, chronic, or complex issues. Provides the intervenor team with explanations of product features and typical operation. Has extensive knowledge of an organization's products and services and is considered an expert."},{"$f":"ROUND(((Config_RawLabor!D34/Config!$B$7)/Config_RawLabor!$G34)*VLOOKUP($A34,Config!$A$2:$B$5,2,0),2)","v":102.25},{"$f":"ROUND(((Config_RawLabor!E34/Config!$B$7)/Config_RawLabor!$G34)*VLOOKUP($A34,Config!$A$2:$B$5,2,0),2)","v":117.3},{"$f":"ROUND(((Config_RawLabor!F34/Config!$B$7)/Config_RawLabor!$G34)*VLOOKUP($A34,Config!$A$2:$B$5,2,0),2)","v":135.02000000000001},{"$f":"ROUND(((Config_RawLabor!H34/Config!$B$7)/Config_RawLabor!$K34)*VLOOKUP($A34,Config!$A$2:$B$5,2,0),2)","v":120.7},{"$f":"ROUND(((Config_RawLabor!I34/Config!$B$7)/Config_RawLabor!$K34)*VLOOKUP($A34,Config!$A$2:$B$5,2,0),2)","v":139.09},{"$f":"ROUND(((Config_RawLabor!J34/Config!$B$7)/Config_RawLabor!$K34)*VLOOKUP($A34,Config!$A$2:$B$5,2,0),2)","v":159.75},{"$f":"ROUND(((Config_RawLabor!L34/Config!$B$7)/Config_RawLabor!$O34)*VLOOKUP($A34,Config!$A$2:$B$5,2,0),2)","v":147.68},{"$f":"ROUND(((Config_RawLabor!M34/Config!$B$7)/Config_RawLabor!$O34)*VLOOKUP($A34,Config!$A$2:$B$5,2,0),2)","v":168.06},{"$f":"ROUND(((Config_RawLabor!N34/Config!$B$7)/Config_RawLabor!$O34)*VLOOKUP($A34,Config!$A$2:$B$5,2,0),2)","v":194.15},{"$f":"ROUND(((Config_RawLabor!P34/Config!$B$7)/Config_RawLabor!$S34)*VLOOKUP($A34,Config!$A$2:$B$5,2,0),2)","v":171.69},{"$f":"ROUND(((Config_RawLabor!Q34/Config!$B$7)/Config_RawLabor!$S34)*VLOOKUP($A34,Config!$A$2:$B$5,2,0),2)","v":200.56},{"$f":"ROUND(((Config_RawLabor!R34/Config!$B$7)/Config_RawLabor!$S34)*VLOOKUP($A34,Config!$A$2:$B$5,2,0),2)","v":222.18},{"$f":"ROUND(((Config_RawLabor!T34/Config!$B$7)/Config_RawLabor!$W34)*VLOOKUP($A34,Config!$A$2:$B$5,2,0),2)","v":187.79},{"$f":"ROUND(((Config_RawLabor!U34/Config!$B$7)/Config_RawLabor!$W34)*VLOOKUP($A34,Config!$A$2:$B$5,2,0),2)","v":216.93},{"$f":"ROUND(((Config_RawLabor!V34/Config!$B$7)/Config_RawLabor!$W34)*VLOOKUP($A34,Config!$A$2:$B$5,2,0),2)","v":241.25}]
[{"$f":"Config_RawLabor!A35","v":"Expert"},{"$f":"Config_RawLabor!B35","v":"Fire Fighter"},{"$f":"Config_RawLabor!C35","v":"Provides explanations of standard or expected fire fighting procedures under typical, potential, or observed scenarios."},{"$f":"ROUND(((Config_RawLabor!D35/Config!$B$7)/Config_RawLabor!$G35)*VLOOKUP($A35,Config!$A$2:$B$5,2,0),2)","v":48.63},{"$f":"ROUND(((Config_RawLabor!E35/Config!$B$7)/Config_RawLabor!$G35)*VLOOKUP($A35,Config!$A$2:$B$5,2,0),2)","v":64.31},{"$f":"ROUND(((Config_RawLabor!F35/Config!$B$7)/Config_RawLabor!$G35)*VLOOKUP($A35,Config!$A$2:$B$5,2,0),2)","v":80.540000000000006},{"$f":"ROUND(((Config_RawLabor!H35/Config!$B$7)/Config_RawLabor!$K35)*VLOOKUP($A35,Config!$A$2:$B$5,2,0),2)","v":57.32},{"$f":"ROUND(((Config_RawLabor!I35/Config!$B$7)/Config_RawLabor!$K35)*VLOOKUP($A35,Config!$A$2:$B$5,2,0),2)","v":76.599999999999994},{"$f":"ROUND(((Config_RawLabor!J35/Config!$B$7)/Config_RawLabor!$K35)*VLOOKUP($A35,Config!$A$2:$B$5,2,0),2)","v":96.2},{"$f":"ROUND(((Config_RawLabor!L35/Config!$B$7)/Config_RawLabor!$O35)*VLOOKUP($A35,Config!$A$2:$B$5,2,0),2)","v":68.099999999999994},{"$f":"ROUND(((Config_RawLabor!M35/Config!$B$7)/Config_RawLabor!$O35)*VLOOKUP($A35,Config!$A$2:$B$5,2,0),2)","v":90.8},{"$f":"ROUND(((Config_RawLabor!N35/Config!$B$7)/Config_RawLabor!$O35)*VLOOKUP($A35,Config!$A$2:$B$5,2,0),2)","v":113.5},{"$f":"ROUND(((Config_RawLabor!P35/Config!$B$7)/Config_RawLabor!$S35)*VLOOKUP($A35,Config!$A$2:$B$5,2,0),2)","v":80.319999999999993},{"$f":"ROUND(((Config_RawLabor!Q35/Config!$B$7)/Config_RawLabor!$S35)*VLOOKUP($A35,Config!$A$2:$B$5,2,0),2)","v":106.87},{"$f":"ROUND(((Config_RawLabor!R35/Config!$B$7)/Config_RawLabor!$S35)*VLOOKUP($A35,Config!$A$2:$B$5,2,0),2)","v":132.69999999999999},{"$f":"ROUND(((Config_RawLabor!T35/Config!$B$7)/Config_RawLabor!$W35)*VLOOKUP($A35,Config!$A$2:$B$5,2,0),2)","v":90.93},{"$f":"ROUND(((Config_RawLabor!U35/Config!$B$7)/Config_RawLabor!$W35)*VLOOKUP($A35,Config!$A$2:$B$5,2,0),2)","v":121.34},{"$f":"ROUND(((Config_RawLabor!V35/Config!$B$7)/Config_RawLabor!$W35)*VLOOKUP($A35,Config!$A$2:$B$5,2,0),2)","v":150.13}]
[{"$f":"Config_RawLabor!A36","v":"Expert"},{"$f":"Config_RawLabor!B36","v":"Fire Inspector Supervisor"},{"$f":"Config_RawLabor!C36","v":"Oversees the inspection of fire-damage to determine cause. Reviews preventive actions for appropriatness. Provides explanations of a variety of fire laws, regulations, and policies, including identifying those that are appropriate for a given situation. Assesses compliance with laws, regulations, and policies. "},{"$f":"ROUND(((Config_RawLabor!D36/Config!$B$7)/Config_RawLabor!$G36)*VLOOKUP($A36,Config!$A$2:$B$5,2,0),2)","v":86.93},{"$f":"ROUND(((Config_RawLabor!E36/Config!$B$7)/Config_RawLabor!$G36)*VLOOKUP($A36,Config!$A$2:$B$5,2,0),2)","v":104.36},{"$f":"ROUND(((Config_RawLabor!F36/Config!$B$7)/Config_RawLabor!$G36)*VLOOKUP($A36,Config!$A$2:$B$5,2,0),2)","v":128.15},{"$f":"ROUND(((Config_RawLabor!H36/Config!$B$7)/Config_RawLabor!$K36)*VLOOKUP($A36,Config!$A$2:$B$5,2,0),2)","v":102.45},{"$f":"ROUND(((Config_RawLabor!I36/Config!$B$7)/Config_RawLabor!$K36)*VLOOKUP($A36,Config!$A$2:$B$5,2,0),2)","v":124.31},{"$f":"ROUND(((Config_RawLabor!J36/Config!$B$7)/Config_RawLabor!$K36)*VLOOKUP($A36,Config!$A$2:$B$5,2,0),2)","v":153.08000000000001},{"$f":"ROUND(((Config_RawLabor!L36/Config!$B$7)/Config_RawLabor!$O36)*VLOOKUP($A36,Config!$A$2:$B$5,2,0),2)","v":121.73},{"$f":"ROUND(((Config_RawLabor!M36/Config!$B$7)/Config_RawLabor!$O36)*VLOOKUP($A36,Config!$A$2:$B$5,2,0),2)","v":147.34},{"$f":"ROUND(((Config_RawLabor!N36/Config!$B$7)/Config_RawLabor!$O36)*VLOOKUP($A36,Config!$A$2:$B$5,2,0),2)","v":180.61},{"$f":"ROUND(((Config_RawLabor!P36/Config!$B$7)/Config_RawLabor!$S36)*VLOOKUP($A36,Config!$A$2:$B$5,2,0),2)","v":143.58000000000001},{"$f":"ROUND(((Config_RawLabor!Q36/Config!$B$7)/Config_RawLabor!$S36)*VLOOKUP($A36,Config!$A$2:$B$5,2,0),2)","v":173.43},{"$f":"ROUND(((Config_RawLabor!R36/Config!$B$7)/Config_RawLabor!$S36)*VLOOKUP($A36,Config!$A$2:$B$5,2,0),2)","v":211.16},{"$f":"ROUND(((Config_RawLabor!T36/Config!$B$7)/Config_RawLabor!$W36)*VLOOKUP($A36,Config!$A$2:$B$5,2,0),2)","v":162.55000000000001},{"$f":"ROUND(((Config_RawLabor!U36/Config!$B$7)/Config_RawLabor!$W36)*VLOOKUP($A36,Config!$A$2:$B$5,2,0),2)","v":196.9},{"$f":"ROUND(((Config_RawLabor!V36/Config!$B$7)/Config_RawLabor!$W36)*VLOOKUP($A36,Config!$A$2:$B$5,2,0),2)","v":238.9}]
[{"$f":"Config_RawLabor!A37","v":"Expert"},{"$f":"Config_RawLabor!B37","v":"Fire Prevention Engineer"},{"$f":"Config_RawLabor!C37","v":"Examines buildings and equipment to determine compliance with fire prevention best practices. Ensures fire compliance codes are being adhered to. "},{"$f":"ROUND(((Config_RawLabor!D37/Config!$B$7)/Config_RawLabor!$G37)*VLOOKUP($A37,Config!$A$2:$B$5,2,0),2)","v":82.55},{"$f":"ROUND(((Config_RawLabor!E37/Config!$B$7)/Config_RawLabor!$G37)*VLOOKUP($A37,Config!$A$2:$B$5,2,0),2)","v":85.01},{"$f":"ROUND(((Config_RawLabor!F37/Config!$B$7)/Config_RawLabor!$G37)*VLOOKUP($A37,Config!$A$2:$B$5,2,0),2)","v":100.75},{"$f":"ROUND(((Config_RawLabor!H37/Config!$B$7)/Config_RawLabor!$K37)*VLOOKUP($A37,Config!$A$2:$B$5,2,0),2)","v":97.29},{"$f":"ROUND(((Config_RawLabor!I37/Config!$B$7)/Config_RawLabor!$K37)*VLOOKUP($A37,Config!$A$2:$B$5,2,0),2)","v":101.26},{"$f":"ROUND(((Config_RawLabor!J37/Config!$B$7)/Config_RawLabor!$K37)*VLOOKUP($A37,Config!$A$2:$B$5,2,0),2)","v":120.35},{"$f":"ROUND(((Config_RawLabor!L37/Config!$B$7)/Config_RawLabor!$O37)*VLOOKUP($A37,Config!$A$2:$B$5,2,0),2)","v":115.6},{"$f":"ROUND(((Config_RawLabor!M37/Config!$B$7)/Config_RawLabor!$O37)*VLOOKUP($A37,Config!$A$2:$B$5,2,0),2)","v":120.03},{"$f":"ROUND(((Config_RawLabor!N37/Config!$B$7)/Config_RawLabor!$O37)*VLOOKUP($A37,Config!$A$2:$B$5,2,0),2)","v":141.99},{"$f":"ROUND(((Config_RawLabor!P37/Config!$B$7)/Config_RawLabor!$S37)*VLOOKUP($A37,Config!$A$2:$B$5,2,0),2)","v":136.35},{"$f":"ROUND(((Config_RawLabor!Q37/Config!$B$7)/Config_RawLabor!$S37)*VLOOKUP($A37,Config!$A$2:$B$5,2,0),2)","v":141.28},{"$f":"ROUND(((Config_RawLabor!R37/Config!$B$7)/Config_RawLabor!$S37)*VLOOKUP($A37,Config!$A$2:$B$5,2,0),2)","v":166.01},{"$f":"ROUND(((Config_RawLabor!T37/Config!$B$7)/Config_RawLabor!$W37)*VLOOKUP($A37,Config!$A$2:$B$5,2,0),2)","v":154.36000000000001},{"$f":"ROUND(((Config_RawLabor!U37/Config!$B$7)/Config_RawLabor!$W37)*VLOOKUP($A37,Config!$A$2:$B$5,2,0),2)","v":160.4},{"$f":"ROUND(((Config_RawLabor!V37/Config!$B$7)/Config_RawLabor!$W37)*VLOOKUP($A37,Config!$A$2:$B$5,2,0),2)","v":187.83}]
[{"$f":"Config_RawLabor!A38","v":"Expert"},{"$f":"Config_RawLabor!B38","v":"Geologist"},{"$f":"Config_RawLabor!C38","v":"Expert on the formation, dissolution, and content of rock layers, along with the effects of internal pressures, heat, water, pollution, and erosion. "},{"$f":"ROUND(((Config_RawLabor!D38/Config!$B$7)/Config_RawLabor!$G38)*VLOOKUP($A38,Config!$A$2:$B$5,2,0),2)","v":107.09},{"$f":"ROUND(((Config_RawLabor!E38/Config!$B$7)/Config_RawLabor!$G38)*VLOOKUP($A38,Config!$A$2:$B$5,2,0),2)","v":110.93},{"$f":"ROUND(((Config_RawLabor!F38/Config!$B$7)/Config_RawLabor!$G38)*VLOOKUP($A38,Config!$A$2:$B$5,2,0),2)","v":130.24},{"$f":"ROUND(((Config_RawLabor!H38/Config!$B$7)/Config_RawLabor!$K38)*VLOOKUP($A38,Config!$A$2:$B$5,2,0),2)","v":125.95},{"$f":"ROUND(((Config_RawLabor!I38/Config!$B$7)/Config_RawLabor!$K38)*VLOOKUP($A38,Config!$A$2:$B$5,2,0),2)","v":140.38},{"$f":"ROUND(((Config_RawLabor!J38/Config!$B$7)/Config_RawLabor!$K38)*VLOOKUP($A38,Config!$A$2:$B$5,2,0),2)","v":179.54},{"$f":"ROUND(((Config_RawLabor!L38/Config!$B$7)/Config_RawLabor!$O38)*VLOOKUP($A38,Config!$A$2:$B$5,2,0),2)","v":168.13},{"$f":"ROUND(((Config_RawLabor!M38/Config!$B$7)/Config_RawLabor!$O38)*VLOOKUP($A38,Config!$A$2:$B$5,2,0),2)","v":178.86},{"$f":"ROUND(((Config_RawLabor!N38/Config!$B$7)/Config_RawLabor!$O38)*VLOOKUP($A38,Config!$A$2:$B$5,2,0),2)","v":209},{"$f":"ROUND(((Config_RawLabor!P38/Config!$B$7)/Config_RawLabor!$S38)*VLOOKUP($A38,Config!$A$2:$B$5,2,0),2)","v":176.7},{"$f":"ROUND(((Config_RawLabor!Q38/Config!$B$7)/Config_RawLabor!$S38)*VLOOKUP($A38,Config!$A$2:$B$5,2,0),2)","v":208.85},{"$f":"ROUND(((Config_RawLabor!R38/Config!$B$7)/Config_RawLabor!$S38)*VLOOKUP($A38,Config!$A$2:$B$5,2,0),2)","v":240.1},{"$f":"ROUND(((Config_RawLabor!T38/Config!$B$7)/Config_RawLabor!$W38)*VLOOKUP($A38,Config!$A$2:$B$5,2,0),2)","v":224.64},{"$f":"ROUND(((Config_RawLabor!U38/Config!$B$7)/Config_RawLabor!$W38)*VLOOKUP($A38,Config!$A$2:$B$5,2,0),2)","v":270.47000000000003},{"$f":"ROUND(((Config_RawLabor!V38/Config!$B$7)/Config_RawLabor!$W38)*VLOOKUP($A38,Config!$A$2:$B$5,2,0),2)","v":296.61}]
[{"$f":"Config_RawLabor!A39","v":"Expert"},{"$f":"Config_RawLabor!B39","v":"Geotechnical Engineer"},{"$f":"Config_RawLabor!C39","v":"Prepares and inspects projects involving drilling and exploration. Responsible for reviewing geological maps, site characterization, numerical modeling and analysis of excavations/supports. "},{"$f":"ROUND(((Config_RawLabor!D39/Config!$B$7)/Config_RawLabor!$G39)*VLOOKUP($A39,Config!$A$2:$B$5,2,0),2)","v":111.53},{"$f":"ROUND(((Config_RawLabor!E39/Config!$B$7)/Config_RawLabor!$G39)*VLOOKUP($A39,Config!$A$2:$B$5,2,0),2)","v":122.77},{"$f":"ROUND(((Config_RawLabor!F39/Config!$B$7)/Config_RawLabor!$G39)*VLOOKUP($A39,Config!$A$2:$B$5,2,0),2)","v":130.80000000000001},{"$f":"ROUND(((Config_RawLabor!H39/Config!$B$7)/Config_RawLabor!$K39)*VLOOKUP($A39,Config!$A$2:$B$5,2,0),2)","v":115.31},{"$f":"ROUND(((Config_RawLabor!I39/Config!$B$7)/Config_RawLabor!$K39)*VLOOKUP($A39,Config!$A$2:$B$5,2,0),2)","v":134.38},{"$f":"ROUND(((Config_RawLabor!J39/Config!$B$7)/Config_RawLabor!$K39)*VLOOKUP($A39,Config!$A$2:$B$5,2,0),2)","v":146.43},{"$f":"ROUND(((Config_RawLabor!L39/Config!$B$7)/Config_RawLabor!$O39)*VLOOKUP($A39,Config!$A$2:$B$5,2,0),2)","v":148.15},{"$f":"ROUND(((Config_RawLabor!M39/Config!$B$7)/Config_RawLabor!$O39)*VLOOKUP($A39,Config!$A$2:$B$5,2,0),2)","v":171.75},{"$f":"ROUND(((Config_RawLabor!N39/Config!$B$7)/Config_RawLabor!$O39)*VLOOKUP($A39,Config!$A$2:$B$5,2,0),2)","v":185.71},{"$f":"ROUND(((Config_RawLabor!P39/Config!$B$7)/Config_RawLabor!$S39)*VLOOKUP($A39,Config!$A$2:$B$5,2,0),2)","v":197.06},{"$f":"ROUND(((Config_RawLabor!Q39/Config!$B$7)/Config_RawLabor!$S39)*VLOOKUP($A39,Config!$A$2:$B$5,2,0),2)","v":207.43},{"$f":"ROUND(((Config_RawLabor!R39/Config!$B$7)/Config_RawLabor!$S39)*VLOOKUP($A39,Config!$A$2:$B$5,2,0),2)","v":217.82},{"$f":"ROUND(((Config_RawLabor!T39/Config!$B$7)/Config_RawLabor!$W39)*VLOOKUP($A39,Config!$A$2:$B$5,2,0),2)","v":224.48},{"$f":"ROUND(((Config_RawLabor!U39/Config!$B$7)/Config_RawLabor!$W39)*VLOOKUP($A39,Config!$A$2:$B$5,2,0),2)","v":236.29},{"$f":"ROUND(((Config_RawLabor!V39/Config!$B$7)/Config_RawLabor!$W39)*VLOOKUP($A39,Config!$A$2:$B$5,2,0),2)","v":248.13}]
[{"$f":"Config_RawLabor!A40","v":"Expert"},{"$f":"Config_RawLabor!B40","v":"Hardware Engineer "},{"$f":"Config_RawLabor!C40","v":"Reviews design, development, and implementation of hardware for products. Reviews test strategies and implementation, devices, and systems. Reviews stress and performance test results for a variety of computer hardware including circuit boards, processors and wiring. "},{"$f":"ROUND(((Config_RawLabor!D40/Config!$B$7)/Config_RawLabor!$G40)*VLOOKUP($A40,Config!$A$2:$B$5,2,0),2)","v":120.06},{"$f":"ROUND(((Config_RawLabor!E40/Config!$B$7)/Config_RawLabor!$G40)*VLOOKUP($A40,Config!$A$2:$B$5,2,0),2)","v":134.44999999999999},{"$f":"ROUND(((Config_RawLabor!F40/Config!$B$7)/Config_RawLabor!$G40)*VLOOKUP($A40,Config!$A$2:$B$5,2,0),2)","v":146.82},{"$f":"ROUND(((Config_RawLabor!H40/Config!$B$7)/Config_RawLabor!$K40)*VLOOKUP($A40,Config!$A$2:$B$5,2,0),2)","v":143.44999999999999},{"$f":"ROUND(((Config_RawLabor!I40/Config!$B$7)/Config_RawLabor!$K40)*VLOOKUP($A40,Config!$A$2:$B$5,2,0),2)","v":160.06},{"$f":"ROUND(((Config_RawLabor!J40/Config!$B$7)/Config_RawLabor!$K40)*VLOOKUP($A40,Config!$A$2:$B$5,2,0),2)","v":177.92},{"$f":"ROUND(((Config_RawLabor!L40/Config!$B$7)/Config_RawLabor!$O40)*VLOOKUP($A40,Config!$A$2:$B$5,2,0),2)","v":174.47},{"$f":"ROUND(((Config_RawLabor!M40/Config!$B$7)/Config_RawLabor!$O40)*VLOOKUP($A40,Config!$A$2:$B$5,2,0),2)","v":193.85},{"$f":"ROUND(((Config_RawLabor!N40/Config!$B$7)/Config_RawLabor!$O40)*VLOOKUP($A40,Config!$A$2:$B$5,2,0),2)","v":215.67},{"$f":"ROUND(((Config_RawLabor!P40/Config!$B$7)/Config_RawLabor!$S40)*VLOOKUP($A40,Config!$A$2:$B$5,2,0),2)","v":213.05},{"$f":"ROUND(((Config_RawLabor!Q40/Config!$B$7)/Config_RawLabor!$S40)*VLOOKUP($A40,Config!$A$2:$B$5,2,0),2)","v":236.41},{"$f":"ROUND(((Config_RawLabor!R40/Config!$B$7)/Config_RawLabor!$S40)*VLOOKUP($A40,Config!$A$2:$B$5,2,0),2)","v":258.56},{"$f":"ROUND(((Config_RawLabor!T40/Config!$B$7)/Config_RawLabor!$W40)*VLOOKUP($A40,Config!$A$2:$B$5,2,0),2)","v":242.68},{"$f":"ROUND(((Config_RawLabor!U40/Config!$B$7)/Config_RawLabor!$W40)*VLOOKUP($A40,Config!$A$2:$B$5,2,0),2)","v":267.99},{"$f":"ROUND(((Config_RawLabor!V40/Config!$B$7)/Config_RawLabor!$W40)*VLOOKUP($A40,Config!$A$2:$B$5,2,0),2)","v":293.7}]
[{"$f":"Config_RawLabor!A41","v":"Expert"},{"$f":"Config_RawLabor!B41","v":"Health Scientist"},{"$f":"Config_RawLabor!C41","v":"Reviews the potential impact of policies and planned projects on community health.  "},{"$f":"ROUND(((Config_RawLabor!D41/Config!$B$7)/Config_RawLabor!$G41)*VLOOKUP($A41,Config!$A$2:$B$5,2,0),2)","v":149.13999999999999},{"$f":"ROUND(((Config_RawLabor!E41/Config!$B$7)/Config_RawLabor!$G41)*VLOOKUP($A41,Config!$A$2:$B$5,2,0),2)","v":180.08},{"$f":"ROUND(((Config_RawLabor!F41/Config!$B$7)/Config_RawLabor!$G41)*VLOOKUP($A41,Config!$A$2:$B$5,2,0),2)","v":219.97},{"$f":"ROUND(((Config_RawLabor!H41/Config!$B$7)/Config_RawLabor!$K41)*VLOOKUP($A41,Config!$A$2:$B$5,2,0),2)","v":175.77},{"$f":"ROUND(((Config_RawLabor!I41/Config!$B$7)/Config_RawLabor!$K41)*VLOOKUP($A41,Config!$A$2:$B$5,2,0),2)","v":214.51},{"$f":"ROUND(((Config_RawLabor!J41/Config!$B$7)/Config_RawLabor!$K41)*VLOOKUP($A41,Config!$A$2:$B$5,2,0),2)","v":262.75},{"$f":"ROUND(((Config_RawLabor!L41/Config!$B$7)/Config_RawLabor!$O41)*VLOOKUP($A41,Config!$A$2:$B$5,2,0),2)","v":208.85},{"$f":"ROUND(((Config_RawLabor!M41/Config!$B$7)/Config_RawLabor!$O41)*VLOOKUP($A41,Config!$A$2:$B$5,2,0),2)","v":254.25},{"$f":"ROUND(((Config_RawLabor!N41/Config!$B$7)/Config_RawLabor!$O41)*VLOOKUP($A41,Config!$A$2:$B$5,2,0),2)","v":310},{"$f":"ROUND(((Config_RawLabor!P41/Config!$B$7)/Config_RawLabor!$S41)*VLOOKUP($A41,Config!$A$2:$B$5,2,0),2)","v":246.34},{"$f":"ROUND(((Config_RawLabor!Q41/Config!$B$7)/Config_RawLabor!$S41)*VLOOKUP($A41,Config!$A$2:$B$5,2,0),2)","v":299.27},{"$f":"ROUND(((Config_RawLabor!R41/Config!$B$7)/Config_RawLabor!$S41)*VLOOKUP($A41,Config!$A$2:$B$5,2,0),2)","v":362.45},{"$f":"ROUND(((Config_RawLabor!T41/Config!$B$7)/Config_RawLabor!$W41)*VLOOKUP($A41,Config!$A$2:$B$5,2,0),2)","v":278.87},{"$f":"ROUND(((Config_RawLabor!U41/Config!$B$7)/Config_RawLabor!$W41)*VLOOKUP($A41,Config!$A$2:$B$5,2,0),2)","v":339.78},{"$f":"ROUND(((Config_RawLabor!V41/Config!$B$7)/Config_RawLabor!$W41)*VLOOKUP($A41,Config!$A$2:$B$5,2,0),2)","v":410.07}]
[{"$f":"Config_RawLabor!A42","v":"Expert"},{"$f":"Config_RawLabor!B42","v":"Hydrologist"},{"$f":"Config_RawLabor!C42","v":"Measure the properties of bodies of water, such as volume and stream flow\nCollect water and soil samples to test for certain properties, such as the pH or pollution levels. Analyze data on the environmental impacts of pollution, erosion, drought, and other problems. Recommend ways to minimize the negative impacts of erosion, sedimentation, or pollution on the environment. Use computer models to forecast future water supplies, the spread of pollution, floods, and other events.\nEvaluate the feasibility of water-related projects, such as hydroelectric power plants, irrigation systems, and wastewater treatment facilities."},{"$f":"ROUND(((Config_RawLabor!D42/Config!$B$7)/Config_RawLabor!$G42)*VLOOKUP($A42,Config!$A$2:$B$5,2,0),2)","v":108.1},{"$f":"ROUND(((Config_RawLabor!E42/Config!$B$7)/Config_RawLabor!$G42)*VLOOKUP($A42,Config!$A$2:$B$5,2,0),2)","v":121.99},{"$f":"ROUND(((Config_RawLabor!F42/Config!$B$7)/Config_RawLabor!$G42)*VLOOKUP($A42,Config!$A$2:$B$5,2,0),2)","v":137.66},{"$f":"ROUND(((Config_RawLabor!H42/Config!$B$7)/Config_RawLabor!$K42)*VLOOKUP($A42,Config!$A$2:$B$5,2,0),2)","v":138.1},{"$f":"ROUND(((Config_RawLabor!I42/Config!$B$7)/Config_RawLabor!$K42)*VLOOKUP($A42,Config!$A$2:$B$5,2,0),2)","v":152.85},{"$f":"ROUND(((Config_RawLabor!J42/Config!$B$7)/Config_RawLabor!$K42)*VLOOKUP($A42,Config!$A$2:$B$5,2,0),2)","v":170.93},{"$f":"ROUND(((Config_RawLabor!L42/Config!$B$7)/Config_RawLabor!$O42)*VLOOKUP($A42,Config!$A$2:$B$5,2,0),2)","v":159.83000000000001},{"$f":"ROUND(((Config_RawLabor!M42/Config!$B$7)/Config_RawLabor!$O42)*VLOOKUP($A42,Config!$A$2:$B$5,2,0),2)","v":180.95},{"$f":"ROUND(((Config_RawLabor!N42/Config!$B$7)/Config_RawLabor!$O42)*VLOOKUP($A42,Config!$A$2:$B$5,2,0),2)","v":204.7},{"$f":"ROUND(((Config_RawLabor!P42/Config!$B$7)/Config_RawLabor!$S42)*VLOOKUP($A42,Config!$A$2:$B$5,2,0),2)","v":171.17},{"$f":"ROUND(((Config_RawLabor!Q42/Config!$B$7)/Config_RawLabor!$S42)*VLOOKUP($A42,Config!$A$2:$B$5,2,0),2)","v":195.3},{"$f":"ROUND(((Config_RawLabor!R42/Config!$B$7)/Config_RawLabor!$S42)*VLOOKUP($A42,Config!$A$2:$B$5,2,0),2)","v":219.45},{"$f":"ROUND(((Config_RawLabor!T42/Config!$B$7)/Config_RawLabor!$W42)*VLOOKUP($A42,Config!$A$2:$B$5,2,0),2)","v":191.77},{"$f":"ROUND(((Config_RawLabor!U42/Config!$B$7)/Config_RawLabor!$W42)*VLOOKUP($A42,Config!$A$2:$B$5,2,0),2)","v":227.93},{"$f":"ROUND(((Config_RawLabor!V42/Config!$B$7)/Config_RawLabor!$W42)*VLOOKUP($A42,Config!$A$2:$B$5,2,0),2)","v":259.92}]
[{"$f":"Config_RawLabor!A43","v":"Expert"},{"$f":"Config_RawLabor!B43","v":"IT Project Engineer "},{"$f":"Config_RawLabor!C43","v":"Reviews IT engineering projects for compliance with industry best practices. Performs engineering design evaluations and reviews project budget and schedule. Reviews information system policies and controls to ensure data accuracy, security, and regulatory compliance. Reviews reports of computer and peripheral equipment production, malfunction, and maintenance to determine problems."},{"$f":"ROUND(((Config_RawLabor!D43/Config!$B$7)/Config_RawLabor!$G43)*VLOOKUP($A43,Config!$A$2:$B$5,2,0),2)","v":151.22999999999999},{"$f":"ROUND(((Config_RawLabor!E43/Config!$B$7)/Config_RawLabor!$G43)*VLOOKUP($A43,Config!$A$2:$B$5,2,0),2)","v":168.74},{"$f":"ROUND(((Config_RawLabor!F43/Config!$B$7)/Config_RawLabor!$G43)*VLOOKUP($A43,Config!$A$2:$B$5,2,0),2)","v":193.95},{"$f":"ROUND(((Config_RawLabor!H43/Config!$B$7)/Config_RawLabor!$K43)*VLOOKUP($A43,Config!$A$2:$B$5,2,0),2)","v":165.01},{"$f":"ROUND(((Config_RawLabor!I43/Config!$B$7)/Config_RawLabor!$K43)*VLOOKUP($A43,Config!$A$2:$B$5,2,0),2)","v":187.58},{"$f":"ROUND(((Config_RawLabor!J43/Config!$B$7)/Config_RawLabor!$K43)*VLOOKUP($A43,Config!$A$2:$B$5,2,0),2)","v":214.88},{"$f":"ROUND(((Config_RawLabor!L43/Config!$B$7)/Config_RawLabor!$O43)*VLOOKUP($A43,Config!$A$2:$B$5,2,0),2)","v":189.58},{"$f":"ROUND(((Config_RawLabor!M43/Config!$B$7)/Config_RawLabor!$O43)*VLOOKUP($A43,Config!$A$2:$B$5,2,0),2)","v":210.71},{"$f":"ROUND(((Config_RawLabor!N43/Config!$B$7)/Config_RawLabor!$O43)*VLOOKUP($A43,Config!$A$2:$B$5,2,0),2)","v":235.68},{"$f":"ROUND(((Config_RawLabor!P43/Config!$B$7)/Config_RawLabor!$S43)*VLOOKUP($A43,Config!$A$2:$B$5,2,0),2)","v":192.01},{"$f":"ROUND(((Config_RawLabor!Q43/Config!$B$7)/Config_RawLabor!$S43)*VLOOKUP($A43,Config!$A$2:$B$5,2,0),2)","v":218.11},{"$f":"ROUND(((Config_RawLabor!R43/Config!$B$7)/Config_RawLabor!$S43)*VLOOKUP($A43,Config!$A$2:$B$5,2,0),2)","v":242.67},{"$f":"ROUND(((Config_RawLabor!T43/Config!$B$7)/Config_RawLabor!$W43)*VLOOKUP($A43,Config!$A$2:$B$5,2,0),2)","v":215.62},{"$f":"ROUND(((Config_RawLabor!U43/Config!$B$7)/Config_RawLabor!$W43)*VLOOKUP($A43,Config!$A$2:$B$5,2,0),2)","v":244.92},{"$f":"ROUND(((Config_RawLabor!V43/Config!$B$7)/Config_RawLabor!$W43)*VLOOKUP($A43,Config!$A$2:$B$5,2,0),2)","v":272.51}]
[{"$f":"Config_RawLabor!A44","v":"Expert"},{"$f":"Config_RawLabor!B44","v":"Mechanical Engineer "},{"$f":"Config_RawLabor!C44","v":"Reviews all aspects of mechanical components, equipment, and machinery design, installation, and testing. Applies knowledge of engineering principles to review products such as engines, instruments, controls, robots, machines, etc. Reviews product testing, models and prototypes. May review fabrication, operation, application, installation, and/or repair of mechanical products."},{"$f":"ROUND(((Config_RawLabor!D44/Config!$B$7)/Config_RawLabor!$G44)*VLOOKUP($A44,Config!$A$2:$B$5,2,0),2)","v":121.06},{"$f":"ROUND(((Config_RawLabor!E44/Config!$B$7)/Config_RawLabor!$G44)*VLOOKUP($A44,Config!$A$2:$B$5,2,0),2)","v":130.25},{"$f":"ROUND(((Config_RawLabor!F44/Config!$B$7)/Config_RawLabor!$G44)*VLOOKUP($A44,Config!$A$2:$B$5,2,0),2)","v":141.18},{"$f":"ROUND(((Config_RawLabor!H44/Config!$B$7)/Config_RawLabor!$K44)*VLOOKUP($A44,Config!$A$2:$B$5,2,0),2)","v":145.04},{"$f":"ROUND(((Config_RawLabor!I44/Config!$B$7)/Config_RawLabor!$K44)*VLOOKUP($A44,Config!$A$2:$B$5,2,0),2)","v":157.63999999999999},{"$f":"ROUND(((Config_RawLabor!J44/Config!$B$7)/Config_RawLabor!$K44)*VLOOKUP($A44,Config!$A$2:$B$5,2,0),2)","v":173.86},{"$f":"ROUND(((Config_RawLabor!L44/Config!$B$7)/Config_RawLabor!$O44)*VLOOKUP($A44,Config!$A$2:$B$5,2,0),2)","v":173.23},{"$f":"ROUND(((Config_RawLabor!M44/Config!$B$7)/Config_RawLabor!$O44)*VLOOKUP($A44,Config!$A$2:$B$5,2,0),2)","v":188.59},{"$f":"ROUND(((Config_RawLabor!N44/Config!$B$7)/Config_RawLabor!$O44)*VLOOKUP($A44,Config!$A$2:$B$5,2,0),2)","v":206.26},{"$f":"ROUND(((Config_RawLabor!P44/Config!$B$7)/Config_RawLabor!$S44)*VLOOKUP($A44,Config!$A$2:$B$5,2,0),2)","v":205.84},{"$f":"ROUND(((Config_RawLabor!Q44/Config!$B$7)/Config_RawLabor!$S44)*VLOOKUP($A44,Config!$A$2:$B$5,2,0),2)","v":225.51},{"$f":"ROUND(((Config_RawLabor!R44/Config!$B$7)/Config_RawLabor!$S44)*VLOOKUP($A44,Config!$A$2:$B$5,2,0),2)","v":248.24},{"$f":"ROUND(((Config_RawLabor!T44/Config!$B$7)/Config_RawLabor!$W44)*VLOOKUP($A44,Config!$A$2:$B$5,2,0),2)","v":236.76},{"$f":"ROUND(((Config_RawLabor!U44/Config!$B$7)/Config_RawLabor!$W44)*VLOOKUP($A44,Config!$A$2:$B$5,2,0),2)","v":259.12},{"$f":"ROUND(((Config_RawLabor!V44/Config!$B$7)/Config_RawLabor!$W44)*VLOOKUP($A44,Config!$A$2:$B$5,2,0),2)","v":281.47000000000003}]
[{"$f":"Config_RawLabor!A45","v":"Expert"},{"$f":"Config_RawLabor!B45","v":"Network Engineer "},{"$f":"Config_RawLabor!C45","v":"Evaluates network systems and communications. May review issues such as network traffic, potential security risk, etc. Reviews network architecture design and optimization. Must have extensive knowledge of Internet, computer, routers, switches, firewall, etc. "},{"$f":"ROUND(((Config_RawLabor!D45/Config!$B$7)/Config_RawLabor!$G45)*VLOOKUP($A45,Config!$A$2:$B$5,2,0),2)","v":116.15},{"$f":"ROUND(((Config_RawLabor!E45/Config!$B$7)/Config_RawLabor!$G45)*VLOOKUP($A45,Config!$A$2:$B$5,2,0),2)","v":130.52000000000001},{"$f":"ROUND(((Config_RawLabor!F45/Config!$B$7)/Config_RawLabor!$G45)*VLOOKUP($A45,Config!$A$2:$B$5,2,0),2)","v":150.93},{"$f":"ROUND(((Config_RawLabor!H45/Config!$B$7)/Config_RawLabor!$K45)*VLOOKUP($A45,Config!$A$2:$B$5,2,0),2)","v":141.78},{"$f":"ROUND(((Config_RawLabor!I45/Config!$B$7)/Config_RawLabor!$K45)*VLOOKUP($A45,Config!$A$2:$B$5,2,0),2)","v":159.99},{"$f":"ROUND(((Config_RawLabor!J45/Config!$B$7)/Config_RawLabor!$K45)*VLOOKUP($A45,Config!$A$2:$B$5,2,0),2)","v":181.5},{"$f":"ROUND(((Config_RawLabor!L45/Config!$B$7)/Config_RawLabor!$O45)*VLOOKUP($A45,Config!$A$2:$B$5,2,0),2)","v":168.18},{"$f":"ROUND(((Config_RawLabor!M45/Config!$B$7)/Config_RawLabor!$O45)*VLOOKUP($A45,Config!$A$2:$B$5,2,0),2)","v":187.26},{"$f":"ROUND(((Config_RawLabor!N45/Config!$B$7)/Config_RawLabor!$O45)*VLOOKUP($A45,Config!$A$2:$B$5,2,0),2)","v":207.16},{"$f":"ROUND(((Config_RawLabor!P45/Config!$B$7)/Config_RawLabor!$S45)*VLOOKUP($A45,Config!$A$2:$B$5,2,0),2)","v":205.86},{"$f":"ROUND(((Config_RawLabor!Q45/Config!$B$7)/Config_RawLabor!$S45)*VLOOKUP($A45,Config!$A$2:$B$5,2,0),2)","v":228.07},{"$f":"ROUND(((Config_RawLabor!R45/Config!$B$7)/Config_RawLabor!$S45)*VLOOKUP($A45,Config!$A$2:$B$5,2,0),2)","v":253.6},{"$f":"ROUND(((Config_RawLabor!T45/Config!$B$7)/Config_RawLabor!$W45)*VLOOKUP($A45,Config!$A$2:$B$5,2,0),2)","v":219.32},{"$f":"ROUND(((Config_RawLabor!U45/Config!$B$7)/Config_RawLabor!$W45)*VLOOKUP($A45,Config!$A$2:$B$5,2,0),2)","v":240.56},{"$f":"ROUND(((Config_RawLabor!V45/Config!$B$7)/Config_RawLabor!$W45)*VLOOKUP($A45,Config!$A$2:$B$5,2,0),2)","v":265.83}]
[{"$f":"Config_RawLabor!A46","v":"Expert"},{"$f":"Config_RawLabor!B46","v":"Nuclear Engineer "},{"$f":"Config_RawLabor!C46","v":"Reviews processes related to nuclear energy and radiation. Familiar with problems of nuclear energy systems. Reviews design of nuclear equipment. Reviews testing, operation, and maintenance of nuclear reactors. "},{"$f":"ROUND(((Config_RawLabor!D46/Config!$B$7)/Config_RawLabor!$G46)*VLOOKUP($A46,Config!$A$2:$B$5,2,0),2)","v":136.43},{"$f":"ROUND(((Config_RawLabor!E46/Config!$B$7)/Config_RawLabor!$G46)*VLOOKUP($A46,Config!$A$2:$B$5,2,0),2)","v":145},{"$f":"ROUND(((Config_RawLabor!F46/Config!$B$7)/Config_RawLabor!$G46)*VLOOKUP($A46,Config!$A$2:$B$5,2,0),2)","v":167.1},{"$f":"ROUND(((Config_RawLabor!H46/Config!$B$7)/Config_RawLabor!$K46)*VLOOKUP($A46,Config!$A$2:$B$5,2,0),2)","v":158.21},{"$f":"ROUND(((Config_RawLabor!I46/Config!$B$7)/Config_RawLabor!$K46)*VLOOKUP($A46,Config!$A$2:$B$5,2,0),2)","v":179.47},{"$f":"ROUND(((Config_RawLabor!J46/Config!$B$7)/Config_RawLabor!$K46)*VLOOKUP($A46,Config!$A$2:$B$5,2,0),2)","v":196.69},{"$f":"ROUND(((Config_RawLabor!L46/Config!$B$7)/Config_RawLabor!$O46)*VLOOKUP($A46,Config!$A$2:$B$5,2,0),2)","v":182.69},{"$f":"ROUND(((Config_RawLabor!M46/Config!$B$7)/Config_RawLabor!$O46)*VLOOKUP($A46,Config!$A$2:$B$5,2,0),2)","v":206.11},{"$f":"ROUND(((Config_RawLabor!N46/Config!$B$7)/Config_RawLabor!$O46)*VLOOKUP($A46,Config!$A$2:$B$5,2,0),2)","v":227.92},{"$f":"ROUND(((Config_RawLabor!P46/Config!$B$7)/Config_RawLabor!$S46)*VLOOKUP($A46,Config!$A$2:$B$5,2,0),2)","v":201.66},{"$f":"ROUND(((Config_RawLabor!Q46/Config!$B$7)/Config_RawLabor!$S46)*VLOOKUP($A46,Config!$A$2:$B$5,2,0),2)","v":218.23},{"$f":"ROUND(((Config_RawLabor!R46/Config!$B$7)/Config_RawLabor!$S46)*VLOOKUP($A46,Config!$A$2:$B$5,2,0),2)","v":242.08},{"$f":"ROUND(((Config_RawLabor!T46/Config!$B$7)/Config_RawLabor!$W46)*VLOOKUP($A46,Config!$A$2:$B$5,2,0),2)","v":222.09},{"$f":"ROUND(((Config_RawLabor!U46/Config!$B$7)/Config_RawLabor!$W46)*VLOOKUP($A46,Config!$A$2:$B$5,2,0),2)","v":248.4},{"$f":"ROUND(((Config_RawLabor!V46/Config!$B$7)/Config_RawLabor!$W46)*VLOOKUP($A46,Config!$A$2:$B$5,2,0),2)","v":275.89999999999998}]
[{"$f":"Config_RawLabor!A47","v":"Expert"},{"$f":"Config_RawLabor!B47","v":"Physicist"},{"$f":"Config_RawLabor!C47","v":"Provide reports regarding experimental physicists, force analysis, health physics, and high-energy physics. Provide expert witness testimony on issues regarding nuclear physics, optics, particle physics, quantum computing, quantum physics, radiation exposure, the science of matter and energy, shock physics, stress on materials, superconductivity, thermal exposure, and thermodynamics, as well as related topics."},{"$f":"ROUND(((Config_RawLabor!D47/Config!$B$7)/Config_RawLabor!$G47)*VLOOKUP($A47,Config!$A$2:$B$5,2,0),2)","v":143.37},{"$f":"ROUND(((Config_RawLabor!E47/Config!$B$7)/Config_RawLabor!$G47)*VLOOKUP($A47,Config!$A$2:$B$5,2,0),2)","v":155.58000000000001},{"$f":"ROUND(((Config_RawLabor!F47/Config!$B$7)/Config_RawLabor!$G47)*VLOOKUP($A47,Config!$A$2:$B$5,2,0),2)","v":203.79},{"$f":"ROUND(((Config_RawLabor!H47/Config!$B$7)/Config_RawLabor!$K47)*VLOOKUP($A47,Config!$A$2:$B$5,2,0),2)","v":167.19},{"$f":"ROUND(((Config_RawLabor!I47/Config!$B$7)/Config_RawLabor!$K47)*VLOOKUP($A47,Config!$A$2:$B$5,2,0),2)","v":197.84},{"$f":"ROUND(((Config_RawLabor!J47/Config!$B$7)/Config_RawLabor!$K47)*VLOOKUP($A47,Config!$A$2:$B$5,2,0),2)","v":259.31},{"$f":"ROUND(((Config_RawLabor!L47/Config!$B$7)/Config_RawLabor!$O47)*VLOOKUP($A47,Config!$A$2:$B$5,2,0),2)","v":190.83},{"$f":"ROUND(((Config_RawLabor!M47/Config!$B$7)/Config_RawLabor!$O47)*VLOOKUP($A47,Config!$A$2:$B$5,2,0),2)","v":223.95},{"$f":"ROUND(((Config_RawLabor!N47/Config!$B$7)/Config_RawLabor!$O47)*VLOOKUP($A47,Config!$A$2:$B$5,2,0),2)","v":279.58999999999997},{"$f":"ROUND(((Config_RawLabor!P47/Config!$B$7)/Config_RawLabor!$S47)*VLOOKUP($A47,Config!$A$2:$B$5,2,0),2)","v":235.52},{"$f":"ROUND(((Config_RawLabor!Q47/Config!$B$7)/Config_RawLabor!$S47)*VLOOKUP($A47,Config!$A$2:$B$5,2,0),2)","v":275.74},{"$f":"ROUND(((Config_RawLabor!R47/Config!$B$7)/Config_RawLabor!$S47)*VLOOKUP($A47,Config!$A$2:$B$5,2,0),2)","v":329.64},{"$f":"ROUND(((Config_RawLabor!T47/Config!$B$7)/Config_RawLabor!$W47)*VLOOKUP($A47,Config!$A$2:$B$5,2,0),2)","v":272.23},{"$f":"ROUND(((Config_RawLabor!U47/Config!$B$7)/Config_RawLabor!$W47)*VLOOKUP($A47,Config!$A$2:$B$5,2,0),2)","v":298.3},{"$f":"ROUND(((Config_RawLabor!V47/Config!$B$7)/Config_RawLabor!$W47)*VLOOKUP($A47,Config!$A$2:$B$5,2,0),2)","v":358.31}]
[{"$f":"Config_RawLabor!A48","v":"Expert"},{"$f":"Config_RawLabor!B48","v":"Process Engineer "},{"$f":"Config_RawLabor!C48","v":"Reviews continuous production and manufacturing processes with respect to output, quality, and cost. Reviews production data and applies standard scientific and statistical methods to analyze, document, and diagram production processes. Identifies process bottlenecks and recommended solutions to resolve. Recommends changes or upgrades to equipment, work methods, or other aspects of the process to improve efficiency and utilization of resources including labor, energy and raw materials."},{"$f":"ROUND(((Config_RawLabor!D48/Config!$B$7)/Config_RawLabor!$G48)*VLOOKUP($A48,Config!$A$2:$B$5,2,0),2)","v":120.47},{"$f":"ROUND(((Config_RawLabor!E48/Config!$B$7)/Config_RawLabor!$G48)*VLOOKUP($A48,Config!$A$2:$B$5,2,0),2)","v":129.74},{"$f":"ROUND(((Config_RawLabor!F48/Config!$B$7)/Config_RawLabor!$G48)*VLOOKUP($A48,Config!$A$2:$B$5,2,0),2)","v":141.27000000000001},{"$f":"ROUND(((Config_RawLabor!H48/Config!$B$7)/Config_RawLabor!$K48)*VLOOKUP($A48,Config!$A$2:$B$5,2,0),2)","v":142.32},{"$f":"ROUND(((Config_RawLabor!I48/Config!$B$7)/Config_RawLabor!$K48)*VLOOKUP($A48,Config!$A$2:$B$5,2,0),2)","v":154.62},{"$f":"ROUND(((Config_RawLabor!J48/Config!$B$7)/Config_RawLabor!$K48)*VLOOKUP($A48,Config!$A$2:$B$5,2,0),2)","v":166.04},{"$f":"ROUND(((Config_RawLabor!L48/Config!$B$7)/Config_RawLabor!$O48)*VLOOKUP($A48,Config!$A$2:$B$5,2,0),2)","v":167.7},{"$f":"ROUND(((Config_RawLabor!M48/Config!$B$7)/Config_RawLabor!$O48)*VLOOKUP($A48,Config!$A$2:$B$5,2,0),2)","v":182.75},{"$f":"ROUND(((Config_RawLabor!N48/Config!$B$7)/Config_RawLabor!$O48)*VLOOKUP($A48,Config!$A$2:$B$5,2,0),2)","v":196.37},{"$f":"ROUND(((Config_RawLabor!P48/Config!$B$7)/Config_RawLabor!$S48)*VLOOKUP($A48,Config!$A$2:$B$5,2,0),2)","v":199.67},{"$f":"ROUND(((Config_RawLabor!Q48/Config!$B$7)/Config_RawLabor!$S48)*VLOOKUP($A48,Config!$A$2:$B$5,2,0),2)","v":217.41},{"$f":"ROUND(((Config_RawLabor!R48/Config!$B$7)/Config_RawLabor!$S48)*VLOOKUP($A48,Config!$A$2:$B$5,2,0),2)","v":236.75},{"$f":"ROUND(((Config_RawLabor!T48/Config!$B$7)/Config_RawLabor!$W48)*VLOOKUP($A48,Config!$A$2:$B$5,2,0),2)","v":224.92},{"$f":"ROUND(((Config_RawLabor!U48/Config!$B$7)/Config_RawLabor!$W48)*VLOOKUP($A48,Config!$A$2:$B$5,2,0),2)","v":244.91},{"$f":"ROUND(((Config_RawLabor!V48/Config!$B$7)/Config_RawLabor!$W48)*VLOOKUP($A48,Config!$A$2:$B$5,2,0),2)","v":266.69}]
[{"$f":"Config_RawLabor!A49","v":"Expert"},{"$f":"Config_RawLabor!B49","v":"Professor - Law"},{"$f":"Config_RawLabor!C49","v":"Current or former law professor with knowledge of CPUC regulatory proceedings."},{"$f":"ROUND(((Config_RawLabor!D49/Config!$B$7)/Config_RawLabor!$G49)*VLOOKUP($A49,Config!$A$2:$B$5,2,0),2)","v":173.1},{"$f":"ROUND(((Config_RawLabor!E49/Config!$B$7)/Config_RawLabor!$G49)*VLOOKUP($A49,Config!$A$2:$B$5,2,0),2)","v":236.62},{"$f":"ROUND(((Config_RawLabor!F49/Config!$B$7)/Config_RawLabor!$G49)*VLOOKUP($A49,Config!$A$2:$B$5,2,0),2)","v":308.35000000000002},{"$f":"ROUND(((Config_RawLabor!H49/Config!$B$7)/Config_RawLabor!$K49)*VLOOKUP($A49,Config!$A$2:$B$5,2,0),2)","v":189.86},{"$f":"ROUND(((Config_RawLabor!I49/Config!$B$7)/Config_RawLabor!$K49)*VLOOKUP($A49,Config!$A$2:$B$5,2,0),2)","v":260.51},{"$f":"ROUND(((Config_RawLabor!J49/Config!$B$7)/Config_RawLabor!$K49)*VLOOKUP($A49,Config!$A$2:$B$5,2,0),2)","v":341.03},{"$f":"ROUND(((Config_RawLabor!L49/Config!$B$7)/Config_RawLabor!$O49)*VLOOKUP($A49,Config!$A$2:$B$5,2,0),2)","v":206.37},{"$f":"ROUND(((Config_RawLabor!M49/Config!$B$7)/Config_RawLabor!$O49)*VLOOKUP($A49,Config!$A$2:$B$5,2,0),2)","v":284.05},{"$f":"ROUND(((Config_RawLabor!N49/Config!$B$7)/Config_RawLabor!$O49)*VLOOKUP($A49,Config!$A$2:$B$5,2,0),2)","v":373.23},{"$f":"ROUND(((Config_RawLabor!P49/Config!$B$7)/Config_RawLabor!$S49)*VLOOKUP($A49,Config!$A$2:$B$5,2,0),2)","v":234.48},{"$f":"ROUND(((Config_RawLabor!Q49/Config!$B$7)/Config_RawLabor!$S49)*VLOOKUP($A49,Config!$A$2:$B$5,2,0),2)","v":329.64},{"$f":"ROUND(((Config_RawLabor!R49/Config!$B$7)/Config_RawLabor!$S49)*VLOOKUP($A49,Config!$A$2:$B$5,2,0),2)","v":445.79},{"$f":"ROUND(((Config_RawLabor!T49/Config!$B$7)/Config_RawLabor!$W49)*VLOOKUP($A49,Config!$A$2:$B$5,2,0),2)","v":262.10000000000002},{"$f":"ROUND(((Config_RawLabor!U49/Config!$B$7)/Config_RawLabor!$W49)*VLOOKUP($A49,Config!$A$2:$B$5,2,0),2)","v":374.45},{"$f":"ROUND(((Config_RawLabor!V49/Config!$B$7)/Config_RawLabor!$W49)*VLOOKUP($A49,Config!$A$2:$B$5,2,0),2)","v":517.11}]
[{"$f":"Config_RawLabor!A50","v":"Expert"},{"$f":"Config_RawLabor!B50","v":"Program Design/Evaluation Specialist"},{"$f":"Config_RawLabor!C50","v":"Designs marketing strategies and programs for a utility product or product line. Evaluates utility product performance, and recommends changes to current products based on market research and new trends. "},{"$f":"ROUND(((Config_RawLabor!D50/Config!$B$7)/Config_RawLabor!$G50)*VLOOKUP($A50,Config!$A$2:$B$5,2,0),2)","v":110.45},{"$f":"ROUND(((Config_RawLabor!E50/Config!$B$7)/Config_RawLabor!$G50)*VLOOKUP($A50,Config!$A$2:$B$5,2,0),2)","v":126.19},{"$f":"ROUND(((Config_RawLabor!F50/Config!$B$7)/Config_RawLabor!$G50)*VLOOKUP($A50,Config!$A$2:$B$5,2,0),2)","v":144.55000000000001},{"$f":"ROUND(((Config_RawLabor!H50/Config!$B$7)/Config_RawLabor!$K50)*VLOOKUP($A50,Config!$A$2:$B$5,2,0),2)","v":126.62},{"$f":"ROUND(((Config_RawLabor!I50/Config!$B$7)/Config_RawLabor!$K50)*VLOOKUP($A50,Config!$A$2:$B$5,2,0),2)","v":146.82},{"$f":"ROUND(((Config_RawLabor!J50/Config!$B$7)/Config_RawLabor!$K50)*VLOOKUP($A50,Config!$A$2:$B$5,2,0),2)","v":171.92},{"$f":"ROUND(((Config_RawLabor!L50/Config!$B$7)/Config_RawLabor!$O50)*VLOOKUP($A50,Config!$A$2:$B$5,2,0),2)","v":156.04},{"$f":"ROUND(((Config_RawLabor!M50/Config!$B$7)/Config_RawLabor!$O50)*VLOOKUP($A50,Config!$A$2:$B$5,2,0),2)","v":177.89},{"$f":"ROUND(((Config_RawLabor!N50/Config!$B$7)/Config_RawLabor!$O50)*VLOOKUP($A50,Config!$A$2:$B$5,2,0),2)","v":202.23},{"$f":"ROUND(((Config_RawLabor!P50/Config!$B$7)/Config_RawLabor!$S50)*VLOOKUP($A50,Config!$A$2:$B$5,2,0),2)","v":197.8},{"$f":"ROUND(((Config_RawLabor!Q50/Config!$B$7)/Config_RawLabor!$S50)*VLOOKUP($A50,Config!$A$2:$B$5,2,0),2)","v":224.39},{"$f":"ROUND(((Config_RawLabor!R50/Config!$B$7)/Config_RawLabor!$S50)*VLOOKUP($A50,Config!$A$2:$B$5,2,0),2)","v":255.78},{"$f":"ROUND(((Config_RawLabor!T50/Config!$B$7)/Config_RawLabor!$W50)*VLOOKUP($A50,Config!$A$2:$B$5,2,0),2)","v":203.09},{"$f":"ROUND(((Config_RawLabor!U50/Config!$B$7)/Config_RawLabor!$W50)*VLOOKUP($A50,Config!$A$2:$B$5,2,0),2)","v":235.81},{"$f":"ROUND(((Config_RawLabor!V50/Config!$B$7)/Config_RawLabor!$W50)*VLOOKUP($A50,Config!$A$2:$B$5,2,0),2)","v":260.02999999999997}]
[{"$f":"Config_RawLabor!A51","v":"Expert"},{"$f":"Config_RawLabor!B51","v":"Project Engineer "},{"$f":"Config_RawLabor!C51","v":"Reviews engineering designs and implementation plans for reasonableness. Reviews industry policies and procedures to ensure data accuracy, security, and regulatory compliance. Reviews reports of production, malfunction, and maintenance to determine or address problems. Provides recommendations regarding engineering process. Coordinates with other engineering experts and coordinates their specialized contributions to the proceeding. Reviews and opins on operational plans for completing the project. Reviews progress and performance against the project plan and recommends actions to resolve operational problems and minimize delays. Develops alternate or comparative project schedules, budgets, and forecasts. "},{"$f":"ROUND(((Config_RawLabor!D51/Config!$B$7)/Config_RawLabor!$G51)*VLOOKUP($A51,Config!$A$2:$B$5,2,0),2)","v":127.97},{"$f":"ROUND(((Config_RawLabor!E51/Config!$B$7)/Config_RawLabor!$G51)*VLOOKUP($A51,Config!$A$2:$B$5,2,0),2)","v":138.69},{"$f":"ROUND(((Config_RawLabor!F51/Config!$B$7)/Config_RawLabor!$G51)*VLOOKUP($A51,Config!$A$2:$B$5,2,0),2)","v":157.44},{"$f":"ROUND(((Config_RawLabor!H51/Config!$B$7)/Config_RawLabor!$K51)*VLOOKUP($A51,Config!$A$2:$B$5,2,0),2)","v":150.69},{"$f":"ROUND(((Config_RawLabor!I51/Config!$B$7)/Config_RawLabor!$K51)*VLOOKUP($A51,Config!$A$2:$B$5,2,0),2)","v":166.42},{"$f":"ROUND(((Config_RawLabor!J51/Config!$B$7)/Config_RawLabor!$K51)*VLOOKUP($A51,Config!$A$2:$B$5,2,0),2)","v":186.74},{"$f":"ROUND(((Config_RawLabor!L51/Config!$B$7)/Config_RawLabor!$O51)*VLOOKUP($A51,Config!$A$2:$B$5,2,0),2)","v":177.14},{"$f":"ROUND(((Config_RawLabor!M51/Config!$B$7)/Config_RawLabor!$O51)*VLOOKUP($A51,Config!$A$2:$B$5,2,0),2)","v":196.03},{"$f":"ROUND(((Config_RawLabor!N51/Config!$B$7)/Config_RawLabor!$O51)*VLOOKUP($A51,Config!$A$2:$B$5,2,0),2)","v":219.57},{"$f":"ROUND(((Config_RawLabor!P51/Config!$B$7)/Config_RawLabor!$S51)*VLOOKUP($A51,Config!$A$2:$B$5,2,0),2)","v":209.32},{"$f":"ROUND(((Config_RawLabor!Q51/Config!$B$7)/Config_RawLabor!$S51)*VLOOKUP($A51,Config!$A$2:$B$5,2,0),2)","v":232.18},{"$f":"ROUND(((Config_RawLabor!R51/Config!$B$7)/Config_RawLabor!$S51)*VLOOKUP($A51,Config!$A$2:$B$5,2,0),2)","v":260.48},{"$f":"ROUND(((Config_RawLabor!T51/Config!$B$7)/Config_RawLabor!$W51)*VLOOKUP($A51,Config!$A$2:$B$5,2,0),2)","v":228.28},{"$f":"ROUND(((Config_RawLabor!U51/Config!$B$7)/Config_RawLabor!$W51)*VLOOKUP($A51,Config!$A$2:$B$5,2,0),2)","v":253.73},{"$f":"ROUND(((Config_RawLabor!V51/Config!$B$7)/Config_RawLabor!$W51)*VLOOKUP($A51,Config!$A$2:$B$5,2,0),2)","v":286.85000000000002}]
[{"$f":"Config_RawLabor!A52","v":"Expert"},{"$f":"Config_RawLabor!B52","v":"Project Engineer - Construction"},{"$f":"Config_RawLabor!C52","v":"Interviews construction staff. Reviews plans and other technical documents, answers questions regarding the scope and/or scheduling of the project. Develops cost estimates or appropriate schedules. "},{"$f":"ROUND(((Config_RawLabor!D52/Config!$B$7)/Config_RawLabor!$G52)*VLOOKUP($A52,Config!$A$2:$B$5,2,0),2)","v":112.76},{"$f":"ROUND(((Config_RawLabor!E52/Config!$B$7)/Config_RawLabor!$G52)*VLOOKUP($A52,Config!$A$2:$B$5,2,0),2)","v":127.16},{"$f":"ROUND(((Config_RawLabor!F52/Config!$B$7)/Config_RawLabor!$G52)*VLOOKUP($A52,Config!$A$2:$B$5,2,0),2)","v":145.38},{"$f":"ROUND(((Config_RawLabor!H52/Config!$B$7)/Config_RawLabor!$K52)*VLOOKUP($A52,Config!$A$2:$B$5,2,0),2)","v":112.76},{"$f":"ROUND(((Config_RawLabor!I52/Config!$B$7)/Config_RawLabor!$K52)*VLOOKUP($A52,Config!$A$2:$B$5,2,0),2)","v":127.16},{"$f":"ROUND(((Config_RawLabor!J52/Config!$B$7)/Config_RawLabor!$K52)*VLOOKUP($A52,Config!$A$2:$B$5,2,0),2)","v":145.38},{"$f":"ROUND(((Config_RawLabor!L52/Config!$B$7)/Config_RawLabor!$O52)*VLOOKUP($A52,Config!$A$2:$B$5,2,0),2)","v":112.76},{"$f":"ROUND(((Config_RawLabor!M52/Config!$B$7)/Config_RawLabor!$O52)*VLOOKUP($A52,Config!$A$2:$B$5,2,0),2)","v":127.16},{"$f":"ROUND(((Config_RawLabor!N52/Config!$B$7)/Config_RawLabor!$O52)*VLOOKUP($A52,Config!$A$2:$B$5,2,0),2)","v":145.38},{"$f":"ROUND(((Config_RawLabor!P52/Config!$B$7)/Config_RawLabor!$S52)*VLOOKUP($A52,Config!$A$2:$B$5,2,0),2)","v":112.76},{"$f":"ROUND(((Config_RawLabor!Q52/Config!$B$7)/Config_RawLabor!$S52)*VLOOKUP($A52,Config!$A$2:$B$5,2,0),2)","v":127.16},{"$f":"ROUND(((Config_RawLabor!R52/Config!$B$7)/Config_RawLabor!$S52)*VLOOKUP($A52,Config!$A$2:$B$5,2,0),2)","v":145.38},{"$f":"ROUND(((Config_RawLabor!T52/Config!$B$7)/Config_RawLabor!$W52)*VLOOKUP($A52,Config!$A$2:$B$5,2,0),2)","v":112.76},{"$f":"ROUND(((Config_RawLabor!U52/Config!$B$7)/Config_RawLabor!$W52)*VLOOKUP($A52,Config!$A$2:$B$5,2,0),2)","v":127.16},{"$f":"ROUND(((Config_RawLabor!V52/Config!$B$7)/Config_RawLabor!$W52)*VLOOKUP($A52,Config!$A$2:$B$5,2,0),2)","v":145.38}]
[{"$f":"Config_RawLabor!A53","v":"Expert"},{"$f":"Config_RawLabor!B53","v":"Public Policy Analyst"},{"$f":"Config_RawLabor!C53","v":"Reviews the impact of state government policies and regulations. Analyzes proposed legislative actions and determines the potential impact. Reviews policies, plans, and programs to ensure consistency with corresponding government regulations and laws."},{"$f":"ROUND(((Config_RawLabor!D53/Config!$B$7)/Config_RawLabor!$G53)*VLOOKUP($A53,Config!$A$2:$B$5,2,0),2)","v":169.61},{"$f":"ROUND(((Config_RawLabor!E53/Config!$B$7)/Config_RawLabor!$G53)*VLOOKUP($A53,Config!$A$2:$B$5,2,0),2)","v":201.08},{"$f":"ROUND(((Config_RawLabor!F53/Config!$B$7)/Config_RawLabor!$G53)*VLOOKUP($A53,Config!$A$2:$B$5,2,0),2)","v":234.98},{"$f":"ROUND(((Config_RawLabor!H53/Config!$B$7)/Config_RawLabor!$K53)*VLOOKUP($A53,Config!$A$2:$B$5,2,0),2)","v":189.5},{"$f":"ROUND(((Config_RawLabor!I53/Config!$B$7)/Config_RawLabor!$K53)*VLOOKUP($A53,Config!$A$2:$B$5,2,0),2)","v":222.98},{"$f":"ROUND(((Config_RawLabor!J53/Config!$B$7)/Config_RawLabor!$K53)*VLOOKUP($A53,Config!$A$2:$B$5,2,0),2)","v":261.20999999999998},{"$f":"ROUND(((Config_RawLabor!L53/Config!$B$7)/Config_RawLabor!$O53)*VLOOKUP($A53,Config!$A$2:$B$5,2,0),2)","v":265.37},{"$f":"ROUND(((Config_RawLabor!M53/Config!$B$7)/Config_RawLabor!$O53)*VLOOKUP($A53,Config!$A$2:$B$5,2,0),2)","v":314.82},{"$f":"ROUND(((Config_RawLabor!N53/Config!$B$7)/Config_RawLabor!$O53)*VLOOKUP($A53,Config!$A$2:$B$5,2,0),2)","v":368.13},{"$f":"ROUND(((Config_RawLabor!P53/Config!$B$7)/Config_RawLabor!$S53)*VLOOKUP($A53,Config!$A$2:$B$5,2,0),2)","v":300.82},{"$f":"ROUND(((Config_RawLabor!Q53/Config!$B$7)/Config_RawLabor!$S53)*VLOOKUP($A53,Config!$A$2:$B$5,2,0),2)","v":355.56},{"$f":"ROUND(((Config_RawLabor!R53/Config!$B$7)/Config_RawLabor!$S53)*VLOOKUP($A53,Config!$A$2:$B$5,2,0),2)","v":415.95},{"$f":"ROUND(((Config_RawLabor!T53/Config!$B$7)/Config_RawLabor!$W53)*VLOOKUP($A53,Config!$A$2:$B$5,2,0),2)","v":540.67999999999995},{"$f":"ROUND(((Config_RawLabor!U53/Config!$B$7)/Config_RawLabor!$W53)*VLOOKUP($A53,Config!$A$2:$B$5,2,0),2)","v":620.13},{"$f":"ROUND(((Config_RawLabor!V53/Config!$B$7)/Config_RawLabor!$W53)*VLOOKUP($A53,Config!$A$2:$B$5,2,0),2)","v":729.04}]
[{"$f":"Config_RawLabor!A54","v":"Expert"},{"$f":"Config_RawLabor!B54","v":"Regulatory Affairs Specialist"},{"$f":"Config_RawLabor!C54","v":"Familiar with regulatory forms, policies, and procedures and capable of reviewing regulatory compliance. "},{"$f":"ROUND(((Config_RawLabor!D54/Config!$B$7)/Config_RawLabor!$G54)*VLOOKUP($A54,Config!$A$2:$B$5,2,0),2)","v":132.12},{"$f":"ROUND(((Config_RawLabor!E54/Config!$B$7)/Config_RawLabor!$G54)*VLOOKUP($A54,Config!$A$2:$B$5,2,0),2)","v":151.44999999999999},{"$f":"ROUND(((Config_RawLabor!F54/Config!$B$7)/Config_RawLabor!$G54)*VLOOKUP($A54,Config!$A$2:$B$5,2,0),2)","v":170.48},{"$f":"ROUND(((Config_RawLabor!H54/Config!$B$7)/Config_RawLabor!$K54)*VLOOKUP($A54,Config!$A$2:$B$5,2,0),2)","v":163.01},{"$f":"ROUND(((Config_RawLabor!I54/Config!$B$7)/Config_RawLabor!$K54)*VLOOKUP($A54,Config!$A$2:$B$5,2,0),2)","v":193.32},{"$f":"ROUND(((Config_RawLabor!J54/Config!$B$7)/Config_RawLabor!$K54)*VLOOKUP($A54,Config!$A$2:$B$5,2,0),2)","v":224.7},{"$f":"ROUND(((Config_RawLabor!L54/Config!$B$7)/Config_RawLabor!$O54)*VLOOKUP($A54,Config!$A$2:$B$5,2,0),2)","v":192},{"$f":"ROUND(((Config_RawLabor!M54/Config!$B$7)/Config_RawLabor!$O54)*VLOOKUP($A54,Config!$A$2:$B$5,2,0),2)","v":215.99},{"$f":"ROUND(((Config_RawLabor!N54/Config!$B$7)/Config_RawLabor!$O54)*VLOOKUP($A54,Config!$A$2:$B$5,2,0),2)","v":248.75},{"$f":"ROUND(((Config_RawLabor!P54/Config!$B$7)/Config_RawLabor!$S54)*VLOOKUP($A54,Config!$A$2:$B$5,2,0),2)","v":247.08},{"$f":"ROUND(((Config_RawLabor!Q54/Config!$B$7)/Config_RawLabor!$S54)*VLOOKUP($A54,Config!$A$2:$B$5,2,0),2)","v":270.04000000000002},{"$f":"ROUND(((Config_RawLabor!R54/Config!$B$7)/Config_RawLabor!$S54)*VLOOKUP($A54,Config!$A$2:$B$5,2,0),2)","v":300.11},{"$f":"ROUND(((Config_RawLabor!T54/Config!$B$7)/Config_RawLabor!$W54)*VLOOKUP($A54,Config!$A$2:$B$5,2,0),2)","v":278.22000000000003},{"$f":"ROUND(((Config_RawLabor!U54/Config!$B$7)/Config_RawLabor!$W54)*VLOOKUP($A54,Config!$A$2:$B$5,2,0),2)","v":304.07},{"$f":"ROUND(((Config_RawLabor!V54/Config!$B$7)/Config_RawLabor!$W54)*VLOOKUP($A54,Config!$A$2:$B$5,2,0),2)","v":337.94}]
[{"$f":"Config_RawLabor!A55","v":"Expert"},{"$f":"Config_RawLabor!B55","v":"Reliability Engineer "},{"$f":"Config_RawLabor!C55","v":"Analyzes the reliability in design, cost, weight, production and consumer satisfaction of company products. Develops the methods and measures of analysis based on customer and contractual obligations. Prepares reports, charts and diagrams to disclose results and highlight areas for further investigation. Performs root cause analysis to determine product design flaws"},{"$f":"ROUND(((Config_RawLabor!D55/Config!$B$7)/Config_RawLabor!$G55)*VLOOKUP($A55,Config!$A$2:$B$5,2,0),2)","v":120.64},{"$f":"ROUND(((Config_RawLabor!E55/Config!$B$7)/Config_RawLabor!$G55)*VLOOKUP($A55,Config!$A$2:$B$5,2,0),2)","v":133.56},{"$f":"ROUND(((Config_RawLabor!F55/Config!$B$7)/Config_RawLabor!$G55)*VLOOKUP($A55,Config!$A$2:$B$5,2,0),2)","v":141.88},{"$f":"ROUND(((Config_RawLabor!H55/Config!$B$7)/Config_RawLabor!$K55)*VLOOKUP($A55,Config!$A$2:$B$5,2,0),2)","v":151.29},{"$f":"ROUND(((Config_RawLabor!I55/Config!$B$7)/Config_RawLabor!$K55)*VLOOKUP($A55,Config!$A$2:$B$5,2,0),2)","v":161.07},{"$f":"ROUND(((Config_RawLabor!J55/Config!$B$7)/Config_RawLabor!$K55)*VLOOKUP($A55,Config!$A$2:$B$5,2,0),2)","v":172.72},{"$f":"ROUND(((Config_RawLabor!L55/Config!$B$7)/Config_RawLabor!$O55)*VLOOKUP($A55,Config!$A$2:$B$5,2,0),2)","v":176.67},{"$f":"ROUND(((Config_RawLabor!M55/Config!$B$7)/Config_RawLabor!$O55)*VLOOKUP($A55,Config!$A$2:$B$5,2,0),2)","v":192.94},{"$f":"ROUND(((Config_RawLabor!N55/Config!$B$7)/Config_RawLabor!$O55)*VLOOKUP($A55,Config!$A$2:$B$5,2,0),2)","v":207},{"$f":"ROUND(((Config_RawLabor!P55/Config!$B$7)/Config_RawLabor!$S55)*VLOOKUP($A55,Config!$A$2:$B$5,2,0),2)","v":221.21},{"$f":"ROUND(((Config_RawLabor!Q55/Config!$B$7)/Config_RawLabor!$S55)*VLOOKUP($A55,Config!$A$2:$B$5,2,0),2)","v":237.79},{"$f":"ROUND(((Config_RawLabor!R55/Config!$B$7)/Config_RawLabor!$S55)*VLOOKUP($A55,Config!$A$2:$B$5,2,0),2)","v":256.49},{"$f":"ROUND(((Config_RawLabor!T55/Config!$B$7)/Config_RawLabor!$W55)*VLOOKUP($A55,Config!$A$2:$B$5,2,0),2)","v":225.64},{"$f":"ROUND(((Config_RawLabor!U55/Config!$B$7)/Config_RawLabor!$W55)*VLOOKUP($A55,Config!$A$2:$B$5,2,0),2)","v":250.46},{"$f":"ROUND(((Config_RawLabor!V55/Config!$B$7)/Config_RawLabor!$W55)*VLOOKUP($A55,Config!$A$2:$B$5,2,0),2)","v":269.45}]
[{"$f":"Config_RawLabor!A56","v":"Expert"},{"$f":"Config_RawLabor!B56","v":"Reservoir Engineer "},{"$f":"Config_RawLabor!C56","v":"Responsible for identifying oil and gas reserves and developing strategies to maximize recovery. Reviews testing results for  new wells and monitors and predicts performance."},{"$f":"ROUND(((Config_RawLabor!D56/Config!$B$7)/Config_RawLabor!$G56)*VLOOKUP($A56,Config!$A$2:$B$5,2,0),2)","v":221.48},{"$f":"ROUND(((Config_RawLabor!E56/Config!$B$7)/Config_RawLabor!$G56)*VLOOKUP($A56,Config!$A$2:$B$5,2,0),2)","v":233.24},{"$f":"ROUND(((Config_RawLabor!F56/Config!$B$7)/Config_RawLabor!$G56)*VLOOKUP($A56,Config!$A$2:$B$5,2,0),2)","v":260.19},{"$f":"ROUND(((Config_RawLabor!H56/Config!$B$7)/Config_RawLabor!$K56)*VLOOKUP($A56,Config!$A$2:$B$5,2,0),2)","v":237.11},{"$f":"ROUND(((Config_RawLabor!I56/Config!$B$7)/Config_RawLabor!$K56)*VLOOKUP($A56,Config!$A$2:$B$5,2,0),2)","v":259.58},{"$f":"ROUND(((Config_RawLabor!J56/Config!$B$7)/Config_RawLabor!$K56)*VLOOKUP($A56,Config!$A$2:$B$5,2,0),2)","v":288.66000000000003},{"$f":"ROUND(((Config_RawLabor!L56/Config!$B$7)/Config_RawLabor!$O56)*VLOOKUP($A56,Config!$A$2:$B$5,2,0),2)","v":277.58999999999997},{"$f":"ROUND(((Config_RawLabor!M56/Config!$B$7)/Config_RawLabor!$O56)*VLOOKUP($A56,Config!$A$2:$B$5,2,0),2)","v":299.68},{"$f":"ROUND(((Config_RawLabor!N56/Config!$B$7)/Config_RawLabor!$O56)*VLOOKUP($A56,Config!$A$2:$B$5,2,0),2)","v":340.26},{"$f":"ROUND(((Config_RawLabor!P56/Config!$B$7)/Config_RawLabor!$S56)*VLOOKUP($A56,Config!$A$2:$B$5,2,0),2)","v":370.47},{"$f":"ROUND(((Config_RawLabor!Q56/Config!$B$7)/Config_RawLabor!$S56)*VLOOKUP($A56,Config!$A$2:$B$5,2,0),2)","v":394.76},{"$f":"ROUND(((Config_RawLabor!R56/Config!$B$7)/Config_RawLabor!$S56)*VLOOKUP($A56,Config!$A$2:$B$5,2,0),2)","v":414.64},{"$f":"ROUND(((Config_RawLabor!T56/Config!$B$7)/Config_RawLabor!$W56)*VLOOKUP($A56,Config!$A$2:$B$5,2,0),2)","v":450.25},{"$f":"ROUND(((Config_RawLabor!U56/Config!$B$7)/Config_RawLabor!$W56)*VLOOKUP($A56,Config!$A$2:$B$5,2,0),2)","v":469.77},{"$f":"ROUND(((Config_RawLabor!V56/Config!$B$7)/Config_RawLabor!$W56)*VLOOKUP($A56,Config!$A$2:$B$5,2,0),2)","v":497.36}]
[{"$f":"Config_RawLabor!A57","v":"Expert"},{"$f":"Config_RawLabor!B57","v":"Reservoir Engineering Manager"},{"$f":"Config_RawLabor!C57","v":"Reviews all aspects of engineering studies regarding the identification, evaluation, and development of oil and gas reserves within a region. Oversees the process of estimating, assessing, and planning oil and gas production and development projects. Ensures all projects, initiatives, and processes are in conformance with an organization's established policies and objectives"},{"$f":"ROUND(((Config_RawLabor!D57/Config!$B$7)/Config_RawLabor!$G57)*VLOOKUP($A57,Config!$A$2:$B$5,2,0),2)","v":212.7},{"$f":"ROUND(((Config_RawLabor!E57/Config!$B$7)/Config_RawLabor!$G57)*VLOOKUP($A57,Config!$A$2:$B$5,2,0),2)","v":243.24},{"$f":"ROUND(((Config_RawLabor!F57/Config!$B$7)/Config_RawLabor!$G57)*VLOOKUP($A57,Config!$A$2:$B$5,2,0),2)","v":285.38},{"$f":"ROUND(((Config_RawLabor!H57/Config!$B$7)/Config_RawLabor!$K57)*VLOOKUP($A57,Config!$A$2:$B$5,2,0),2)","v":250.68},{"$f":"ROUND(((Config_RawLabor!I57/Config!$B$7)/Config_RawLabor!$K57)*VLOOKUP($A57,Config!$A$2:$B$5,2,0),2)","v":289.74},{"$f":"ROUND(((Config_RawLabor!J57/Config!$B$7)/Config_RawLabor!$K57)*VLOOKUP($A57,Config!$A$2:$B$5,2,0),2)","v":340.89},{"$f":"ROUND(((Config_RawLabor!L57/Config!$B$7)/Config_RawLabor!$O57)*VLOOKUP($A57,Config!$A$2:$B$5,2,0),2)","v":297.83999999999997},{"$f":"ROUND(((Config_RawLabor!M57/Config!$B$7)/Config_RawLabor!$O57)*VLOOKUP($A57,Config!$A$2:$B$5,2,0),2)","v":343.43},{"$f":"ROUND(((Config_RawLabor!N57/Config!$B$7)/Config_RawLabor!$O57)*VLOOKUP($A57,Config!$A$2:$B$5,2,0),2)","v":402.19},{"$f":"ROUND(((Config_RawLabor!P57/Config!$B$7)/Config_RawLabor!$S57)*VLOOKUP($A57,Config!$A$2:$B$5,2,0),2)","v":351.31},{"$f":"ROUND(((Config_RawLabor!Q57/Config!$B$7)/Config_RawLabor!$S57)*VLOOKUP($A57,Config!$A$2:$B$5,2,0),2)","v":404.24},{"$f":"ROUND(((Config_RawLabor!R57/Config!$B$7)/Config_RawLabor!$S57)*VLOOKUP($A57,Config!$A$2:$B$5,2,0),2)","v":470.23},{"$f":"ROUND(((Config_RawLabor!T57/Config!$B$7)/Config_RawLabor!$W57)*VLOOKUP($A57,Config!$A$2:$B$5,2,0),2)","v":397.71},{"$f":"ROUND(((Config_RawLabor!U57/Config!$B$7)/Config_RawLabor!$W57)*VLOOKUP($A57,Config!$A$2:$B$5,2,0),2)","v":458.95},{"$f":"ROUND(((Config_RawLabor!V57/Config!$B$7)/Config_RawLabor!$W57)*VLOOKUP($A57,Config!$A$2:$B$5,2,0),2)","v":532.01}]
[{"$f":"Config_RawLabor!A58","v":"Expert"},{"$f":"Config_RawLabor!B58","v":"Sociologist"},{"$f":"Config_RawLabor!C58","v":"Provides expertise in the discipline area of sociology, including evaluating qualitative research methods in a proposed study..  Familiar with current literature and research in the selected field."},{"$f":"ROUND(((Config_RawLabor!D58/Config!$B$7)/Config_RawLabor!$G58)*VLOOKUP($A58,Config!$A$2:$B$5,2,0),2)","v":102.01},{"$f":"ROUND(((Config_RawLabor!E58/Config!$B$7)/Config_RawLabor!$G58)*VLOOKUP($A58,Config!$A$2:$B$5,2,0),2)","v":125.74},{"$f":"ROUND(((Config_RawLabor!F58/Config!$B$7)/Config_RawLabor!$G58)*VLOOKUP($A58,Config!$A$2:$B$5,2,0),2)","v":193.79},{"$f":"ROUND(((Config_RawLabor!H58/Config!$B$7)/Config_RawLabor!$K58)*VLOOKUP($A58,Config!$A$2:$B$5,2,0),2)","v":120.22},{"$f":"ROUND(((Config_RawLabor!I58/Config!$B$7)/Config_RawLabor!$K58)*VLOOKUP($A58,Config!$A$2:$B$5,2,0),2)","v":149.78},{"$f":"ROUND(((Config_RawLabor!J58/Config!$B$7)/Config_RawLabor!$K58)*VLOOKUP($A58,Config!$A$2:$B$5,2,0),2)","v":231.48},{"$f":"ROUND(((Config_RawLabor!L58/Config!$B$7)/Config_RawLabor!$O58)*VLOOKUP($A58,Config!$A$2:$B$5,2,0),2)","v":142.84},{"$f":"ROUND(((Config_RawLabor!M58/Config!$B$7)/Config_RawLabor!$O58)*VLOOKUP($A58,Config!$A$2:$B$5,2,0),2)","v":177.54},{"$f":"ROUND(((Config_RawLabor!N58/Config!$B$7)/Config_RawLabor!$O58)*VLOOKUP($A58,Config!$A$2:$B$5,2,0),2)","v":273.11},{"$f":"ROUND(((Config_RawLabor!P58/Config!$B$7)/Config_RawLabor!$S58)*VLOOKUP($A58,Config!$A$2:$B$5,2,0),2)","v":168.48},{"$f":"ROUND(((Config_RawLabor!Q58/Config!$B$7)/Config_RawLabor!$S58)*VLOOKUP($A58,Config!$A$2:$B$5,2,0),2)","v":208.97},{"$f":"ROUND(((Config_RawLabor!R58/Config!$B$7)/Config_RawLabor!$S58)*VLOOKUP($A58,Config!$A$2:$B$5,2,0),2)","v":319.31},{"$f":"ROUND(((Config_RawLabor!T58/Config!$B$7)/Config_RawLabor!$W58)*VLOOKUP($A58,Config!$A$2:$B$5,2,0),2)","v":190.73},{"$f":"ROUND(((Config_RawLabor!U58/Config!$B$7)/Config_RawLabor!$W58)*VLOOKUP($A58,Config!$A$2:$B$5,2,0),2)","v":237.25},{"$f":"ROUND(((Config_RawLabor!V58/Config!$B$7)/Config_RawLabor!$W58)*VLOOKUP($A58,Config!$A$2:$B$5,2,0),2)","v":361.26}]
[{"$f":"Config_RawLabor!A59","v":"Expert"},{"$f":"Config_RawLabor!B59","v":"Software Engineer "},{"$f":"Config_RawLabor!C59","v":"Reviews the design and code of software applications. Reviews s coding, debugging, testing and troubleshooting procedures throughout the application development process. Provides consultation on software application components of complex projects. "},{"$f":"ROUND(((Config_RawLabor!D59/Config!$B$7)/Config_RawLabor!$G59)*VLOOKUP($A59,Config!$A$2:$B$5,2,0),2)","v":114.38},{"$f":"ROUND(((Config_RawLabor!E59/Config!$B$7)/Config_RawLabor!$G59)*VLOOKUP($A59,Config!$A$2:$B$5,2,0),2)","v":129.75},{"$f":"ROUND(((Config_RawLabor!F59/Config!$B$7)/Config_RawLabor!$G59)*VLOOKUP($A59,Config!$A$2:$B$5,2,0),2)","v":151.84},{"$f":"ROUND(((Config_RawLabor!H59/Config!$B$7)/Config_RawLabor!$K59)*VLOOKUP($A59,Config!$A$2:$B$5,2,0),2)","v":148.03},{"$f":"ROUND(((Config_RawLabor!I59/Config!$B$7)/Config_RawLabor!$K59)*VLOOKUP($A59,Config!$A$2:$B$5,2,0),2)","v":164.96},{"$f":"ROUND(((Config_RawLabor!J59/Config!$B$7)/Config_RawLabor!$K59)*VLOOKUP($A59,Config!$A$2:$B$5,2,0),2)","v":183.56},{"$f":"ROUND(((Config_RawLabor!L59/Config!$B$7)/Config_RawLabor!$O59)*VLOOKUP($A59,Config!$A$2:$B$5,2,0),2)","v":185.55},{"$f":"ROUND(((Config_RawLabor!M59/Config!$B$7)/Config_RawLabor!$O59)*VLOOKUP($A59,Config!$A$2:$B$5,2,0),2)","v":205.92},{"$f":"ROUND(((Config_RawLabor!N59/Config!$B$7)/Config_RawLabor!$O59)*VLOOKUP($A59,Config!$A$2:$B$5,2,0),2)","v":227.9},{"$f":"ROUND(((Config_RawLabor!P59/Config!$B$7)/Config_RawLabor!$S59)*VLOOKUP($A59,Config!$A$2:$B$5,2,0),2)","v":226.75},{"$f":"ROUND(((Config_RawLabor!Q59/Config!$B$7)/Config_RawLabor!$S59)*VLOOKUP($A59,Config!$A$2:$B$5,2,0),2)","v":249.78},{"$f":"ROUND(((Config_RawLabor!R59/Config!$B$7)/Config_RawLabor!$S59)*VLOOKUP($A59,Config!$A$2:$B$5,2,0),2)","v":275.76},{"$f":"ROUND(((Config_RawLabor!T59/Config!$B$7)/Config_RawLabor!$W59)*VLOOKUP($A59,Config!$A$2:$B$5,2,0),2)","v":247.2},{"$f":"ROUND(((Config_RawLabor!U59/Config!$B$7)/Config_RawLabor!$W59)*VLOOKUP($A59,Config!$A$2:$B$5,2,0),2)","v":274.52},{"$f":"ROUND(((Config_RawLabor!V59/Config!$B$7)/Config_RawLabor!$W59)*VLOOKUP($A59,Config!$A$2:$B$5,2,0),2)","v":307.94}]
[{"$f":"Config_RawLabor!A60","v":"Expert"},{"$f":"Config_RawLabor!B60","v":"Statistician "},{"$f":"Config_RawLabor!C60","v":"Analyzes and interprets data from various sources. Compiles reports, charts, and tables based on established statistical methods."},{"$f":"ROUND(((Config_RawLabor!D60/Config!$B$7)/Config_RawLabor!$G60)*VLOOKUP($A60,Config!$A$2:$B$5,2,0),2)","v":99.78},{"$f":"ROUND(((Config_RawLabor!E60/Config!$B$7)/Config_RawLabor!$G60)*VLOOKUP($A60,Config!$A$2:$B$5,2,0),2)","v":107.27},{"$f":"ROUND(((Config_RawLabor!F60/Config!$B$7)/Config_RawLabor!$G60)*VLOOKUP($A60,Config!$A$2:$B$5,2,0),2)","v":115.17},{"$f":"ROUND(((Config_RawLabor!H60/Config!$B$7)/Config_RawLabor!$K60)*VLOOKUP($A60,Config!$A$2:$B$5,2,0),2)","v":123.6},{"$f":"ROUND(((Config_RawLabor!I60/Config!$B$7)/Config_RawLabor!$K60)*VLOOKUP($A60,Config!$A$2:$B$5,2,0),2)","v":140.16},{"$f":"ROUND(((Config_RawLabor!J60/Config!$B$7)/Config_RawLabor!$K60)*VLOOKUP($A60,Config!$A$2:$B$5,2,0),2)","v":166.53},{"$f":"ROUND(((Config_RawLabor!L60/Config!$B$7)/Config_RawLabor!$O60)*VLOOKUP($A60,Config!$A$2:$B$5,2,0),2)","v":130.26},{"$f":"ROUND(((Config_RawLabor!M60/Config!$B$7)/Config_RawLabor!$O60)*VLOOKUP($A60,Config!$A$2:$B$5,2,0),2)","v":150.6},{"$f":"ROUND(((Config_RawLabor!N60/Config!$B$7)/Config_RawLabor!$O60)*VLOOKUP($A60,Config!$A$2:$B$5,2,0),2)","v":169.66},{"$f":"ROUND(((Config_RawLabor!P60/Config!$B$7)/Config_RawLabor!$S60)*VLOOKUP($A60,Config!$A$2:$B$5,2,0),2)","v":161.63999999999999},{"$f":"ROUND(((Config_RawLabor!Q60/Config!$B$7)/Config_RawLabor!$S60)*VLOOKUP($A60,Config!$A$2:$B$5,2,0),2)","v":182.04},{"$f":"ROUND(((Config_RawLabor!R60/Config!$B$7)/Config_RawLabor!$S60)*VLOOKUP($A60,Config!$A$2:$B$5,2,0),2)","v":205.37},{"$f":"ROUND(((Config_RawLabor!T60/Config!$B$7)/Config_RawLabor!$W60)*VLOOKUP($A60,Config!$A$2:$B$5,2,0),2)","v":213.13},{"$f":"ROUND(((Config_RawLabor!U60/Config!$B$7)/Config_RawLabor!$W60)*VLOOKUP($A60,Config!$A$2:$B$5,2,0),2)","v":234.34},{"$f":"ROUND(((Config_RawLabor!V60/Config!$B$7)/Config_RawLabor!$W60)*VLOOKUP($A60,Config!$A$2:$B$5,2,0),2)","v":274.52}]
[{"$f":"Config_RawLabor!A61","v":"Expert"},{"$f":"Config_RawLabor!B61","v":"Structural Engineer "},{"$f":"Config_RawLabor!C61","v":"Reviews load-bearing structures or structural elements, such as buildings, bridges, or roadways. Performs analysis of building materials used in construction. Reviews  blueprints or specifications used during construction and ensures all projects comply with applicable codes and regulations. Determines cause of structural failures, damages, and defects through site investigations. Provides reports detailing investigations and assessment of damages to the structure."},{"$f":"ROUND(((Config_RawLabor!D61/Config!$B$7)/Config_RawLabor!$G61)*VLOOKUP($A61,Config!$A$2:$B$5,2,0),2)","v":100.47},{"$f":"ROUND(((Config_RawLabor!E61/Config!$B$7)/Config_RawLabor!$G61)*VLOOKUP($A61,Config!$A$2:$B$5,2,0),2)","v":122.24},{"$f":"ROUND(((Config_RawLabor!F61/Config!$B$7)/Config_RawLabor!$G61)*VLOOKUP($A61,Config!$A$2:$B$5,2,0),2)","v":129.80000000000001},{"$f":"ROUND(((Config_RawLabor!H61/Config!$B$7)/Config_RawLabor!$K61)*VLOOKUP($A61,Config!$A$2:$B$5,2,0),2)","v":139.16999999999999},{"$f":"ROUND(((Config_RawLabor!I61/Config!$B$7)/Config_RawLabor!$K61)*VLOOKUP($A61,Config!$A$2:$B$5,2,0),2)","v":148.80000000000001},{"$f":"ROUND(((Config_RawLabor!J61/Config!$B$7)/Config_RawLabor!$K61)*VLOOKUP($A61,Config!$A$2:$B$5,2,0),2)","v":166.31},{"$f":"ROUND(((Config_RawLabor!L61/Config!$B$7)/Config_RawLabor!$O61)*VLOOKUP($A61,Config!$A$2:$B$5,2,0),2)","v":164.15},{"$f":"ROUND(((Config_RawLabor!M61/Config!$B$7)/Config_RawLabor!$O61)*VLOOKUP($A61,Config!$A$2:$B$5,2,0),2)","v":187.69},{"$f":"ROUND(((Config_RawLabor!N61/Config!$B$7)/Config_RawLabor!$O61)*VLOOKUP($A61,Config!$A$2:$B$5,2,0),2)","v":206.53},{"$f":"ROUND(((Config_RawLabor!P61/Config!$B$7)/Config_RawLabor!$S61)*VLOOKUP($A61,Config!$A$2:$B$5,2,0),2)","v":180.09},{"$f":"ROUND(((Config_RawLabor!Q61/Config!$B$7)/Config_RawLabor!$S61)*VLOOKUP($A61,Config!$A$2:$B$5,2,0),2)","v":204.25},{"$f":"ROUND(((Config_RawLabor!R61/Config!$B$7)/Config_RawLabor!$S61)*VLOOKUP($A61,Config!$A$2:$B$5,2,0),2)","v":219.13},{"$f":"ROUND(((Config_RawLabor!T61/Config!$B$7)/Config_RawLabor!$W61)*VLOOKUP($A61,Config!$A$2:$B$5,2,0),2)","v":209.43},{"$f":"ROUND(((Config_RawLabor!U61/Config!$B$7)/Config_RawLabor!$W61)*VLOOKUP($A61,Config!$A$2:$B$5,2,0),2)","v":237.53},{"$f":"ROUND(((Config_RawLabor!V61/Config!$B$7)/Config_RawLabor!$W61)*VLOOKUP($A61,Config!$A$2:$B$5,2,0),2)","v":254.83}]
[{"$f":"Config_RawLabor!A62","v":"Expert"},{"$f":"Config_RawLabor!B62","v":"Systems Engineer "},{"$f":"Config_RawLabor!C62","v":"Reviews the plan and design of an organization's systems infrastructure. Ensures the accuracy and effectiveness of the system to meet business/customers' requirements. Monitors the performance of systems and suggests improvements. Verifies and reviews system related documents/reports including installation procedures. "},{"$f":"ROUND(((Config_RawLabor!D62/Config!$B$7)/Config_RawLabor!$G62)*VLOOKUP($A62,Config!$A$2:$B$5,2,0),2)","v":119.13},{"$f":"ROUND(((Config_RawLabor!E62/Config!$B$7)/Config_RawLabor!$G62)*VLOOKUP($A62,Config!$A$2:$B$5,2,0),2)","v":136.66},{"$f":"ROUND(((Config_RawLabor!F62/Config!$B$7)/Config_RawLabor!$G62)*VLOOKUP($A62,Config!$A$2:$B$5,2,0),2)","v":151.59},{"$f":"ROUND(((Config_RawLabor!H62/Config!$B$7)/Config_RawLabor!$K62)*VLOOKUP($A62,Config!$A$2:$B$5,2,0),2)","v":145.11000000000001},{"$f":"ROUND(((Config_RawLabor!I62/Config!$B$7)/Config_RawLabor!$K62)*VLOOKUP($A62,Config!$A$2:$B$5,2,0),2)","v":163.83000000000001},{"$f":"ROUND(((Config_RawLabor!J62/Config!$B$7)/Config_RawLabor!$K62)*VLOOKUP($A62,Config!$A$2:$B$5,2,0),2)","v":183.65},{"$f":"ROUND(((Config_RawLabor!L62/Config!$B$7)/Config_RawLabor!$O62)*VLOOKUP($A62,Config!$A$2:$B$5,2,0),2)","v":181.76},{"$f":"ROUND(((Config_RawLabor!M62/Config!$B$7)/Config_RawLabor!$O62)*VLOOKUP($A62,Config!$A$2:$B$5,2,0),2)","v":199.75},{"$f":"ROUND(((Config_RawLabor!N62/Config!$B$7)/Config_RawLabor!$O62)*VLOOKUP($A62,Config!$A$2:$B$5,2,0),2)","v":221.03},{"$f":"ROUND(((Config_RawLabor!P62/Config!$B$7)/Config_RawLabor!$S62)*VLOOKUP($A62,Config!$A$2:$B$5,2,0),2)","v":214.17},{"$f":"ROUND(((Config_RawLabor!Q62/Config!$B$7)/Config_RawLabor!$S62)*VLOOKUP($A62,Config!$A$2:$B$5,2,0),2)","v":235.45},{"$f":"ROUND(((Config_RawLabor!R62/Config!$B$7)/Config_RawLabor!$S62)*VLOOKUP($A62,Config!$A$2:$B$5,2,0),2)","v":259.39},{"$f":"ROUND(((Config_RawLabor!T62/Config!$B$7)/Config_RawLabor!$W62)*VLOOKUP($A62,Config!$A$2:$B$5,2,0),2)","v":242.22},{"$f":"ROUND(((Config_RawLabor!U62/Config!$B$7)/Config_RawLabor!$W62)*VLOOKUP($A62,Config!$A$2:$B$5,2,0),2)","v":268.62},{"$f":"ROUND(((Config_RawLabor!V62/Config!$B$7)/Config_RawLabor!$W62)*VLOOKUP($A62,Config!$A$2:$B$5,2,0),2)","v":298.3}]
[{"$f":"Config_RawLabor!A63","v":"Expert"},{"$f":"Config_RawLabor!B63","v":"Telecommunications Economist"},{"$f":"Config_RawLabor!C63","v":"Reviews and analyzes telecommunication rating schedules and schedule tables. Reviews billing and compliance to ensure conformance to company and government standards. "},{"$f":"ROUND(((Config_RawLabor!D63/Config!$B$7)/Config_RawLabor!$G63)*VLOOKUP($A63,Config!$A$2:$B$5,2,0),2)","v":119.77},{"$f":"ROUND(((Config_RawLabor!E63/Config!$B$7)/Config_RawLabor!$G63)*VLOOKUP($A63,Config!$A$2:$B$5,2,0),2)","v":129.9},{"$f":"ROUND(((Config_RawLabor!F63/Config!$B$7)/Config_RawLabor!$G63)*VLOOKUP($A63,Config!$A$2:$B$5,2,0),2)","v":146.33000000000001},{"$f":"ROUND(((Config_RawLabor!H63/Config!$B$7)/Config_RawLabor!$K63)*VLOOKUP($A63,Config!$A$2:$B$5,2,0),2)","v":141.15},{"$f":"ROUND(((Config_RawLabor!I63/Config!$B$7)/Config_RawLabor!$K63)*VLOOKUP($A63,Config!$A$2:$B$5,2,0),2)","v":154.74},{"$f":"ROUND(((Config_RawLabor!J63/Config!$B$7)/Config_RawLabor!$K63)*VLOOKUP($A63,Config!$A$2:$B$5,2,0),2)","v":174.79},{"$f":"ROUND(((Config_RawLabor!L63/Config!$B$7)/Config_RawLabor!$O63)*VLOOKUP($A63,Config!$A$2:$B$5,2,0),2)","v":167.71},{"$f":"ROUND(((Config_RawLabor!M63/Config!$B$7)/Config_RawLabor!$O63)*VLOOKUP($A63,Config!$A$2:$B$5,2,0),2)","v":183.41},{"$f":"ROUND(((Config_RawLabor!N63/Config!$B$7)/Config_RawLabor!$O63)*VLOOKUP($A63,Config!$A$2:$B$5,2,0),2)","v":206.23},{"$f":"ROUND(((Config_RawLabor!P63/Config!$B$7)/Config_RawLabor!$S63)*VLOOKUP($A63,Config!$A$2:$B$5,2,0),2)","v":201.38},{"$f":"ROUND(((Config_RawLabor!Q63/Config!$B$7)/Config_RawLabor!$S63)*VLOOKUP($A63,Config!$A$2:$B$5,2,0),2)","v":223.11},{"$f":"ROUND(((Config_RawLabor!R63/Config!$B$7)/Config_RawLabor!$S63)*VLOOKUP($A63,Config!$A$2:$B$5,2,0),2)","v":245.95},{"$f":"ROUND(((Config_RawLabor!T63/Config!$B$7)/Config_RawLabor!$W63)*VLOOKUP($A63,Config!$A$2:$B$5,2,0),2)","v":239.12},{"$f":"ROUND(((Config_RawLabor!U63/Config!$B$7)/Config_RawLabor!$W63)*VLOOKUP($A63,Config!$A$2:$B$5,2,0),2)","v":267.62},{"$f":"ROUND(((Config_RawLabor!V63/Config!$B$7)/Config_RawLabor!$W63)*VLOOKUP($A63,Config!$A$2:$B$5,2,0),2)","v":290.48}]
[{"$f":"Config_RawLabor!A64","v":"Expert"},{"$f":"Config_RawLabor!B64","v":"Telecommunications Engineer "},{"$f":"Config_RawLabor!C64","v":"Reviews the design, implementation and maintenance of telecommunication networks, systems and equipment,. Analyzes existing networks and equipment and identifies opportunities for improvement. Recommends alternate solutions that better meet consumer requirements."},{"$f":"ROUND(((Config_RawLabor!D64/Config!$B$7)/Config_RawLabor!$G64)*VLOOKUP($A64,Config!$A$2:$B$5,2,0),2)","v":114.96},{"$f":"ROUND(((Config_RawLabor!E64/Config!$B$7)/Config_RawLabor!$G64)*VLOOKUP($A64,Config!$A$2:$B$5,2,0),2)","v":128.58000000000001},{"$f":"ROUND(((Config_RawLabor!F64/Config!$B$7)/Config_RawLabor!$G64)*VLOOKUP($A64,Config!$A$2:$B$5,2,0),2)","v":145.13999999999999},{"$f":"ROUND(((Config_RawLabor!H64/Config!$B$7)/Config_RawLabor!$K64)*VLOOKUP($A64,Config!$A$2:$B$5,2,0),2)","v":137.63},{"$f":"ROUND(((Config_RawLabor!I64/Config!$B$7)/Config_RawLabor!$K64)*VLOOKUP($A64,Config!$A$2:$B$5,2,0),2)","v":156.6},{"$f":"ROUND(((Config_RawLabor!J64/Config!$B$7)/Config_RawLabor!$K64)*VLOOKUP($A64,Config!$A$2:$B$5,2,0),2)","v":176.31},{"$f":"ROUND(((Config_RawLabor!L64/Config!$B$7)/Config_RawLabor!$O64)*VLOOKUP($A64,Config!$A$2:$B$5,2,0),2)","v":166.78},{"$f":"ROUND(((Config_RawLabor!M64/Config!$B$7)/Config_RawLabor!$O64)*VLOOKUP($A64,Config!$A$2:$B$5,2,0),2)","v":186.82},{"$f":"ROUND(((Config_RawLabor!N64/Config!$B$7)/Config_RawLabor!$O64)*VLOOKUP($A64,Config!$A$2:$B$5,2,0),2)","v":207.92},{"$f":"ROUND(((Config_RawLabor!P64/Config!$B$7)/Config_RawLabor!$S64)*VLOOKUP($A64,Config!$A$2:$B$5,2,0),2)","v":182.73},{"$f":"ROUND(((Config_RawLabor!Q64/Config!$B$7)/Config_RawLabor!$S64)*VLOOKUP($A64,Config!$A$2:$B$5,2,0),2)","v":204.84},{"$f":"ROUND(((Config_RawLabor!R64/Config!$B$7)/Config_RawLabor!$S64)*VLOOKUP($A64,Config!$A$2:$B$5,2,0),2)","v":223.48},{"$f":"ROUND(((Config_RawLabor!T64/Config!$B$7)/Config_RawLabor!$W64)*VLOOKUP($A64,Config!$A$2:$B$5,2,0),2)","v":202.93},{"$f":"ROUND(((Config_RawLabor!U64/Config!$B$7)/Config_RawLabor!$W64)*VLOOKUP($A64,Config!$A$2:$B$5,2,0),2)","v":227.99},{"$f":"ROUND(((Config_RawLabor!V64/Config!$B$7)/Config_RawLabor!$W64)*VLOOKUP($A64,Config!$A$2:$B$5,2,0),2)","v":251.34}]
[{"$f":"Config_RawLabor!A65","v":"Expert"},{"$f":"Config_RawLabor!B65","v":"Top Economic Executive"},{"$f":"Config_RawLabor!C65","v":"Provides economic data, prepares interpretative reports, and provides leadership for the use of economic data and adaptation of economic models. Communicates the results of economic studies to the stakeholders and sets guidelines for proceeding economic strategies. Understands the macro and micro economic environment and its impact on the industry."},{"$f":"ROUND(((Config_RawLabor!D65/Config!$B$7)/Config_RawLabor!$G65)*VLOOKUP($A65,Config!$A$2:$B$5,2,0),2)","v":411.37},{"$f":"ROUND(((Config_RawLabor!E65/Config!$B$7)/Config_RawLabor!$G65)*VLOOKUP($A65,Config!$A$2:$B$5,2,0),2)","v":465.09},{"$f":"ROUND(((Config_RawLabor!F65/Config!$B$7)/Config_RawLabor!$G65)*VLOOKUP($A65,Config!$A$2:$B$5,2,0),2)","v":503.18},{"$f":"ROUND(((Config_RawLabor!H65/Config!$B$7)/Config_RawLabor!$K65)*VLOOKUP($A65,Config!$A$2:$B$5,2,0),2)","v":490.02},{"$f":"ROUND(((Config_RawLabor!I65/Config!$B$7)/Config_RawLabor!$K65)*VLOOKUP($A65,Config!$A$2:$B$5,2,0),2)","v":548.14},{"$f":"ROUND(((Config_RawLabor!J65/Config!$B$7)/Config_RawLabor!$K65)*VLOOKUP($A65,Config!$A$2:$B$5,2,0),2)","v":601.04},{"$f":"ROUND(((Config_RawLabor!L65/Config!$B$7)/Config_RawLabor!$O65)*VLOOKUP($A65,Config!$A$2:$B$5,2,0),2)","v":580.80999999999995},{"$f":"ROUND(((Config_RawLabor!M65/Config!$B$7)/Config_RawLabor!$O65)*VLOOKUP($A65,Config!$A$2:$B$5,2,0),2)","v":651.28},{"$f":"ROUND(((Config_RawLabor!N65/Config!$B$7)/Config_RawLabor!$O65)*VLOOKUP($A65,Config!$A$2:$B$5,2,0),2)","v":709.12},{"$f":"ROUND(((Config_RawLabor!P65/Config!$B$7)/Config_RawLabor!$S65)*VLOOKUP($A65,Config!$A$2:$B$5,2,0),2)","v":683.66},{"$f":"ROUND(((Config_RawLabor!Q65/Config!$B$7)/Config_RawLabor!$S65)*VLOOKUP($A65,Config!$A$2:$B$5,2,0),2)","v":768.19},{"$f":"ROUND(((Config_RawLabor!R65/Config!$B$7)/Config_RawLabor!$S65)*VLOOKUP($A65,Config!$A$2:$B$5,2,0),2)","v":829.09},{"$f":"ROUND(((Config_RawLabor!T65/Config!$B$7)/Config_RawLabor!$W65)*VLOOKUP($A65,Config!$A$2:$B$5,2,0),2)","v":776.18},{"$f":"ROUND(((Config_RawLabor!U65/Config!$B$7)/Config_RawLabor!$W65)*VLOOKUP($A65,Config!$A$2:$B$5,2,0),2)","v":869.65},{"$f":"ROUND(((Config_RawLabor!V65/Config!$B$7)/Config_RawLabor!$W65)*VLOOKUP($A65,Config!$A$2:$B$5,2,0),2)","v":938.02}]
[{"$f":"Config_RawLabor!A66","v":"Expert"},{"$f":"Config_RawLabor!B66","v":"Urban Planner"},{"$f":"Config_RawLabor!C66","v":"Reviews  land-use plans for the beneficial development of urban areas."},{"$f":"ROUND(((Config_RawLabor!D66/Config!$B$7)/Config_RawLabor!$G66)*VLOOKUP($A66,Config!$A$2:$B$5,2,0),2)","v":62.61},{"$f":"ROUND(((Config_RawLabor!E66/Config!$B$7)/Config_RawLabor!$G66)*VLOOKUP($A66,Config!$A$2:$B$5,2,0),2)","v":65.790000000000006},{"$f":"ROUND(((Config_RawLabor!F66/Config!$B$7)/Config_RawLabor!$G66)*VLOOKUP($A66,Config!$A$2:$B$5,2,0),2)","v":75.14},{"$f":"ROUND(((Config_RawLabor!H66/Config!$B$7)/Config_RawLabor!$K66)*VLOOKUP($A66,Config!$A$2:$B$5,2,0),2)","v":73.790000000000006},{"$f":"ROUND(((Config_RawLabor!I66/Config!$B$7)/Config_RawLabor!$K66)*VLOOKUP($A66,Config!$A$2:$B$5,2,0),2)","v":78.37},{"$f":"ROUND(((Config_RawLabor!J66/Config!$B$7)/Config_RawLabor!$K66)*VLOOKUP($A66,Config!$A$2:$B$5,2,0),2)","v":89.75},{"$f":"ROUND(((Config_RawLabor!L66/Config!$B$7)/Config_RawLabor!$O66)*VLOOKUP($A66,Config!$A$2:$B$5,2,0),2)","v":87.67},{"$f":"ROUND(((Config_RawLabor!M66/Config!$B$7)/Config_RawLabor!$O66)*VLOOKUP($A66,Config!$A$2:$B$5,2,0),2)","v":92.89},{"$f":"ROUND(((Config_RawLabor!N66/Config!$B$7)/Config_RawLabor!$O66)*VLOOKUP($A66,Config!$A$2:$B$5,2,0),2)","v":105.89},{"$f":"ROUND(((Config_RawLabor!P66/Config!$B$7)/Config_RawLabor!$S66)*VLOOKUP($A66,Config!$A$2:$B$5,2,0),2)","v":103.41},{"$f":"ROUND(((Config_RawLabor!Q66/Config!$B$7)/Config_RawLabor!$S66)*VLOOKUP($A66,Config!$A$2:$B$5,2,0),2)","v":109.34},{"$f":"ROUND(((Config_RawLabor!R66/Config!$B$7)/Config_RawLabor!$S66)*VLOOKUP($A66,Config!$A$2:$B$5,2,0),2)","v":123.8},{"$f":"ROUND(((Config_RawLabor!T66/Config!$B$7)/Config_RawLabor!$W66)*VLOOKUP($A66,Config!$A$2:$B$5,2,0),2)","v":117.07},{"$f":"ROUND(((Config_RawLabor!U66/Config!$B$7)/Config_RawLabor!$W66)*VLOOKUP($A66,Config!$A$2:$B$5,2,0),2)","v":124.14},{"$f":"ROUND(((Config_RawLabor!V66/Config!$B$7)/Config_RawLabor!$W66)*VLOOKUP($A66,Config!$A$2:$B$5,2,0),2)","v":140.07}]
[{"$f":"Config_RawLabor!A67","v":"Expert"},{"$f":"Config_RawLabor!B67","v":"Utility Rate Analyst"},{"$f":"Config_RawLabor!C67","v":"Monitors, reviews, and evaluates service rates and charges for various public utilities. Calculates cost-of-service and performs related rate analysis. Ensures filings comply with the Federal Energy Regulatory Commission requirements."},{"$f":"ROUND(((Config_RawLabor!D67/Config!$B$7)/Config_RawLabor!$G67)*VLOOKUP($A67,Config!$A$2:$B$5,2,0),2)","v":129.04},{"$f":"ROUND(((Config_RawLabor!E67/Config!$B$7)/Config_RawLabor!$G67)*VLOOKUP($A67,Config!$A$2:$B$5,2,0),2)","v":143.82},{"$f":"ROUND(((Config_RawLabor!F67/Config!$B$7)/Config_RawLabor!$G67)*VLOOKUP($A67,Config!$A$2:$B$5,2,0),2)","v":155.72999999999999},{"$f":"ROUND(((Config_RawLabor!H67/Config!$B$7)/Config_RawLabor!$K67)*VLOOKUP($A67,Config!$A$2:$B$5,2,0),2)","v":152.08000000000001},{"$f":"ROUND(((Config_RawLabor!I67/Config!$B$7)/Config_RawLabor!$K67)*VLOOKUP($A67,Config!$A$2:$B$5,2,0),2)","v":171.31},{"$f":"ROUND(((Config_RawLabor!J67/Config!$B$7)/Config_RawLabor!$K67)*VLOOKUP($A67,Config!$A$2:$B$5,2,0),2)","v":186.02},{"$f":"ROUND(((Config_RawLabor!L67/Config!$B$7)/Config_RawLabor!$O67)*VLOOKUP($A67,Config!$A$2:$B$5,2,0),2)","v":180.7},{"$f":"ROUND(((Config_RawLabor!M67/Config!$B$7)/Config_RawLabor!$O67)*VLOOKUP($A67,Config!$A$2:$B$5,2,0),2)","v":203.05},{"$f":"ROUND(((Config_RawLabor!N67/Config!$B$7)/Config_RawLabor!$O67)*VLOOKUP($A67,Config!$A$2:$B$5,2,0),2)","v":219.47},{"$f":"ROUND(((Config_RawLabor!P67/Config!$B$7)/Config_RawLabor!$S67)*VLOOKUP($A67,Config!$A$2:$B$5,2,0),2)","v":213.14},{"$f":"ROUND(((Config_RawLabor!Q67/Config!$B$7)/Config_RawLabor!$S67)*VLOOKUP($A67,Config!$A$2:$B$5,2,0),2)","v":239.01},{"$f":"ROUND(((Config_RawLabor!R67/Config!$B$7)/Config_RawLabor!$S67)*VLOOKUP($A67,Config!$A$2:$B$5,2,0),2)","v":256.60000000000002},{"$f":"ROUND(((Config_RawLabor!T67/Config!$B$7)/Config_RawLabor!$W67)*VLOOKUP($A67,Config!$A$2:$B$5,2,0),2)","v":241.29},{"$f":"ROUND(((Config_RawLabor!U67/Config!$B$7)/Config_RawLabor!$W67)*VLOOKUP($A67,Config!$A$2:$B$5,2,0),2)","v":271.35000000000002},{"$f":"ROUND(((Config_RawLabor!V67/Config!$B$7)/Config_RawLabor!$W67)*VLOOKUP($A67,Config!$A$2:$B$5,2,0),2)","v":290.31}]
[{"$f":"Config_RawLabor!A68","v":"Expert"},{"$f":"Config_RawLabor!B68","v":"Utility System Planner/Operator/Manager"},{"$f":"Config_RawLabor!C68","v":"Familiar with the proper operation of utility plant equipment including controls, operation, repairs, and perventive maintenance. Equipment may include bioenergy, hydro, nuclear, solar, thermal or wind generation or gas storage and transport."},{"$f":"ROUND(((Config_RawLabor!D68/Config!$B$7)/Config_RawLabor!$G68)*VLOOKUP($A68,Config!$A$2:$B$5,2,0),2)","v":126.11},{"$f":"ROUND(((Config_RawLabor!E68/Config!$B$7)/Config_RawLabor!$G68)*VLOOKUP($A68,Config!$A$2:$B$5,2,0),2)","v":147.62},{"$f":"ROUND(((Config_RawLabor!F68/Config!$B$7)/Config_RawLabor!$G68)*VLOOKUP($A68,Config!$A$2:$B$5,2,0),2)","v":179.37},{"$f":"ROUND(((Config_RawLabor!H68/Config!$B$7)/Config_RawLabor!$K68)*VLOOKUP($A68,Config!$A$2:$B$5,2,0),2)","v":157.04},{"$f":"ROUND(((Config_RawLabor!I68/Config!$B$7)/Config_RawLabor!$K68)*VLOOKUP($A68,Config!$A$2:$B$5,2,0),2)","v":178.46},{"$f":"ROUND(((Config_RawLabor!J68/Config!$B$7)/Config_RawLabor!$K68)*VLOOKUP($A68,Config!$A$2:$B$5,2,0),2)","v":201.3},{"$f":"ROUND(((Config_RawLabor!L68/Config!$B$7)/Config_RawLabor!$O68)*VLOOKUP($A68,Config!$A$2:$B$5,2,0),2)","v":187.19},{"$f":"ROUND(((Config_RawLabor!M68/Config!$B$7)/Config_RawLabor!$O68)*VLOOKUP($A68,Config!$A$2:$B$5,2,0),2)","v":206.98},{"$f":"ROUND(((Config_RawLabor!N68/Config!$B$7)/Config_RawLabor!$O68)*VLOOKUP($A68,Config!$A$2:$B$5,2,0),2)","v":233.36},{"$f":"ROUND(((Config_RawLabor!P68/Config!$B$7)/Config_RawLabor!$S68)*VLOOKUP($A68,Config!$A$2:$B$5,2,0),2)","v":202.16},{"$f":"ROUND(((Config_RawLabor!Q68/Config!$B$7)/Config_RawLabor!$S68)*VLOOKUP($A68,Config!$A$2:$B$5,2,0),2)","v":217.94},{"$f":"ROUND(((Config_RawLabor!R68/Config!$B$7)/Config_RawLabor!$S68)*VLOOKUP($A68,Config!$A$2:$B$5,2,0),2)","v":235.8},{"$f":"ROUND(((Config_RawLabor!T68/Config!$B$7)/Config_RawLabor!$W68)*VLOOKUP($A68,Config!$A$2:$B$5,2,0),2)","v":227.24},{"$f":"ROUND(((Config_RawLabor!U68/Config!$B$7)/Config_RawLabor!$W68)*VLOOKUP($A68,Config!$A$2:$B$5,2,0),2)","v":249.6},{"$f":"ROUND(((Config_RawLabor!V68/Config!$B$7)/Config_RawLabor!$W68)*VLOOKUP($A68,Config!$A$2:$B$5,2,0),2)","v":277.72000000000003}]
[{"$f":"Config_RawLabor!A69","v":"Expert"},{"$f":"Config_RawLabor!B69","v":"Wildfire Scientist"},{"$f":"Config_RawLabor!C69","v":"Uses analysis software to analyze wildfire risks and likely paths. Reviews approaches to preventing, controlling, or mitigating wildfire damage."},{"$f":"ROUND(((Config_RawLabor!D69/Config!$B$7)/Config_RawLabor!$G69)*VLOOKUP($A69,Config!$A$2:$B$5,2,0),2)","v":86.93},{"$f":"ROUND(((Config_RawLabor!E69/Config!$B$7)/Config_RawLabor!$G69)*VLOOKUP($A69,Config!$A$2:$B$5,2,0),2)","v":104.36},{"$f":"ROUND(((Config_RawLabor!F69/Config!$B$7)/Config_RawLabor!$G69)*VLOOKUP($A69,Config!$A$2:$B$5,2,0),2)","v":128.15},{"$f":"ROUND(((Config_RawLabor!H69/Config!$B$7)/Config_RawLabor!$K69)*VLOOKUP($A69,Config!$A$2:$B$5,2,0),2)","v":102.45},{"$f":"ROUND(((Config_RawLabor!I69/Config!$B$7)/Config_RawLabor!$K69)*VLOOKUP($A69,Config!$A$2:$B$5,2,0),2)","v":124.31},{"$f":"ROUND(((Config_RawLabor!J69/Config!$B$7)/Config_RawLabor!$K69)*VLOOKUP($A69,Config!$A$2:$B$5,2,0),2)","v":153.08000000000001},{"$f":"ROUND(((Config_RawLabor!L69/Config!$B$7)/Config_RawLabor!$O69)*VLOOKUP($A69,Config!$A$2:$B$5,2,0),2)","v":121.73},{"$f":"ROUND(((Config_RawLabor!M69/Config!$B$7)/Config_RawLabor!$O69)*VLOOKUP($A69,Config!$A$2:$B$5,2,0),2)","v":147.34},{"$f":"ROUND(((Config_RawLabor!N69/Config!$B$7)/Config_RawLabor!$O69)*VLOOKUP($A69,Config!$A$2:$B$5,2,0),2)","v":180.61},{"$f":"ROUND(((Config_RawLabor!P69/Config!$B$7)/Config_RawLabor!$S69)*VLOOKUP($A69,Config!$A$2:$B$5,2,0),2)","v":143.58000000000001},{"$f":"ROUND(((Config_RawLabor!Q69/Config!$B$7)/Config_RawLabor!$S69)*VLOOKUP($A69,Config!$A$2:$B$5,2,0),2)","v":173.43},{"$f":"ROUND(((Config_RawLabor!R69/Config!$B$7)/Config_RawLabor!$S69)*VLOOKUP($A69,Config!$A$2:$B$5,2,0),2)","v":211.16},{"$f":"ROUND(((Config_RawLabor!T69/Config!$B$7)/Config_RawLabor!$W69)*VLOOKUP($A69,Config!$A$2:$B$5,2,0),2)","v":162.55000000000001},{"$f":"ROUND(((Config_RawLabor!U69/Config!$B$7)/Config_RawLabor!$W69)*VLOOKUP($A69,Config!$A$2:$B$5,2,0),2)","v":196.9},{"$f":"ROUND(((Config_RawLabor!V69/Config!$B$7)/Config_RawLabor!$W69)*VLOOKUP($A69,Config!$A$2:$B$5,2,0),2)","v":238.9}]
[{"$f":"Config_RawLabor!A70","v":"Legal"},{"$f":"Config_RawLabor!B70","v":"Attorney "},{"$f":"Config_RawLabor!C70","v":"Attorney authorized by the California Bar to practice law in California. Higher experience levels should have experience with areas of law and procedures relevant to CPUC matters, such as environmental law or utility regulation."},{"$f":"ROUND(((Config_RawLabor!D70/Config!$B$7)/Config_RawLabor!$G70)*VLOOKUP($A70,Config!$A$2:$B$5,2,0),2)","v":193.15},{"$f":"ROUND(((Config_RawLabor!E70/Config!$B$7)/Config_RawLabor!$G70)*VLOOKUP($A70,Config!$A$2:$B$5,2,0),2)","v":222.36},{"$f":"ROUND(((Config_RawLabor!F70/Config!$B$7)/Config_RawLabor!$G70)*VLOOKUP($A70,Config!$A$2:$B$5,2,0),2)","v":255.4},{"$f":"ROUND(((Config_RawLabor!H70/Config!$B$7)/Config_RawLabor!$K70)*VLOOKUP($A70,Config!$A$2:$B$5,2,0),2)","v":246.07},{"$f":"ROUND(((Config_RawLabor!I70/Config!$B$7)/Config_RawLabor!$K70)*VLOOKUP($A70,Config!$A$2:$B$5,2,0),2)","v":291.52999999999997},{"$f":"ROUND(((Config_RawLabor!J70/Config!$B$7)/Config_RawLabor!$K70)*VLOOKUP($A70,Config!$A$2:$B$5,2,0),2)","v":340.65},{"$f":"ROUND(((Config_RawLabor!L70/Config!$B$7)/Config_RawLabor!$O70)*VLOOKUP($A70,Config!$A$2:$B$5,2,0),2)","v":342.26},{"$f":"ROUND(((Config_RawLabor!M70/Config!$B$7)/Config_RawLabor!$O70)*VLOOKUP($A70,Config!$A$2:$B$5,2,0),2)","v":394.32},{"$f":"ROUND(((Config_RawLabor!N70/Config!$B$7)/Config_RawLabor!$O70)*VLOOKUP($A70,Config!$A$2:$B$5,2,0),2)","v":447.12},{"$f":"ROUND(((Config_RawLabor!P70/Config!$B$7)/Config_RawLabor!$S70)*VLOOKUP($A70,Config!$A$2:$B$5,2,0),2)","v":415.99},{"$f":"ROUND(((Config_RawLabor!Q70/Config!$B$7)/Config_RawLabor!$S70)*VLOOKUP($A70,Config!$A$2:$B$5,2,0),2)","v":473.66},{"$f":"ROUND(((Config_RawLabor!R70/Config!$B$7)/Config_RawLabor!$S70)*VLOOKUP($A70,Config!$A$2:$B$5,2,0),2)","v":534.73},{"$f":"ROUND(((Config_RawLabor!T70/Config!$B$7)/Config_RawLabor!$W70)*VLOOKUP($A70,Config!$A$2:$B$5,2,0),2)","v":517.66},{"$f":"ROUND(((Config_RawLabor!U70/Config!$B$7)/Config_RawLabor!$W70)*VLOOKUP($A70,Config!$A$2:$B$5,2,0),2)","v":577.66},{"$f":"ROUND(((Config_RawLabor!V70/Config!$B$7)/Config_RawLabor!$W70)*VLOOKUP($A70,Config!$A$2:$B$5,2,0),2)","v":624.02}]
[{"$f":"Config_RawLabor!A71","v":"Legal"},{"$f":"Config_RawLabor!B71","v":"Legal Director"},{"$f":"Config_RawLabor!C71","v":"Oversees the legal work of the organization, including providing strategic direction. Alternate title may be General Counsel. Responsible for coordinating and supervising a legal team. Participates in the most complex legal actions. Oversees all legal operations including case assignment, hiring, supervision and professional development of the legal staff, as well as budgeting."},{"$f":"ROUND(((Config_RawLabor!D71/Config!$B$7)/Config_RawLabor!$G71)*VLOOKUP($A71,Config!$A$2:$B$5,2,0),2)","v":312.79000000000002},{"$f":"ROUND(((Config_RawLabor!E71/Config!$B$7)/Config_RawLabor!$G71)*VLOOKUP($A71,Config!$A$2:$B$5,2,0),2)","v":357.1},{"$f":"ROUND(((Config_RawLabor!F71/Config!$B$7)/Config_RawLabor!$G71)*VLOOKUP($A71,Config!$A$2:$B$5,2,0),2)","v":408.87},{"$f":"ROUND(((Config_RawLabor!H71/Config!$B$7)/Config_RawLabor!$K71)*VLOOKUP($A71,Config!$A$2:$B$5,2,0),2)","v":368.64},{"$f":"ROUND(((Config_RawLabor!I71/Config!$B$7)/Config_RawLabor!$K71)*VLOOKUP($A71,Config!$A$2:$B$5,2,0),2)","v":425.37},{"$f":"ROUND(((Config_RawLabor!J71/Config!$B$7)/Config_RawLabor!$K71)*VLOOKUP($A71,Config!$A$2:$B$5,2,0),2)","v":488.39},{"$f":"ROUND(((Config_RawLabor!L71/Config!$B$7)/Config_RawLabor!$O71)*VLOOKUP($A71,Config!$A$2:$B$5,2,0),2)","v":438.01},{"$f":"ROUND(((Config_RawLabor!M71/Config!$B$7)/Config_RawLabor!$O71)*VLOOKUP($A71,Config!$A$2:$B$5,2,0),2)","v":504.18},{"$f":"ROUND(((Config_RawLabor!N71/Config!$B$7)/Config_RawLabor!$O71)*VLOOKUP($A71,Config!$A$2:$B$5,2,0),2)","v":576.21},{"$f":"ROUND(((Config_RawLabor!P71/Config!$B$7)/Config_RawLabor!$S71)*VLOOKUP($A71,Config!$A$2:$B$5,2,0),2)","v":516.63},{"$f":"ROUND(((Config_RawLabor!Q71/Config!$B$7)/Config_RawLabor!$S71)*VLOOKUP($A71,Config!$A$2:$B$5,2,0),2)","v":593.46},{"$f":"ROUND(((Config_RawLabor!R71/Config!$B$7)/Config_RawLabor!$S71)*VLOOKUP($A71,Config!$A$2:$B$5,2,0),2)","v":673.69},{"$f":"ROUND(((Config_RawLabor!T71/Config!$B$7)/Config_RawLabor!$W71)*VLOOKUP($A71,Config!$A$2:$B$5,2,0),2)","v":584.87},{"$f":"ROUND(((Config_RawLabor!U71/Config!$B$7)/Config_RawLabor!$W71)*VLOOKUP($A71,Config!$A$2:$B$5,2,0),2)","v":673.78},{"$f":"ROUND(((Config_RawLabor!V71/Config!$B$7)/Config_RawLabor!$W71)*VLOOKUP($A71,Config!$A$2:$B$5,2,0),2)","v":762.21}]
[{"$f":"Config_RawLabor!A72","v":"Legal"},{"$f":"Config_RawLabor!B72","v":"Paralegal "},{"$f":"Config_RawLabor!C72","v":"Assists and supports attorneys with research. Researches and analyzes law sources such as statutes, recorded judicial decisions, legal articles, treaties, constitutions, and legal codes. Prepares legal documents. May direct the work of clerical or other support staff. May be responsible for the creation and administration of legal databases. Has complete understanding of technical legal terminology."},{"$f":"ROUND(((Config_RawLabor!D72/Config!$B$7)/Config_RawLabor!$G72)*VLOOKUP($A72,Config!$A$2:$B$5,2,0),2)","v":95.68},{"$f":"ROUND(((Config_RawLabor!E72/Config!$B$7)/Config_RawLabor!$G72)*VLOOKUP($A72,Config!$A$2:$B$5,2,0),2)","v":108.2},{"$f":"ROUND(((Config_RawLabor!F72/Config!$B$7)/Config_RawLabor!$G72)*VLOOKUP($A72,Config!$A$2:$B$5,2,0),2)","v":122.16},{"$f":"ROUND(((Config_RawLabor!H72/Config!$B$7)/Config_RawLabor!$K72)*VLOOKUP($A72,Config!$A$2:$B$5,2,0),2)","v":110.2},{"$f":"ROUND(((Config_RawLabor!I72/Config!$B$7)/Config_RawLabor!$K72)*VLOOKUP($A72,Config!$A$2:$B$5,2,0),2)","v":124.34},{"$f":"ROUND(((Config_RawLabor!J72/Config!$B$7)/Config_RawLabor!$K72)*VLOOKUP($A72,Config!$A$2:$B$5,2,0),2)","v":140.68},{"$f":"ROUND(((Config_RawLabor!L72/Config!$B$7)/Config_RawLabor!$O72)*VLOOKUP($A72,Config!$A$2:$B$5,2,0),2)","v":130.88},{"$f":"ROUND(((Config_RawLabor!M72/Config!$B$7)/Config_RawLabor!$O72)*VLOOKUP($A72,Config!$A$2:$B$5,2,0),2)","v":146.28},{"$f":"ROUND(((Config_RawLabor!N72/Config!$B$7)/Config_RawLabor!$O72)*VLOOKUP($A72,Config!$A$2:$B$5,2,0),2)","v":162.79},{"$f":"ROUND(((Config_RawLabor!P72/Config!$B$7)/Config_RawLabor!$S72)*VLOOKUP($A72,Config!$A$2:$B$5,2,0),2)","v":150.05000000000001},{"$f":"ROUND(((Config_RawLabor!Q72/Config!$B$7)/Config_RawLabor!$S72)*VLOOKUP($A72,Config!$A$2:$B$5,2,0),2)","v":169.39},{"$f":"ROUND(((Config_RawLabor!R72/Config!$B$7)/Config_RawLabor!$S72)*VLOOKUP($A72,Config!$A$2:$B$5,2,0),2)","v":189.75},{"$f":"ROUND(((Config_RawLabor!T72/Config!$B$7)/Config_RawLabor!$W72)*VLOOKUP($A72,Config!$A$2:$B$5,2,0),2)","v":166.65},{"$f":"ROUND(((Config_RawLabor!U72/Config!$B$7)/Config_RawLabor!$W72)*VLOOKUP($A72,Config!$A$2:$B$5,2,0),2)","v":188.13},{"$f":"ROUND(((Config_RawLabor!V72/Config!$B$7)/Config_RawLabor!$W72)*VLOOKUP($A72,Config!$A$2:$B$5,2,0),2)","v":210.75}]
[{"$f":"Config_RawLabor!A73","v":"Legal"},{"$f":"Config_RawLabor!B73","v":"Paralegal Manager"},{"$f":"Config_RawLabor!C73","v":"Often the most senior Paralegal individual. Validates and oversees the preparation of legal documents. Provides research utilizing databases and legal libraries. Coordinates with attorneys on special requests or highly complex projects. Note that supervisory and training support is not reimbursable."},{"$f":"ROUND(((Config_RawLabor!D73/Config!$B$7)/Config_RawLabor!$G73)*VLOOKUP($A73,Config!$A$2:$B$5,2,0),2)","v":124.7},{"$f":"ROUND(((Config_RawLabor!E73/Config!$B$7)/Config_RawLabor!$G73)*VLOOKUP($A73,Config!$A$2:$B$5,2,0),2)","v":142.41999999999999},{"$f":"ROUND(((Config_RawLabor!F73/Config!$B$7)/Config_RawLabor!$G73)*VLOOKUP($A73,Config!$A$2:$B$5,2,0),2)","v":167.39},{"$f":"ROUND(((Config_RawLabor!H73/Config!$B$7)/Config_RawLabor!$K73)*VLOOKUP($A73,Config!$A$2:$B$5,2,0),2)","v":146.97},{"$f":"ROUND(((Config_RawLabor!I73/Config!$B$7)/Config_RawLabor!$K73)*VLOOKUP($A73,Config!$A$2:$B$5,2,0),2)","v":169.65},{"$f":"ROUND(((Config_RawLabor!J73/Config!$B$7)/Config_RawLabor!$K73)*VLOOKUP($A73,Config!$A$2:$B$5,2,0),2)","v":199.94},{"$f":"ROUND(((Config_RawLabor!L73/Config!$B$7)/Config_RawLabor!$O73)*VLOOKUP($A73,Config!$A$2:$B$5,2,0),2)","v":174.62},{"$f":"ROUND(((Config_RawLabor!M73/Config!$B$7)/Config_RawLabor!$O73)*VLOOKUP($A73,Config!$A$2:$B$5,2,0),2)","v":201.08},{"$f":"ROUND(((Config_RawLabor!N73/Config!$B$7)/Config_RawLabor!$O73)*VLOOKUP($A73,Config!$A$2:$B$5,2,0),2)","v":235.9},{"$f":"ROUND(((Config_RawLabor!P73/Config!$B$7)/Config_RawLabor!$S73)*VLOOKUP($A73,Config!$A$2:$B$5,2,0),2)","v":205.97},{"$f":"ROUND(((Config_RawLabor!Q73/Config!$B$7)/Config_RawLabor!$S73)*VLOOKUP($A73,Config!$A$2:$B$5,2,0),2)","v":236.68},{"$f":"ROUND(((Config_RawLabor!R73/Config!$B$7)/Config_RawLabor!$S73)*VLOOKUP($A73,Config!$A$2:$B$5,2,0),2)","v":275.8},{"$f":"ROUND(((Config_RawLabor!T73/Config!$B$7)/Config_RawLabor!$W73)*VLOOKUP($A73,Config!$A$2:$B$5,2,0),2)","v":233.17},{"$f":"ROUND(((Config_RawLabor!U73/Config!$B$7)/Config_RawLabor!$W73)*VLOOKUP($A73,Config!$A$2:$B$5,2,0),2)","v":268.70999999999998},{"$f":"ROUND(((Config_RawLabor!V73/Config!$B$7)/Config_RawLabor!$W73)*VLOOKUP($A73,Config!$A$2:$B$5,2,0),2)","v":312.04000000000002}]
[{"$f":"Config_RawLabor!A74","v":"Legal"},{"$f":"Config_RawLabor!B74","v":"Paralegal Supervisor"},{"$f":"Config_RawLabor!C74","v":"Reviews prepared legal documents to ensure the work is complete and accurate. Prepares complex documents. Note that supervisory and training time is not reimbursable."},{"$f":"ROUND(((Config_RawLabor!D74/Config!$B$7)/Config_RawLabor!$G74)*VLOOKUP($A74,Config!$A$2:$B$5,2,0),2)","v":103.4},{"$f":"ROUND(((Config_RawLabor!E74/Config!$B$7)/Config_RawLabor!$G74)*VLOOKUP($A74,Config!$A$2:$B$5,2,0),2)","v":115.14},{"$f":"ROUND(((Config_RawLabor!F74/Config!$B$7)/Config_RawLabor!$G74)*VLOOKUP($A74,Config!$A$2:$B$5,2,0),2)","v":152.19},{"$f":"ROUND(((Config_RawLabor!H74/Config!$B$7)/Config_RawLabor!$K74)*VLOOKUP($A74,Config!$A$2:$B$5,2,0),2)","v":121.86},{"$f":"ROUND(((Config_RawLabor!I74/Config!$B$7)/Config_RawLabor!$K74)*VLOOKUP($A74,Config!$A$2:$B$5,2,0),2)","v":137.15},{"$f":"ROUND(((Config_RawLabor!J74/Config!$B$7)/Config_RawLabor!$K74)*VLOOKUP($A74,Config!$A$2:$B$5,2,0),2)","v":181.79},{"$f":"ROUND(((Config_RawLabor!L74/Config!$B$7)/Config_RawLabor!$O74)*VLOOKUP($A74,Config!$A$2:$B$5,2,0),2)","v":144.80000000000001},{"$f":"ROUND(((Config_RawLabor!M74/Config!$B$7)/Config_RawLabor!$O74)*VLOOKUP($A74,Config!$A$2:$B$5,2,0),2)","v":162.56},{"$f":"ROUND(((Config_RawLabor!N74/Config!$B$7)/Config_RawLabor!$O74)*VLOOKUP($A74,Config!$A$2:$B$5,2,0),2)","v":214.48},{"$f":"ROUND(((Config_RawLabor!P74/Config!$B$7)/Config_RawLabor!$S74)*VLOOKUP($A74,Config!$A$2:$B$5,2,0),2)","v":170.79},{"$f":"ROUND(((Config_RawLabor!Q74/Config!$B$7)/Config_RawLabor!$S74)*VLOOKUP($A74,Config!$A$2:$B$5,2,0),2)","v":191.35},{"$f":"ROUND(((Config_RawLabor!R74/Config!$B$7)/Config_RawLabor!$S74)*VLOOKUP($A74,Config!$A$2:$B$5,2,0),2)","v":250.76},{"$f":"ROUND(((Config_RawLabor!T74/Config!$B$7)/Config_RawLabor!$W74)*VLOOKUP($A74,Config!$A$2:$B$5,2,0),2)","v":193.35},{"$f":"ROUND(((Config_RawLabor!U74/Config!$B$7)/Config_RawLabor!$W74)*VLOOKUP($A74,Config!$A$2:$B$5,2,0),2)","v":217.24},{"$f":"ROUND(((Config_RawLabor!V74/Config!$B$7)/Config_RawLabor!$W74)*VLOOKUP($A74,Config!$A$2:$B$5,2,0),2)","v":283.70999999999998}]
[{"$f":"Config_RawLabor!A75","v":"School"},{"$f":"Config_RawLabor!B75","v":"Assistant School Principal"},{"$f":"Config_RawLabor!C75","v":"Assists the school principal in the management of education and teaching programs for an assigned school. Coordinates school activities and ensures that budgetary guidelines are met. May help in developing the curriculum, staffing, reviewing faculty performance, and creating an atmosphere conducive to scholarly pursuits. "},{"$f":"ROUND(((Config_RawLabor!D75/Config!$B$7)/Config_RawLabor!$G75)*VLOOKUP($A75,Config!$A$2:$B$5,2,0),2)","v":70.760000000000005},{"$f":"ROUND(((Config_RawLabor!E75/Config!$B$7)/Config_RawLabor!$G75)*VLOOKUP($A75,Config!$A$2:$B$5,2,0),2)","v":80.510000000000005},{"$f":"ROUND(((Config_RawLabor!F75/Config!$B$7)/Config_RawLabor!$G75)*VLOOKUP($A75,Config!$A$2:$B$5,2,0),2)","v":94.26},{"$f":"ROUND(((Config_RawLabor!H75/Config!$B$7)/Config_RawLabor!$K75)*VLOOKUP($A75,Config!$A$2:$B$5,2,0),2)","v":83.4},{"$f":"ROUND(((Config_RawLabor!I75/Config!$B$7)/Config_RawLabor!$K75)*VLOOKUP($A75,Config!$A$2:$B$5,2,0),2)","v":95.9},{"$f":"ROUND(((Config_RawLabor!J75/Config!$B$7)/Config_RawLabor!$K75)*VLOOKUP($A75,Config!$A$2:$B$5,2,0),2)","v":112.59},{"$f":"ROUND(((Config_RawLabor!L75/Config!$B$7)/Config_RawLabor!$O75)*VLOOKUP($A75,Config!$A$2:$B$5,2,0),2)","v":99.09},{"$f":"ROUND(((Config_RawLabor!M75/Config!$B$7)/Config_RawLabor!$O75)*VLOOKUP($A75,Config!$A$2:$B$5,2,0),2)","v":113.67},{"$f":"ROUND(((Config_RawLabor!N75/Config!$B$7)/Config_RawLabor!$O75)*VLOOKUP($A75,Config!$A$2:$B$5,2,0),2)","v":132.84},{"$f":"ROUND(((Config_RawLabor!P75/Config!$B$7)/Config_RawLabor!$S75)*VLOOKUP($A75,Config!$A$2:$B$5,2,0),2)","v":116.88},{"$f":"ROUND(((Config_RawLabor!Q75/Config!$B$7)/Config_RawLabor!$S75)*VLOOKUP($A75,Config!$A$2:$B$5,2,0),2)","v":133.80000000000001},{"$f":"ROUND(((Config_RawLabor!R75/Config!$B$7)/Config_RawLabor!$S75)*VLOOKUP($A75,Config!$A$2:$B$5,2,0),2)","v":155.31},{"$f":"ROUND(((Config_RawLabor!T75/Config!$B$7)/Config_RawLabor!$W75)*VLOOKUP($A75,Config!$A$2:$B$5,2,0),2)","v":132.32},{"$f":"ROUND(((Config_RawLabor!U75/Config!$B$7)/Config_RawLabor!$W75)*VLOOKUP($A75,Config!$A$2:$B$5,2,0),2)","v":151.9},{"$f":"ROUND(((Config_RawLabor!V75/Config!$B$7)/Config_RawLabor!$W75)*VLOOKUP($A75,Config!$A$2:$B$5,2,0),2)","v":175.71}]
[{"$f":"Config_RawLabor!A76","v":"School"},{"$f":"Config_RawLabor!B76","v":"Public School Teacher"},{"$f":"Config_RawLabor!C76","v":"Prepares lesson plans and instructs students in an assigned school. Develops and implements grade appropriate course work to meet the academic of children in a K-12 classroom setting. Evaluates and monitors student's performance. Assesses and documents students' progress. Participates in development and implementation of Individual Education Plans for specific students. May participate in implementing special programs for students. May supervise teaching assistants. "},{"$f":"ROUND(((Config_RawLabor!D76/Config!$B$7)/Config_RawLabor!$G76)*VLOOKUP($A76,Config!$A$2:$B$5,2,0),2)","v":47.89},{"$f":"ROUND(((Config_RawLabor!E76/Config!$B$7)/Config_RawLabor!$G76)*VLOOKUP($A76,Config!$A$2:$B$5,2,0),2)","v":54.4},{"$f":"ROUND(((Config_RawLabor!F76/Config!$B$7)/Config_RawLabor!$G76)*VLOOKUP($A76,Config!$A$2:$B$5,2,0),2)","v":62.93},{"$f":"ROUND(((Config_RawLabor!H76/Config!$B$7)/Config_RawLabor!$K76)*VLOOKUP($A76,Config!$A$2:$B$5,2,0),2)","v":56.44},{"$f":"ROUND(((Config_RawLabor!I76/Config!$B$7)/Config_RawLabor!$K76)*VLOOKUP($A76,Config!$A$2:$B$5,2,0),2)","v":64.8},{"$f":"ROUND(((Config_RawLabor!J76/Config!$B$7)/Config_RawLabor!$K76)*VLOOKUP($A76,Config!$A$2:$B$5,2,0),2)","v":75.16},{"$f":"ROUND(((Config_RawLabor!L76/Config!$B$7)/Config_RawLabor!$O76)*VLOOKUP($A76,Config!$A$2:$B$5,2,0),2)","v":67.05},{"$f":"ROUND(((Config_RawLabor!M76/Config!$B$7)/Config_RawLabor!$O76)*VLOOKUP($A76,Config!$A$2:$B$5,2,0),2)","v":76.81},{"$f":"ROUND(((Config_RawLabor!N76/Config!$B$7)/Config_RawLabor!$O76)*VLOOKUP($A76,Config!$A$2:$B$5,2,0),2)","v":88.68},{"$f":"ROUND(((Config_RawLabor!P76/Config!$B$7)/Config_RawLabor!$S76)*VLOOKUP($A76,Config!$A$2:$B$5,2,0),2)","v":79.09},{"$f":"ROUND(((Config_RawLabor!Q76/Config!$B$7)/Config_RawLabor!$S76)*VLOOKUP($A76,Config!$A$2:$B$5,2,0),2)","v":90.41},{"$f":"ROUND(((Config_RawLabor!R76/Config!$B$7)/Config_RawLabor!$S76)*VLOOKUP($A76,Config!$A$2:$B$5,2,0),2)","v":103.68},{"$f":"ROUND(((Config_RawLabor!T76/Config!$B$7)/Config_RawLabor!$W76)*VLOOKUP($A76,Config!$A$2:$B$5,2,0),2)","v":89.54},{"$f":"ROUND(((Config_RawLabor!U76/Config!$B$7)/Config_RawLabor!$W76)*VLOOKUP($A76,Config!$A$2:$B$5,2,0),2)","v":102.65},{"$f":"ROUND(((Config_RawLabor!V76/Config!$B$7)/Config_RawLabor!$W76)*VLOOKUP($A76,Config!$A$2:$B$5,2,0),2)","v":117.31}]
[{"$f":"Config_RawLabor!A77","v":"School"},{"$f":"Config_RawLabor!B77","v":"School Principal"},{"$f":"Config_RawLabor!C77","v":"Directs and oversees education and teaching programs for an assigned school. Responsibilities include developing the curriculum, staffing departments, reviewing faculty performance, and creating an atmosphere conducive to scholarly pursuits. Ensures all school activities are within budgetary guidelines. "},{"$f":"ROUND(((Config_RawLabor!D77/Config!$B$7)/Config_RawLabor!$G77)*VLOOKUP($A77,Config!$A$2:$B$5,2,0),2)","v":86.6},{"$f":"ROUND(((Config_RawLabor!E77/Config!$B$7)/Config_RawLabor!$G77)*VLOOKUP($A77,Config!$A$2:$B$5,2,0),2)","v":97.23},{"$f":"ROUND(((Config_RawLabor!F77/Config!$B$7)/Config_RawLabor!$G77)*VLOOKUP($A77,Config!$A$2:$B$5,2,0),2)","v":109.59},{"$f":"ROUND(((Config_RawLabor!H77/Config!$B$7)/Config_RawLabor!$K77)*VLOOKUP($A77,Config!$A$2:$B$5,2,0),2)","v":102.06},{"$f":"ROUND(((Config_RawLabor!I77/Config!$B$7)/Config_RawLabor!$K77)*VLOOKUP($A77,Config!$A$2:$B$5,2,0),2)","v":115.83},{"$f":"ROUND(((Config_RawLabor!J77/Config!$B$7)/Config_RawLabor!$K77)*VLOOKUP($A77,Config!$A$2:$B$5,2,0),2)","v":130.91},{"$f":"ROUND(((Config_RawLabor!L77/Config!$B$7)/Config_RawLabor!$O77)*VLOOKUP($A77,Config!$A$2:$B$5,2,0),2)","v":121.26},{"$f":"ROUND(((Config_RawLabor!M77/Config!$B$7)/Config_RawLabor!$O77)*VLOOKUP($A77,Config!$A$2:$B$5,2,0),2)","v":137.29},{"$f":"ROUND(((Config_RawLabor!N77/Config!$B$7)/Config_RawLabor!$O77)*VLOOKUP($A77,Config!$A$2:$B$5,2,0),2)","v":154.44999999999999},{"$f":"ROUND(((Config_RawLabor!P77/Config!$B$7)/Config_RawLabor!$S77)*VLOOKUP($A77,Config!$A$2:$B$5,2,0),2)","v":143.03},{"$f":"ROUND(((Config_RawLabor!Q77/Config!$B$7)/Config_RawLabor!$S77)*VLOOKUP($A77,Config!$A$2:$B$5,2,0),2)","v":161.59},{"$f":"ROUND(((Config_RawLabor!R77/Config!$B$7)/Config_RawLabor!$S77)*VLOOKUP($A77,Config!$A$2:$B$5,2,0),2)","v":180.57},{"$f":"ROUND(((Config_RawLabor!T77/Config!$B$7)/Config_RawLabor!$W77)*VLOOKUP($A77,Config!$A$2:$B$5,2,0),2)","v":161.91999999999999},{"$f":"ROUND(((Config_RawLabor!U77/Config!$B$7)/Config_RawLabor!$W77)*VLOOKUP($A77,Config!$A$2:$B$5,2,0),2)","v":183.46},{"$f":"ROUND(((Config_RawLabor!V77/Config!$B$7)/Config_RawLabor!$W77)*VLOOKUP($A77,Config!$A$2:$B$5,2,0),2)","v":204.3}]
[{"$f":"Config_RawLabor!A78","v":"School"},{"$f":"Config_RawLabor!B78","v":"School Superintendent"},{"$f":"Config_RawLabor!C78","v":"Directs and manages a school district. Oversees all aspects of the district's operational policies, objectives, initiatives. Responsible for the attainment of short- and long-term financial and operational goals for the school system. "},{"$f":"ROUND(((Config_RawLabor!D78/Config!$B$7)/Config_RawLabor!$G78)*VLOOKUP($A78,Config!$A$2:$B$5,2,0),2)","v":118.1},{"$f":"ROUND(((Config_RawLabor!E78/Config!$B$7)/Config_RawLabor!$G78)*VLOOKUP($A78,Config!$A$2:$B$5,2,0),2)","v":143.4},{"$f":"ROUND(((Config_RawLabor!F78/Config!$B$7)/Config_RawLabor!$G78)*VLOOKUP($A78,Config!$A$2:$B$5,2,0),2)","v":173.35},{"$f":"ROUND(((Config_RawLabor!H78/Config!$B$7)/Config_RawLabor!$K78)*VLOOKUP($A78,Config!$A$2:$B$5,2,0),2)","v":139.19},{"$f":"ROUND(((Config_RawLabor!I78/Config!$B$7)/Config_RawLabor!$K78)*VLOOKUP($A78,Config!$A$2:$B$5,2,0),2)","v":170.81},{"$f":"ROUND(((Config_RawLabor!J78/Config!$B$7)/Config_RawLabor!$K78)*VLOOKUP($A78,Config!$A$2:$B$5,2,0),2)","v":207.06},{"$f":"ROUND(((Config_RawLabor!L78/Config!$B$7)/Config_RawLabor!$O78)*VLOOKUP($A78,Config!$A$2:$B$5,2,0),2)","v":165.38},{"$f":"ROUND(((Config_RawLabor!M78/Config!$B$7)/Config_RawLabor!$O78)*VLOOKUP($A78,Config!$A$2:$B$5,2,0),2)","v":202.46},{"$f":"ROUND(((Config_RawLabor!N78/Config!$B$7)/Config_RawLabor!$O78)*VLOOKUP($A78,Config!$A$2:$B$5,2,0),2)","v":244.3},{"$f":"ROUND(((Config_RawLabor!P78/Config!$B$7)/Config_RawLabor!$S78)*VLOOKUP($A78,Config!$A$2:$B$5,2,0),2)","v":195.07},{"$f":"ROUND(((Config_RawLabor!Q78/Config!$B$7)/Config_RawLabor!$S78)*VLOOKUP($A78,Config!$A$2:$B$5,2,0),2)","v":238.31},{"$f":"ROUND(((Config_RawLabor!R78/Config!$B$7)/Config_RawLabor!$S78)*VLOOKUP($A78,Config!$A$2:$B$5,2,0),2)","v":285.63},{"$f":"ROUND(((Config_RawLabor!T78/Config!$B$7)/Config_RawLabor!$W78)*VLOOKUP($A78,Config!$A$2:$B$5,2,0),2)","v":220.83},{"$f":"ROUND(((Config_RawLabor!U78/Config!$B$7)/Config_RawLabor!$W78)*VLOOKUP($A78,Config!$A$2:$B$5,2,0),2)","v":270.56},{"$f":"ROUND(((Config_RawLabor!V78/Config!$B$7)/Config_RawLabor!$W78)*VLOOKUP($A78,Config!$A$2:$B$5,2,0),2)","v":323.14999999999998}]

{"sheet":"Config","index":7,"n_rows":41,"n_cols":9,"rows_kept":41,"cut":false,"hidden":true,"merged":[]}
["Category","Multiple","Overhead","G&A","FCOM","Premium","Roles",null,"Hide Worksheets"]
["Advocate",{"$f":"(1+C2)*(1+D2)*(1+E2)*(1+F2)","v":2.3255400000000002},{"$f":"AVERAGE(0.35,0.1)","v":0.22499999999999998},0.13,0.05,0.6,"Calc!B2:B11",null,"Calc"]
["Expert",{"$f":"(1+C3)*(1+D3)*(1+E3)*(1+F3)","v":2.8475999999999999},0.5,0.13,0.05,0.6,"Calc!B12:B69",null,"Calc_Raw"]
["Legal",{"$f":"(1+C4)*(1+D4)*(1+E4)*(1+F4)","v":2.8001400000000003},0.47499999999999998,0.13,0.05,0.6,"Calc!B70:B74",null,"Config"]
["School",{"$f":"(1+C5)*(1+D5)*(1+E5)*(1+F5)","v":2.016804940380228},6.2370912547528461E-2,0.13,0.05,0.6,"Calc!B75:B78",null,"Config_RawLabor"]
[null,null,null,null,null,null,null,null,"Config_Education"]
["Hours/Yr",2080]
[]
["Category:",{"$f":"IF(Lookup!B1=\"\",\"Legal\",Lookup!B1)","v":"Legal"}]
["Role List",{"$f":"VLOOKUP(B9,A2:G5,7,0)","v":"Calc!B70:B74"}]
["Role",{"$f":"IF(Lookup!B2=\"\",\"\",Lookup!B2)","v":"Attorney "}]
["Level",{"$f":"IF(Lookup!B3=\"\",\"III\",Lookup!B3)","v":"I"},"Education","Rates"]
["I","0-1 years",2,3]
["II","2-5 years",3,{"$f":"D13+3","v":6}]
["III","5-10 years",4,{"$f":"D14+3","v":9}]
["IV","10-15 years",5,{"$f":"D15+3","v":12}]
["V","15+ years",6,{"$f":"D16+3","v":15}]
["Experience",{"$f":"VLOOKUP(B12,A13:B17,2,0)","v":"0-1 years"}]
["Ed. Column",{"$f":"VLOOKUP(B12,A13:C17,3,0)","v":2}]
["Education",{"$f":"IF(B11=\"\",\"\",VLOOKUP(B11,Config_Education!A:F,Config!B19,0))","v":"JD, MD, PhD or Equivalent"}]
["Desc.",{"$f":"IF(B11=\"\",\"\",VLOOKUP(B11,Calc!B:C,2,0))","v":"Attorney authorized by the California Bar to practice law in California. Higher experience levels should have experience with areas of law and procedures relevant to CPUC matters, such as environmental law or utility regulation."}]
["Low",{"$f":"VLOOKUP($B$11,Calc!B:R,Config!B25,0)","v":174.96888923000003}]
["Median",{"$f":"VLOOKUP($B$11,Calc!B:R,Config!B25+1,0)","v":233.38888923000005}]
["High",{"$f":"VLOOKUP($B$11,Calc!B:R,Config!B25+2,0)","v":299.46888923000006}]
["Rate Col",{"$f":"VLOOKUP($B$12,$A$13:$D$17,4,0)","v":3}]
[]
["Period",{"$f":"IF(Lookup!C4=\"\",Config!A30,Lookup!C4)","v":"1/1/2021 thru 12/31/2021"}]
["Escalation",{"$f":"VLOOKUP(B27,A30:C41,3,0)","v":1.0495992500000002}]
["Period","Amount","Final"]
[{"$f":"Escalation!A2","v":"1/1/2019 thru 12/31/2019"},{"$f":"1+Escalation!B2","v":1.0235000000000001},{"$f":"B30","v":1.0235000000000001}]
[{"$f":"Escalation!A3","v":"1/1/2020 thru 12/31/2020"},{"$f":"1+Escalation!B3","v":1.0255000000000001},{"$f":"C30*B31","v":1.0495992500000002}]
[{"$f":"Escalation!A4","v":"1/1/2021 thru 12/31/2021"},{"$f":"1+Escalation!B4","v":1},{"$f":"C31*B32","v":1.0495992500000002}]
[{"$f":"Escalation!A5","v":"1/1/2022 thru 12/31/2022"},{"$f":"1+Escalation!B5","v":1.0330999999999999},1.0843409851750001]
[{"$f":"Escalation!A6","v":"1/1/2023 thru 12/31/2023"},{"$f":"1+Escalation!B6","v":1.0446},1.1327025931138051]
[{"$f":"Escalation!A7","v":"1/1/2024 thru 12/31/2024"},{"$f":"1+Escalation!B7","v":1.0407},{"$f":"C34*B35","v":1.1788035886535368}]
[{"$f":"Escalation!A8","v":"1/1/2025 thru 12/31/2025"},{"$f":"1+Escalation!B8","v":1.0346},1.2195901928209492]
[{"$f":"Escalation!A9","v":"1/1/2026 thru 12/31/2026"},{"$f":"1+Escalation!B9","v":1},1.2195901928209492]
[{"$f":"Escalation!A10","v":"1/1/2027 thru 12/31/2027"},{"$f":"1+Escalation!B10","v":1},1.2195901928209492]
[{"$f":"Escalation!A11","v":"1/1/2028 thru 12/31/2028"},{"$f":"1+Escalation!B11","v":1},1.2195901928209492]
[{"$f":"Escalation!A12","v":"1/1/2029 thru 12/31/2029"},{"$f":"1+Escalation!B12","v":1},1.2195901928209492]
[{"$f":"Escalation!A13","v":"1/1/2030 thru 12/31/2030"},{"$f":"1+Escalation!B13","v":1},1.2195901928209492]

{"sheet":"Config_RawLabor","index":8,"n_rows":78,"n_cols":23,"rows_kept":78,"cut":false,"hidden":true,"merged":[]}
["Category","CPUC Role","Description","Min 1","Med 1","Max 1","Ben. %","Min 2","Med 2","Max 2","Ben. %","Min 3","Med 3","Max 3","Ben. %","Min 4","Med 4","Max 4","Ben. %","Min 5","Med 5","Max 5","Ben. %"]
["Advocate","Administrative Analyst","Assist in the planning, development and management of a comprehensive  program within the eight county service area. Assist in the administration and development of specific programs and projects. Specific areas of focus include human resources, information systems, or grant writing. Represent orgination to community groups, partners, and funders. Coordinate community events, public relations activities. ",28604.726415035129,31153.257219873019,34614.827227798552,0.67683201691647465,33936.332676826831,37356.129210554871,41622.05383282237,0.68133061757571967,40480,44451,49299,0.68400000000000005,47531.282552617799,52085.871968222586,57378.983542887639,0.68091585297593105,54119.323913839478,59475.75118111234,65292.110285952709,0.68484016418931526]
["Advocate","Advocate - Not Otherwise Classified","Used for advocate roles that are not better classified as one of the more detailed roles, including for example consumer advocates. May also be used for advocates that fill multiple subroles.",41979.294350102493,49241.718752990862,58625.559407333538,0.69397380745071191,49539.156863066302,58717.913683869716,70092.58172736087,0.69913238229989383,59319.6,70113.600000000006,83246,0.70250000000000001,69409.596447069634,81939.082903835224,96728.995475432457,0.69784896759748716,78929.446390104888,93424.640412298584,109948.02841895699,0.70212666055102924]
["Advocate","Community Development Manager","Responsible for the supervision, support, and training of staff within a specific program, and for providing operational and program support to the program director. Meets program and organizational goals. Model and support organization's values.",38603.661167326311,44737.033320198745,51646.650673805765,0.70058050873810529,45798.958847209724,53644.547836884412,62101.701692267234,0.70523695503451678,54630,63833,73556,0.70799999999999996,64146.095994306088,74796.910426032089,85611.64554008485,0.70480763729087592,73037.022366923193,85409.003737687424,97418.334331194099,0.70886964363455429]
["Advocate","Community Development Program Director","A senior management position which provides leadership and management to one or more programs and participates in the overall management of (non-profit) organization. Coordinate, plan and develop comprehensive programs for implementing the organization's goals. On-going in-depth review and analysis of program operations, community needs and program resources. Represents the organization to community, agencies, the media, and participants. ",55964.355795898031,63802.117483709255,72967.85077115726,0.71740235711176037,66395.495932295729,76505.648440126723,87739.042950456729,0.72217061073449818,79198,91036,103922,0.72499999999999998,92993.639219422548,106672.2782501881,120954.55745033306,0.72173098451396189,105882.95986482853,121806.8093973981,137635.38175493982,0.72589052490826533]
["Advocate","Community Development Senior Specialist","Work closely with low-income, rural residents to assist them in the development and management of community facilities. Perform advocacy and technical assistance role regarding the needs of rural, low income people for safe and affordable water, waste water and energyfacilities. Responsible for multiple community development projects. Can include organizing, research, loan and grant writing. In addition, the SR CD Specialist provides leadership and support to CD staff, serves as a resource for other staff and effectively and positively represents the organization to staff, participants and the community ",44357.111821259517,56550.475170734833,68684.091244254087,0.70750715218608096,52624.789396980581,67810.143975848958,82588.103774529241,0.7122096367933326,62772,80689,97821,0.71499999999999997,73706.365325912164,94548.084930460784,113853.6187173941,0.71177607438273482,83922.386381411357,107962.45049723906,129555.1536599562,0.71587824180608239]
["Advocate","Community Development Specialist","Work closely with low-income, rural residents to assist them in the development and management of community facilities. Perform advocacy and technical assistance role regarding the needs of rural, low income people for safe and affordable water,waste water and energy facilities. Responsible for multiple community development projects. Can include organizing, research, loan and grant writing. ",21091.039261599642,24576.528557946665,28427.564655913509,0.66099968903538753,25022.176912185041,29469.919304999385,34182.277399733852,0.66539305926985493,29847,35067,40487,0.66800000000000004,35046.101540216987,41090.082839748524,47122.718649483599,0.66498799676596776,39903.642807716576,46919.893065804288,53621.405487887532,0.66882051122582242]
["Advocate","Executive Director","Provides overall direction and guidance to a non-profit organization's programs. Responsible for the success of special events, community outreach initiatives, and fundraising activities. Acts as a spokesperson and represents the organization's programs to the public. Assesses needs and ensures that program objectives are met, initiates changes to maintain member satisfaction and engagement. ",73739.847223027682,92707.064223247697,121454.86894683744,0.72432900055973604,87484.143375121304,111165.80989950705,146041.49430807823,0.729143292493314,104353,132279,172978,0.73199999999999998,122530.43300922247,154999.14643280275,201328.66417739951,0.72869942160582091,139513.68103707736,176990.23397643154,229093.86910573294,0.73289912307979344]
["Advocate","Housing Program Manager","Oversees operations of a housing program. Sets budget and policies, hires and trains staff, and oversees occupancy eligibility/operations. Develops and provides reports or documentation needed to secure/maintain funding or grants. May lead the work of others. ",19544.914227111083,27330.849065339095,36010.682651414929,0.6699053734684991,23187.871183506752,32772.647877978183,43300.478202883649,0.67435793581690384,27659,38997,51287,0.67700000000000005,32476.969963509284,45695.096828975191,59692.811800727774,0.67394741588407214,36978.418481543631,52178.260754760027,67925.038240849855,0.67783156601778716]
["Advocate","Program Coordinator","Plans and coordinates one or more programs for a non-profit organization, including fundraising, budgeting, and community outreach. Develops and implements programs that align with the organization's mission and support the organization's goals. Creates program materials, establishes staffing requirements, and ensures that program achieves stated objectives. May be responsible for special events that publicize the organization and its programs to the community. ",37504.131663823478,42546.892967628424,49326.778279626444,0.69662242676783348,44494.489142537233,51018.33236854885,59312.207668785108,0.70125256545805059,53074,60708,70252,0.70399999999999996,62319.05361160171,71135.162661061768,81766.128153815342,0.70082567323838507,70956.744006993977,81227.731720388023,93042.482237139702,0.70486473039368114]
["Advocate","Program Manager","Manages a team that coordinates programs for a non-profit organization. Designs programs that align with the organization's mission and support the organization's goals. Establishes fundraising and development goals, identifies potential donors or sources of funding, and plans outreach strategies. Schedules and forecasts planning for special events that publicize the organization and its programs to the community. May assist in the development of grants applications or proposals. ",54623.155925944062,57872.969521230894,65039.279622527436,0.70255954972324119,64804.311163999853,69395.957924248694,78205.457444052343,0.70722914982274987,77300,82576,92630,0.71,90765.023253887251,96759.194700860462,107811.82672219886,0.70679861931712129,103345.4480864573,110487.26979216514,122680.13906545365,0.71087210025499092]
["Expert","Accountant","Prepares complex balance sheets, profit and loss statements and other financial reports. Analyzes current costs, revenues, financial commitments, and obligations incurred to predict future revenues and expenses. ",46157,50705,55829,0.67900000000000005,54898,60674,67022,0.69,68972,76198,84467,0.69699999999999995,82876,90887,99796,0.67800000000000005,94498.992661216675,103633.5,113791.94786933226,0.68599999999999994]
["Expert","Biologist","Analyzes specific regional environments as well as the organisms and wildlife that inhabit those locations. Aids in the protection and survival of wildlife within any given ecosystem, and assesses the impact of human activity on the environment.",44567,49199,55550,0.67600000000000005,50405,57896,65508,0.68799999999999994,62822,72529,85185,0.70699999999999996,85669,99884,116657,0.68,94404,108856,119403,0.72299999999999998]
["Expert","Certified Depreciation Professional","Specialist in calculating depreciation.",53175,58865,64730,0.69499999999999995,63606,69559,76781,0.69899999999999995,75177,82615,90471,0.70399999999999996,91340,100413,112009,0.71099999999999997,102142.01268760022,112288,125255.36127792217,0.70224999999999993]
["Expert","Chemical Engineer","Analyzes processes for the transport and storage of chemicals, including gases. ",68016,74465,82315,0.69799999999999995,77361,85772,95634,0.70099999999999996,90401,102140,114595,0.7,110062,121562,136306,0.68600000000000005,124509,136996,149254,0.72099999999999997]
["Expert","Civil Engineer","Analyzes construction projects such as channels, dams, and roads. Responsibilities also include estimating costs, personnel, material and schedule needs.",61397,67070,75698,0.70899999999999996,73858,82468,91928,0.71299999999999997,89551,100341,113033,0.71599999999999997,94434,105901,118904,0.72399999999999998,111199,125415,140754,0.72399999999999998]
["Expert","Climate Scientist","Analyze and interpret data obtained from meteorological stations, radar and satellite imagery, and computer models.\nAnalyze past climate conditions and use models to predict future climate trends.\nExpert on factors that affect climate and cause climate change. Provides information and advises policy-makers on environmental topics such as climate change and air quality. Uses impact models to illustrate how human or natural activities respond to climate, for example crop yields, wetland ecology, biodiversity, and human health. ",54720,61752,69683,0.69299999999999995,70815,78375,87647,0.70199999999999996,82423,93314,105563,0.70599999999999996,88522,100999,113488,0.70799999999999996,100856,119873,136697,0.72]
["Expert","Communication Specialist","Defines, designs and implements communications strategy and programs. Evaluates and assist in establishing standard operating procedures regarding communications. Reviews and edits communications submitted for organizational issues. Works closely with various business departments to ensure messages are delivered clearly and effectively.",58721,67237,76482,0.69199999999999995,72687,82763,93917,0.69799999999999995,90261,101973,117377,0.69199999999999995,107355,120693,137175,0.66900000000000004,135049,155742,183408,0.65100000000000002]
["Expert","Cost Accountant","Reviews cost accounting procedures and methods. Responsible for the preparation and analysis of cost reports and costing audits. Examines and reviews unusual cost records and ensures cost data is allocated correctly. ",53175,58865,64730,0.69499999999999995,63606,69559,76781,0.69899999999999995,75177,82615,90471,0.70399999999999996,91340,100413,112009,0.71099999999999997,102142.01268760022,112288,125255.36127792217,0.70224999999999993]
["Expert","Cost Estimation Analyst","Reviews project cost estimates, expenditures, and forecasts. Prepares should cost estimates for comparison as part of cost reasonableness analysis. Requires technical knowledge of the construction work involved, and the ability to use cost-estimating methods.",57601,63087,70244,0.6944999999999999,72287.5,79446.5,89375,0.70649999999999991,80468,90162,102473,0.70599999999999996,97334,112192.5,125300,0.70499999999999996,134513,155451,175054,0.71099999999999997]
["Expert","Design Engineer","Evaluates products, parts, or processes for cost efficiency and reliability and to estimate project completion status. ",60874,66142,71964,0.69399999999999995,65857,72674,81006,0.69399999999999995,89319,96804,107527,0.69599999999999995,106511,120002,139139,0.68500000000000005,120118.44105098248,135333,156914.87047715872,0.69225000000000003]
["Expert","Drilling Engineer ","Provides expert judgment for the design and implementation of oil and gas wells. Resolves highly complex technical issues and conducts advanced research into emerging technology in the field. Recommends alterations to development and design to improve safety, costs, and efficiency. ",85332,92486,101587,0.67600000000000005,99287,110694,120630,0.64700000000000002,118173,135029,148197,0.66900000000000004,144473,162226,176750,0.63600000000000001,163959,191572,204012,0.65900000000000003]
["Expert","Ecologist","Investigates the factors at play in a disturbed ecosystem, anticipates potential effects of proposed actions, and recommends sustainable practices. Work may include fieldwork to collect and analyze data on environmental conditions, or to assess or certify a habitat. May plan or review habitat management or environmental restoration projects, including procedures, resources, schedules, and budgets.",44567,49199,55550,0.67600000000000005,50405,57896,65508,0.68799999999999994,62822,72529,85185,0.70699999999999996,85669,99884,116657,0.68,94404,108856,119403,0.72299999999999998]
["Expert","Economist","Conducts research and analyses on economic data/trends and provides recommendations based on expertise. Researches and develops new data statistical models and technological innovations. Organizes data into report format and arranges graphic illustrations of research findings. Interprets and predicts economic conditions and advises management on implications. ",72100,85484,100523,0.68899999999999995,83513.5,98566,116074,0.68500000000000005,94927,111648,131625,0.68100000000000005,101502,119913,142606.5,0.68300000000000005,108077,128178,153588,0.68500000000000005]
["Expert","Electrical Controls Engineer ","Reviews design of electrical control systems, equipment, and machinery.",61925,68939,73488,0.70599999999999996,67524,77704.5,87486.5,0.71,73123,86470,101485,0.71399999999999997,82712.5,95177.5,110035.5,0.71950000000000003,92302,103885,118586,0.72499999999999998]
["Expert","Electrical Engineer ","Reviews electrical equipment, components, or systems. Applies mathematical and engineering principles and methods to analysis of electrical system designs. Studies new technologies and researches innovative solutions and product designs to make alternate recommendations.",63370,68049,73721,0.69799999999999995,74215,81064,89682,0.70399999999999996,89473,98981,108884,0.71,106719,115631,126470,0.71599999999999997,125703,139203,149891,0.72099999999999997]
["Expert","Energy & Resources Expert","Offers broad, cross discipline expertise in analytic, methodological, theoretical, and practical approaches to problems in energy, resources, and the environment.",53258.15099214494,62537.482002500015,80447.204106557998,0.69546395920144288,62889.398283961455,74604.032821054716,96703.357590079584,0.70305556937620484,76664.666666666672,89948.333333333328,115383.66666666667,0.70566666666666666,91921.225879411169,108412.54046172379,136744.98305272812,0.70290882517569486,101777.83916193603,120774.44977202,151170.90507240823,0.71896391773949453]
["Expert","Engineer ","Provides expert consultation in one or more areas of engineering. Reviews highly complex technical issues and recommends alterations to development and design to improve quality of products and/or procedures. Has extensive engineering knowledge and is considered an expert in one or more engineering specialties. ",61111,65891,74318,0.69199999999999995,69281,76313,84688,0.69399999999999995,83107,91617,104952,0.69899999999999995,98998,110142,122383,0.68600000000000005,117252,131200,149367,0.68799999999999994]
["Expert","Env., Health, and Safety Engineer ","Provides review and expert recommendations with respect to local, state and federal environmental, health and safety regulations. May review the design of facilities, work areas and work procedures from an environmental, health and safety perspective. Reviews environmental policy and procedures. Ensures compliance with all environmental, health and safety regulations. ",51819,55915,65020,0.68200000000000005,65795,70900,74786,0.70399999999999996,78439,86172,93202,0.70899999999999996,91501,102055,111882,0.70099999999999996,117330,130890,141683,0.70499999999999996]
["Expert","Environmental Engineer ","Identifies, assesses and resolves problems concerning the environment. May review measuring approaches, equipment and results in areas such as pollutants involving air, land, and water. Provides reports findings on environmental consequences of equipment, tools, and procedures. Reviews conformance to federal, state, and local environmental legislation.",54720,61752,69683,0.69299999999999995,70815,78375,87647,0.70199999999999996,82423,93314,105563,0.70599999999999996,88522,100999,113488,0.70799999999999996,100856,119873,136697,0.72]
["Expert","Equipment Engineer ","Provides expert consultation with respect to technical products and equipment. Recognized as technical leader and resource. Recommends alterations and enhancements to improve quality of products and/or procedures. ",58858,65413,71615,0.67500000000000004,73242,81451,91350,0.67300000000000004,78712,87523,99205,0.66300000000000003,93376,104843,118722,0.65500000000000003,104897,114292,124098,0.65800000000000003]
["Expert","Expert - Not Otherwise Classified","Used for export roles that are not better classified as one of the more detailed roles. May also be used for experts that fill multiple subroles.",62971.496883304855,70131.491533935317,81277.348789654556,0.69136023013563486,74150.010714787699,83393.534204693759,96894.806322203134,0.69590494711964934,88540.801169590646,99498.637426900576,115242.76608187135,0.69841520467836271,104333.03514159683,117078.95578223032,134551.78740832119,0.69601131638412561,120293.18090632996,135438.22725962393,155356.52669982007,0.69890434819453229]
["Expert","Expert - Social Work","Provides expertise in the discipline area of social work.  Familiar with current literature and research in the selected field.",53506.667098479746,65260.575747292882,93197.222305267569,0.71740235711176037,63479.721103985365,78254.497844800746,112063.53214856308,0.72217061073449818,75720,93117,132733,0.72499999999999998,88909.800268878957,109110.70932183714,154487.6087263049,0.72173098451396189,101233.08317084795,124591.20205915812,175792.97094434698,0.72589052490826533]
["Expert","Field Service Engineer ","Reviews installation and maintenance of products/equipment. Identifies, analyzes, makes recommendations regarding product failures, installation of new components or parts. Develops creative recommendations for more unique, chronic, or complex issues. Provides the intervenor team with explanations of product features and typical operation. Has extensive knowledge of an organization's products and services and is considered an expert.",51386,58950,67855,0.68799999999999994,61625,71014,81565,0.69899999999999995,75831,86300,99696,0.70299999999999996,88286,103136,114251,0.70399999999999996,99034,114404,127228,0.72199999999999998]
["Expert","Fire Fighter","Provides explanations of standard or expected fire fighting procedures under typical, potential, or observed scenarios.",24218.621255496517,32025.809136337033,40106.970650095973,0.68177961937931431,28732.705776504099,38402.413453139758,48225.995192288821,0.68631110454630229,34273,45696,57121,0.68899999999999995,40243.074281765563,53544.712277786763,66482.989897427629,0.68589330804154447,45820.938451062757,61141.569952804421,75651.648748329681,0.68984630574040662]
["Expert","Fire Inspector Supervisor","Oversees the inspection of fire-damage to determine cause. Reviews preventive actions for appropriatness. Provides explanations of a variety of fire laws, regulations, and policies, including identifying those that are appropriate for a given situation. Assesses compliance with laws, regulations, and policies. ",45113.215014542307,54156.388948533167,66506.753382767987,0.71047571366378481,53521.821905977733,64939.375323101987,79969.998155032255,0.71519792897568224,63842,77273,94720,0.71799999999999997,74962.750511962091,90545.355213616436,110244.37252646741,0.71476254742210299,85352.911988817679,103391.81842968873,125448.15688523988,0.71888192673673723]
["Expert","Fire Prevention Engineer","Examines buildings and equipment to determine compliance with fire prevention best practices. Ensures fire compliance codes are being adhered to. ",39021.99115837623,40185.045611416601,47626.895995634877,0.64714640213943631,46295.260945645532,48186.221607495783,57268.210988745697,0.65144769575222317,55222,57338,67831,0.65400000000000003,64841.21751780287,67186.33387131778,78948.33227241144,0.65105112258224984,73828.490740366688,76718.647976932334,89836.08456168398,0.65480331488276633]
["Expert","Geologist","Expert on the formation, dissolution, and content of rock layers, along with the effects of internal pressures, heat, water, pollution, and erosion. ",54993,56960,66880,0.70299999999999996,65689,73213,93637,0.71399999999999997,86088,91582,107016,0.70099999999999996,93960,111056,127675,0.72799999999999998,118142,142243,155990,0.72]
["Expert","Geotechnical Engineer","Prepares and inspects projects involving drilling and exploration. Responsible for reviewing geological maps, site characterization, numerical modeling and analysis of excavations/supports. ",57760,63578,67740,0.70899999999999996,60054,69987,76263,0.71299999999999997,76397,88571,95771,0.70599999999999996,105364,110910,116467,0.73199999999999998,117235.61866378144,123406.5,129589.62073302678,0.71499999999999997]
["Expert","Hardware Engineer ","Reviews design, development, and implementation of hardware for products. Reviews test strategies and implementation, devices, and systems. Reviews stress and performance test results for a variety of computer hardware including circuit boards, processors and wiring. ",61476,68843,75175,0.70099999999999996,73453,81958,91103,0.70099999999999996,88318,98127,109173,0.69299999999999995,109867,121913,133335,0.70599999999999996,127276,140551,154033,0.71799999999999997]
["Expert","Health Scientist","Reviews the potential impact of policies and planned projects on community health.  ",75135.458257358085,90720.869740308714,110817.43953648128,0.68969578331985792,89139.880950139413,108784.14761558289,133250.6848481042,0.69427988369923477,106328,129445,157828,0.69699999999999995,124849.46174048285,151678.38061970647,183695.61684023755,0.69385723614652617,142154.13718158903,173198.32200938306,209029.05093838304,0.69785613222215304]
["Expert","Hydrologist","Measure the properties of bodies of water, such as volume and stream flow\nCollect water and soil samples to test for certain properties, such as the pH or pollution levels. Analyze data on the environmental impacts of pollution, erosion, drought, and other problems. Recommend ways to minimize the negative impacts of erosion, sedimentation, or pollution on the environment. Use computer models to forecast future water supplies, the spread of pollution, floods, and other events.\nEvaluate the feasibility of water-related projects, such as hydroelectric power plants, irrigation systems, and wastewater treatment facilities.",54720,61752,69683,0.69299999999999995,70815,78375,87647,0.70199999999999996,82423,93314,105563,0.70599999999999996,88522,100999,113488,0.70799999999999996,100856,119873,136697,0.72]
["Expert","IT Project Engineer ","Reviews IT engineering projects for compliance with industry best practices. Performs engineering design evaluations and reviews project budget and schedule. Reviews information system policies and controls to ensure data accuracy, security, and regulatory compliance. Reviews reports of computer and peripheral equipment production, malfunction, and maintenance to determine problems.",76772,85662,98460,0.69499999999999995,83529,94954,108773,0.69299999999999995,95272,105891,118438,0.68799999999999994,101264,115028,127981,0.72199999999999998,110168.22095489794,125142.5,139234.46719494383,0.6994999999999999]
["Expert","Mechanical Engineer ","Reviews all aspects of mechanical components, equipment, and machinery design, installation, and testing. Applies knowledge of engineering principles to review products such as engines, instruments, controls, robots, machines, etc. Reviews product testing, models and prototypes. May review fabrication, operation, application, installation, and/or repair of mechanical products.",61722,66409,71978,0.69799999999999995,74478,80946,89277,0.70299999999999996,89459,97393,106517,0.70699999999999996,105848,115963,127653,0.70399999999999996,123478,135140,146797,0.71399999999999997]
["Expert","Network Engineer ","Evaluates network systems and communications. May review issues such as network traffic, potential security risk, etc. Reviews network architecture design and optimization. Must have extensive knowledge of Internet, computer, routers, switches, firewall, etc. ",59559,66925,77393,0.70199999999999996,73321,82738,93861,0.70799999999999996,87713,97660,108041,0.71399999999999997,106459,117945,131152,0.70799999999999996,114704,125811,139026,0.71599999999999997]
["Expert","Nuclear Engineer ","Reviews processes related to nuclear energy and radiation. Familiar with problems of nuclear energy systems. Reviews design of nuclear equipment. Reviews testing, operation, and maintenance of nuclear reactors. ",68763,73082,84220,0.69,82741,93864,102866,0.71599999999999997,95681,107944,119370,0.71699999999999997,102667,111107,123245,0.69699999999999995,117288,131183,145705,0.72299999999999998]
["Expert","Physicist","Provide reports regarding experimental physicists, force analysis, health physics, and high-energy physics. Provide expert witness testimony on issues regarding nuclear physics, optics, particle physics, quantum computing, quantum physics, radiation exposure, the science of matter and energy, shock physics, stress on materials, superconductivity, thermal exposure, and thermodynamics, as well as related topics.",75403,81824,107176,0.72,89151,105495,138272,0.73,101617,119250,148880,0.72899999999999998,127305,149042,178178,0.74,146948,161023,193415,0.73899999999999999]
["Expert","Process Engineer ","Reviews continuous production and manufacturing processes with respect to output, quality, and cost. Reviews production data and applies standard scientific and statistical methods to analyze, document, and diagram production processes. Identifies process bottlenecks and recommended solutions to resolve. Recommends changes or upgrades to equipment, work methods, or other aspects of the process to improve efficiency and utilization of resources including labor, energy and raw materials.",61069,65769,71611,0.69399999999999995,72665,78947,84776,0.69899999999999995,85870,93574,100551,0.70099999999999996,101948,111007,120881,0.69899999999999995,114715.95220121254,124909.5,136020.11827632494,0.69824999999999993]
["Expert","Professor - Law","Current or former law professor with knowledge of CPUC regulatory proceedings.",93060,127206,165771,0.73599999999999999,102833,141097.5,184709.5,0.74150000000000005,112606,154989,203648,0.747,129052,181430.5,245357,0.75350000000000006,145498,207872,287066,0.76]
["Expert","Program Design/Evaluation Specialist","Designs marketing strategies and programs for a utility product or product line. Evaluates utility product performance, and recommends changes to current products based on market research and new trends. ",54862,62680,71797,0.68,63540,73678,86270,0.68700000000000006,78415,89398,101627,0.68799999999999994,98535,111784,127419,0.68200000000000005,105029,121950,134473,0.70799999999999996]
["Expert","Project Engineer ","Reviews engineering designs and implementation plans for reasonableness. Reviews industry policies and procedures to ensure data accuracy, security, and regulatory compliance. Reviews reports of production, malfunction, and maintenance to determine or address problems. Provides recommendations regarding engineering process. Coordinates with other engineering experts and coordinates their specialized contributions to the proceeding. Reviews and opins on operational plans for completing the project. Reviews progress and performance against the project plan and recommends actions to resolve operational problems and minimize delays. Develops alternate or comparative project schedules, budgets, and forecasts. ",64592,70000,79467,0.69099999999999995,76056,83996,94255,0.69099999999999995,91478,101234,113389,0.70699999999999996,106112,117700,132045,0.69399999999999995,116053,128994,145832,0.69599999999999995]
["Expert","Project Engineer - Construction","Interviews construction staff. Reviews plans and other technical documents, answers questions regarding the scope and/or scheduling of the project. Develops cost estimates or appropriate schedules. ",58315,65761,75181,0.70799999999999996,58315,65761,75181,0.70799999999999996,58315,65761,75181,0.70799999999999996,58315,65761,75181,0.70799999999999996,58315,65761,75181,0.70799999999999996]
["Expert","Public Policy Analyst","Reviews the impact of state government policies and regulations. Analyzes proposed legislative actions and determines the potential impact. Reviews policies, plans, and programs to ensure consistency with corresponding government regulations and laws.",86474,102518,119806,0.69799999999999995,94510.072606355941,111204.46400737198,130273.05217882839,0.68276913987188226,133746,158672,185537,0.69,155570,183877,215107,0.70799999999999996,251574,288542,339214,0.63700000000000001]
["Expert","Regulatory Affairs Specialist","Familiar with regulatory forms, policies, and procedures and capable of reviewing regulatory compliance. ",64464,73898,83181,0.66800000000000004,82277,97577,113415,0.69099999999999995,98030,110278,127008,0.69899999999999995,122363,133732,148625,0.67800000000000005,139006.60788741661,151922,168840.72062034518,0.68400000000000005]
["Expert","Reliability Engineer ","Analyzes the reliability in design, cost, weight, production and consumer satisfaction of company products. Develops the methods and measures of analysis based on customer and contractual obligations. Prepares reports, charts and diagrams to disclose results and highlight areas for further investigation. Performs root cause analysis to determine product design flaws",60713,67216,71405,0.68899999999999995,75367,80238,86043,0.68200000000000005,88654,96819,103877,0.68700000000000006,108095,116199,125339,0.66900000000000004,114546,127149,136790,0.69499999999999995]
["Expert","Reservoir Engineer ","Responsible for identifying oil and gas reserves and developing strategies to maximize recovery. Reviews testing results for  new wells and monitors and predicts performance.",104021,109546,122202,0.64300000000000002,105475,115470,128408,0.60899999999999999,123890,133749,151859,0.61099999999999999,165069,175892,184749,0.61,192397,200735,212527,0.58499999999999996]
["Expert","Reservoir Engineering Manager","Reviews all aspects of engineering studies regarding the identification, evaluation, and development of oil and gas reserves within a region. Oversees the process of estimating, assessing, and planning oil and gas production and development projects. Ensures all projects, initiatives, and processes are in conformance with an organization's established policies and objectives",100695.98602130696,115155.12678095241,135107.99204151568,0.64813592263200426,119464.60984307864,138083.46796375921,162458.47714300855,0.65244379314633971,142500,164309,192423,0.65500000000000003,167322.32617954636,192530.59632464254,223960.65133720904,0.65204661359537253,190513.92435084301,219846.59964494358,254847.03011326556,0.65580454319298465]
["Expert","Sociologist","Provides expertise in the discipline area of sociology, including evaluating qualitative research methods in a proposed study..  Familiar with current literature and research in the selected field.",53526.452976434804,65982.446007500053,101689.61231967401,0.71839187760432832,63503.194851884356,79120.098463164148,122275.07277023871,0.72316670812861472,75748,94147,144828,0.72599999999999998,88942.677638233523,110317.62138517135,168564.94915818438,0.72272647552708469,101270.51748580812,125969.34931606,191811.71521722467,0.72689175321848365]
["Expert","Software Engineer ","Reviews the design and code of software applications. Reviews s coding, debugging, testing and troubleshooting procedures throughout the application development process. Provides consultation on software application components of complex projects. ",58232,66060,77302,0.69699999999999995,76339,85066,94661,0.70599999999999996,95821,106340,117694,0.70699999999999996,115774,127532,140797,0.69899999999999995,128561,142770,160151,0.71199999999999997]
["Expert","Statistician ","Analyzes and interprets data from various sources. Compiles reports, charts, and tables based on established statistical methods.",50289,54063,58046,0.69,63286,71769,85268,0.70099999999999996,67271,77771,87615,0.70699999999999996,84181,94807,106955,0.71299999999999997,106797,117424,137559,0.68600000000000005]
["Expert","Structural Engineer ","Reviews load-bearing structures or structural elements, such as buildings, bridges, or roadways. Performs analysis of building materials used in construction. Reviews  blueprints or specifications used during construction and ensures all projects comply with applicable codes and regulations. Determines cause of structural failures, damages, and defects through site investigations. Provides reports detailing investigations and assessment of damages to the structure.",51956,63218,67128,0.70799999999999996,72381,77389,86491,0.71199999999999997,84053,96106,105751,0.70099999999999996,93922,106525,114284,0.71399999999999997,108420.5061534851,122969,131925.73758272704,0.70874999999999999]
["Expert","Systems Engineer ","Reviews the plan and design of an organization's systems infrastructure. Ensures the accuracy and effectiveness of the system to meet business/customers' requirements. Monitors the performance of systems and suggests improvements. Verifies and reviews system related documents/reports including installation procedures. ",61087,70077,77732,0.70199999999999996,74834,84487,94704,0.70599999999999996,94261,103595,114627,0.71,109978,120902,133194,0.70299999999999996,125088,138723,154048,0.70699999999999996]
["Expert","Telecommunications Economist","Reviews and analyzes telecommunication rating schedules and schedule tables. Reviews billing and compliance to ensure conformance to company and government standards. ",62500.05526755465,67788.523347843642,76364.104636364689,0.71443379563405651,74149.377872215977,81285.780786972377,91822.814921274839,0.71918231855214854,88447,96724,108759,0.72199999999999998,100465,111307,122701,0.68300000000000005,112483,125890,136643,0.64400000000000002]
["Expert","Telecommunications Engineer ","Reviews the design, implementation and maintenance of telecommunication networks, systems and equipment,. Analyzes existing networks and equipment and identifies opportunities for improvement. Recommends alternate solutions that better meet consumer requirements.",58864,65839,74318,0.70099999999999996,70373,80071,90151,0.7,85397,95660,106461,0.70099999999999996,94500,105932,115571,0.70799999999999996,104799,117737,129798,0.70699999999999996]
["Expert","Top Economic Executive","Provides economic data, prepares interpretative reports, and provides leadership for the use of economic data and adaptation of economic models. Communicates the results of economic studies to the stakeholders and sets guidelines for proceeding economic strategies. Understands the macro and micro economic environment and its impact on the industry.",182562.39049622061,206402.74563473384,223305.27145363827,0.60756558243671843,218912.07716200373,244873.94634157672,268509.90670645778,0.6116037999875612,260489,292091,318035,0.61399999999999999,305230.40433579299,342970.84614813951,370160.14586629078,0.61123148205734157,348536.11728457786,390508.08896534797,421208.87431373802,0.61475418247403435]
["Expert","Urban Planner","Reviews  land-use plans for the beneficial development of urban areas.",31224.941967084294,32811.456283611056,37472.539287214371,0.68276913987188226,37044.927577164621,39344.489465941086,45058.26469104641,0.68730720194041883,44188,46817,53369,0.69,51885.185608574,54858.254436036914,62116.046424884284,0.68688879905466715,59076.69676642141,62641.475850850067,70682.460777115368,0.69084753405062493]
["Expert","Utility Rate Analyst","Monitors, reviews, and evaluates service rates and charges for various public utilities. Calculates cost-of-service and performs related rate analysis. Ensures filings comply with the Federal Energy Regulatory Commission requirements.",66501.749083966308,74115.050375892373,80256.069733500291,0.70552811120094505,78896.943384786879,88871.971837425212,96502.647055706257,0.71021744200509951,94110,105751,114302,0.71299999999999997,110503.18678426041,123914.71612588034,133035.81364569551,0.70978509235648946,125819.40646075674,141495.58307245755,151382.76212306469,0.71387578518564576]
["Expert","Utility System Planner/Operator/Manager","Familiar with the proper operation of utility plant equipment including controls, operation, repairs, and perventive maintenance. Equipment may include bioenergy, hydro, nuclear, solar, thermal or wind generation or gas storage and transport.",62363,73000,88700,0.67700000000000005,76508,86945,98072,0.66700000000000004,91474,101143,114035,0.66900000000000004,102332,110322,119359,0.69299999999999995,111378,122333,136116,0.67100000000000004]
["Expert","Wildfire Scientist","Uses analysis software to analyze wildfire risks and likely paths. Reviews approaches to preventing, controlling, or mitigating wildfire damage.",45113.215014542307,54156.388948533167,66506.753382767987,0.71047571366378481,53521.821905977733,64939.375323101987,79969.998155032255,0.71519792897568224,63842,77273,94720,0.71799999999999997,74962.750511962091,90545.355213616436,110244.37252646741,0.71476254742210299,85352.911988817679,103391.81842968873,125448.15688523988,0.71888192673673723]
["Legal","Attorney ","Attorney authorized by the California Bar to practice law in California. Higher experience levels should have experience with areas of law and procedures relevant to CPUC matters, such as environmental law or utility regulation.",99142,114133,131093,0.69099999999999995,128131,151806,177380,0.70099999999999996,175932,202695,229834,0.69199999999999995,201472,229400,258979,0.65200000000000002,239944,267755,289244,0.624]
["Legal","Legal Director","Oversees the legal work of the organization, including providing strategic direction. Alternate title may be General Counsel. Responsible for coordinating and supervising a legal team. Participates in the most complex legal actions. Oversees all legal operations including case assignment, hiring, supervision and professional development of the legal staff, as well as budgeting.",149442.73619459706,170611.58304277132,195346.0345480025,0.6431883201691645,177297.21788107819,204581.76478886517,234890.76263410365,0.64746330617575698,211484,243437,278215,0.65,248322.7707351241,285249.56501154532,323813.74685864797,0.64706915852975899,282741.38089413114,325720.42114410124,368470.85058938991,0.65079840164189307]
["Legal","Paralegal ","Assists and supports attorneys with research. Researches and analyzes law sources such as statutes, recorded judicial decisions, legal articles, treaties, constitutions, and legal codes. Prepares legal documents. May direct the work of clerical or other support staff. May be responsible for the creation and administration of legal databases. Has complete understanding of technical legal terminology.",47903,54169,61163,0.67400000000000004,55828,62992,71269,0.68200000000000005,67084,74975,83437,0.69,74900,84554,94720,0.67200000000000004,84115.231686259664,94957,106373.76161979328,0.67949999999999999]
["Legal","Paralegal Manager","Often the most senior Paralegal individual. Validates and oversees the preparation of legal documents. Provides research utilizing databases and legal libraries. Coordinates with attorneys on special requests or highly complex projects. Note that supervisory and training support is not reimbursable.",61595.557989608875,70345.906434732955,82679.156789285043,0.66495777100565934,73076.292253976397,84352.360065038447,99416.249923453463,0.66937744884632111,87167,100373,117753,0.67200000000000004,102350.77337608785,117612.99469227702,137052.42396652364,0.66896996081845861,116537.03329045567,134299.78118156595,155953.3025518122,0.67282542446669569]
["Legal","Paralegal Supervisor","Reviews prepared legal documents to ensure the work is complete and accurate. Prepares complex documents. Note that supervisory and training time is not reimbursable.",47198.505223306362,52554.95832273375,69467.680103789244,0.6144922258846941,55995.78726490352,63019.086572655026,83530.317857521382,0.61857648174637703,66793,74988,98937,0.621,78427.790403582039,87867.88524787013,115152.52834302267,0.61819991914920047,89298.221397655143,100334.4723306394,131033.19571109563,0.62176278064556245]
["School","Assistant School Principal","Assists the school principal in the management of education and teaching programs for an assigned school. Coordinates school activities and ensures that budgetary guidelines are met. May help in developing the curriculum, staffing, reviewing faculty performance, and creating an atmosphere conducive to scholarly pursuits. ",52140.734881081946,59319.513421296535,69450.828730465902,0.71443379563405651,61859.194150815747,71130.520716774961,83510.055189069943,0.71918231855214854,73787,84640,98913,0.72199999999999998,86640.087591650445,99177.705864668053,115124.59480268657,0.71874451147459384,98648.778498776519,113248.91633415104,131001.40986053349,0.7228868399776105]
["School","Public School Teacher","Prepares lesson plans and instructs students in an assigned school. Develops and implements grade appropriate course work to meet the academic of children in a K-12 classroom setting. Evaluates and monitors student's performance. Assesses and documents students' progress. Participates in development and implementation of Individual Education Plans for specific students. May participate in implementing special programs for students. May supervise teaching assistants. ",34256.421125199435,38919.319698859159,45016.337411628003,0.69365386529012962,40641.441094545728,46668.4791640353,54129.185934476169,0.69826427327570095,48478,55532,64113,0.70099999999999996,56922.468270400343,65070.136602986138,74620.961315344233,0.69783920019901702,64812.168594246796,74302.207252694658,84911.926545432696,0.70186104546302619]
["School","School Principal","Directs and oversees education and teaching programs for an assigned school. Responsibilities include developing the curriculum, staffing departments, reviewing faculty performance, and creating an atmosphere conducive to scholarly pursuits. Ensures all school activities are within budgetary guidelines. ",64424.2318986846,72339.109366800156,81532.561262743024,0.72136043908203218,76432.199855392842,86742.426238461267,98037.544190903136,0.72615500031096436,91170,103217,116120,0.72899999999999998,107051.06300202977,120945.47809822121,135151.77932615494,0.72571294856645274,121888.80338993935,138105.0732190698,153790.5403031467,0.72989543814913849]
["School","School Superintendent","Directs and manages a school district. Oversees all aspects of the district's operational policies, objectives, initiatives. Responsible for the attainment of short- and long-term financial and operational goals for the school system. ",90032.811080524349,109316.38781222816,132149.17174215984,0.73917180794825521,106813.93642180105,131082.18762241406,158900.69027407587,0.74408475340506219,127410,155978,188209,0.747,149603.77248095439,182768.66972305285,219055.9872131958,0.74363178680266151,170339.50246695374,208699.66294858474,249265.96451873006,0.74791754773306784]

{"sheet":"Config_Education","index":9,"n_rows":78,"n_cols":6,"rows_kept":78,"cut":false,"hidden":true,"merged":[]}
["CPUC Role","Education 1","Education 2","Education 3","Education 4","Education V"]
["Housing Program Manager","Bachelor's Degree","Bachelor's Degree","Bachelor's Degree","Bachelor's Degree","Bachelor's Degree"]
["Community Development Specialist","Bachelor's Degree","Bachelor's Degree","Bachelor's Degree","Bachelor's Degree","Bachelor's Degree"]
["Administrative Analyst","Bachelor's","Bachelor's","Bachelor's","Bachelor's","Bachelor's"]
["Program Coordinator","Bachelor's","Bachelor's","Bachelor's","Bachelor's","Bachelor's"]
["Community Development Manager","Bachelor's Degree","Bachelor's Degree","Bachelor's Degree","Bachelor's Degree","Bachelor's Degree"]
["Community Development Senior Specialist","Bachelor's","Bachelor's","Bachelor's","Bachelor's","Bachelor's"]
["Program Manager","Bachelor's","Bachelor's","Bachelor's","Bachelor's","Bachelor's"]
["Community Development Program Director","Bachelor's","Bachelor's","Bachelor's","Bachelor's","Bachelor's"]
["Executive Director","Bachelor's","Bachelor's","Bachelor's","Bachelor's","Bachelor's"]
["Advocate - Not Otherwise Classified","Bachelor's","Bachelor's","Bachelor's","Bachelor's","Bachelor's"]
["Fire Fighter","Bachelor's","Bachelor's","Bachelor's","Bachelor's","Bachelor's"]
["Urban Planner","Bachelor's","Bachelor's","Bachelor's","Bachelor's","Bachelor's"]
["Fire Prevention Engineer","Bachelor's","Bachelor's","Bachelor's","Bachelor's","Bachelor's"]
["Biologist","Bachelor's Degree","Master's Degree or MBA","Master's Degree or MBA","JD, MD, PhD or Equivalent","JD, MD, PhD or Equivalent"]
["Ecologist","Bachelor's Degree","Master's Degree or MBA","Master's Degree or MBA","JD, MD, PhD or Equivalent","JD, MD, PhD or Equivalent"]
["Fire Inspector Supervisor","Bachelor's","Bachelor's","Bachelor's","Bachelor's","Bachelor's"]
["Wildfire Scientist","Bachelor's","Bachelor's","Bachelor's","Bachelor's","Bachelor's"]
["Accountant","Bachelor's Degree","Bachelor's Degree","Bachelor's Degree","Bachelor's Degree","Bachelor's Degree"]
["Statistician ","Master's Degree or MBA","Master's Degree or MBA","Master's Degree or MBA","JD, MD, PhD or Equivalent","JD, MD, PhD or Equivalent"]
["Field Service Engineer ","Bachelor's Degree","Bachelor's Degree","Bachelor's Degree","Bachelor's Degree","Bachelor's Degree"]
["Env., Health, and Safety Engineer ","Bachelor's Degree","Bachelor's Degree","Bachelor's Degree","Master's Degree or MBA","Bachelor's Degree"]
["Structural Engineer ","Master's Degree or MBA","Master's Degree or MBA","Master's Degree or MBA","Master's Degree or MBA","Master's Degree or MBA"]
["Certified Depreciation Professional","Bachelor's Degree","Bachelor's Degree","Bachelor's Degree","Bachelor's Degree","Bachelor's Degree"]
["Cost Accountant","Bachelor's Degree","Bachelor's Degree","Bachelor's Degree","Bachelor's Degree","Bachelor's Degree"]
["Expert - Social Work","Master's Degree or MBA","Master's Degree or MBA","Master's Degree or MBA","Master's Degree or MBA","Master's Degree or MBA"]
["Sociologist","JD, MD, PhD or Equivalent","JD, MD, PhD or Equivalent","JD, MD, PhD or Equivalent","JD, MD, PhD or Equivalent","JD, MD, PhD or Equivalent"]
["Energy & Resources Expert","Bachelor's","Bachelor's","Bachelor's","Bachelor's","Bachelor's"]
["Hydrologist","Master's Degree or MBA","Master's Degree or MBA","Master's Degree or MBA","Master's Degree or MBA","Master's Degree or MBA"]
["Climate Scientist","Master's Degree or MBA","Master's Degree or MBA","Master's Degree or MBA","Master's Degree or MBA","Master's Degree or MBA"]
["Environmental Engineer ","Master's Degree or MBA","Master's Degree or MBA","Master's Degree or MBA","Master's Degree or MBA","Master's Degree or MBA"]
["Program Design/Evaluation Specialist","Bachelor's Degree","Bachelor's Degree","Master's Degree or MBA","Master's Degree or MBA","Master's Degree or MBA"]
["Geologist","Bachelor's Degree","Bachelor's Degree","Master's Degree or MBA","Master's Degree or MBA","Master's Degree or MBA"]
["Cost Estimation Analyst","Bachelor's","Bachelor's","Bachelor's","Bachelor's","Bachelor's"]
["Geotechnical Engineer","Master's Degree or MBA","Master's Degree or MBA","Master's Degree or MBA","Master's Degree or MBA","Master's Degree or MBA"]
["Software Engineer ","Bachelor's Degree","Bachelor's Degree","Bachelor's Degree","Bachelor's Degree","Bachelor's Degree"]
["Project Engineer - Construction","Bachelor's","Bachelor's","Bachelor's","Bachelor's","Bachelor's"]
["Communication Specialist","Bachelor's Degree","Bachelor's Degree","Bachelor's Degree","Master's Degree or MBA","Bachelor's Degree"]
["Equipment Engineer ","Bachelor's Degree","Bachelor's Degree","Bachelor's Degree","Bachelor's Degree","Bachelor's Degree"]
["Telecommunications Engineer ","Bachelor's Degree","Bachelor's Degree","Bachelor's Degree","Bachelor's Degree","Bachelor's Degree"]
["Network Engineer ","Bachelor's Degree","Bachelor's Degree","Bachelor's Degree","Bachelor's Degree","Bachelor's Degree"]
["Reliability Engineer ","Bachelor's Degree","Bachelor's Degree","Master's Degree or MBA","Master's Degree or MBA","Master's Degree or MBA"]
["Design Engineer","Bachelor's Degree","Bachelor's Degree","Bachelor's Degree","Bachelor's Degree","Bachelor's Degree"]
["Process Engineer ","Bachelor's Degree","Bachelor's Degree","Bachelor's Degree","Bachelor's Degree","Bachelor's Degree"]
["Systems Engineer ","Bachelor's Degree","Bachelor's Degree","Bachelor's Degree","Bachelor's Degree","Bachelor's Degree"]
["Engineer ","Bachelor's Degree","Bachelor's Degree"," Master's Degree or MBA","Bachelor's Degree","Master's Degree or MBA"]
["Civil Engineer","Bachelor's Degree","Bachelor's Degree","Bachelor's Degree","Bachelor's Degree","Bachelor's Degree"]
["Hardware Engineer ","Bachelor's Degree","Master's Degree or MBA","Master's Degree or MBA","Master's Degree or MBA","Master's Degree or MBA"]
["Mechanical Engineer ","Bachelor's Degree","Bachelor's Degree","Bachelor's Degree","Bachelor's Degree","Bachelor's Degree"]
["Electrical Controls Engineer ","Bachelor's","Bachelor's","Bachelor's","Bachelor's","Bachelor's Degree"]
["Utility System Planner/Operator/Manager","Bachelor's","Bachelor's","Bachelor's","Bachelor's","Bachelor's"]
["Telecommunications Economist","Bachelor's Degree","Bachelor's Degree","Bachelor's Degree","Bachelor's Degree","Master's Degree or MBA"]
["Electrical Engineer ","Bachelor's Degree","Bachelor's Degree","Bachelor's Degree","Bachelor's Degree","Bachelor's Degree"]
["Regulatory Affairs Specialist","Bachelor's Degree","Master's Degree or MBA","Bachelor's Degree","Master's Degree or MBA","Master's Degree or MBA"]
["Project Engineer ","Bachelor's Degree","Bachelor's Degree","Bachelor's Degree","Master's Degree or MBA","Bachelor's Degree"]
["Utility Rate Analyst","Bachelor's Degree","Bachelor's Degree","Bachelor's Degree","Bachelor's Degree","Bachelor's Degree"]
["Chemical Engineer","Bachelor's Degree","Bachelor's Degree","Bachelor's Degree","Bachelor's Degree","Bachelor's Degree"]
["Nuclear Engineer ","Bachelor's Degree","Master's Degree or MBA","Master's Degree or MBA","Master's Degree or MBA","JD, MD, PhD or Equivalent"]
["Economist","Bachelor's Degree","Bachelor's Degree","Bachelor's Degree","Bachelor's Degree","Master's Degree or MBA"]
["Health Scientist","Master's Degree or MBA","Master's Degree or MBA","Master's Degree or MBA","Master's Degree or MBA","Master's Degree or MBA"]
["Physicist","JD, MD, PhD or Equivalent","JD, MD, PhD or Equivalent","JD, MD, PhD or Equivalent","JD, MD, PhD or Equivalent","JD, MD, PhD or Equivalent"]
["IT Project Engineer ","Bachelor's Degree","Bachelor's Degree","Bachelor's Degree","Bachelor's Degree","Bachelor's Degree"]
["Drilling Engineer ","Bachelor's Degree","Bachelor's Degree","Bachelor's Degree","Bachelor's Degree","Master's Degree or MBA"]
["Professor - Law","JD, MD, PhD or Equivalent","JD, MD, PhD or Equivalent","JD, MD, PhD or Equivalent","JD, MD, PhD or Equivalent","JD, MD, PhD or Equivalent"]
["Public Policy Analyst","Bachelor's Degree","Bachelor's Degree","Bachelor's Degree","Master's Degree or MBA","Bachelor's Degree"]
["Reservoir Engineering Manager","Master's Degree or MBA","Master's Degree or MBA","Master's Degree or MBA","Master's Degree or MBA","Master's Degree or MBA"]
["Reservoir Engineer ","Bachelor's Degree","Master's Degree or MBA","Master's Degree or MBA","Master's Degree or MBA","Master's Degree or MBA"]
["Top Economic Executive","JD, MD, PhD or Equivalent","JD, MD, PhD or Equivalent","JD, MD, PhD or Equivalent","JD, MD, PhD or Equivalent","JD, MD, PhD or Equivalent"]
["Expert - Not Otherwise Classified","Bachelor's Degree","Bachelor's Degree","Bachelor's Degree","Bachelor's Degree","Bachelor's Degree"]
["Legal Director","Bachelor's Degree","Bachelor's Degree","Bachelor's Degree","Bachelor's Degree","Bachelor's Degree"]
["Paralegal Supervisor","Bachelor's Degree","Bachelor's Degree","Bachelor's Degree","Bachelor's Degree","Bachelor's Degree"]
["Paralegal ","Bachelor's Degree","Bachelor's Degree","Bachelor's Degree","Bachelor's Degree","Bachelor's Degree"]
["Paralegal Manager","Bachelor's Degree","Bachelor's Degree","Bachelor's Degree","Bachelor's Degree","Bachelor's Degree"]
["Attorney ","JD, MD, PhD or Equivalent","JD, MD, PhD or Equivalent","JD, MD, PhD or Equivalent","JD, MD, PhD or Equivalent","JD, MD, PhD or Equivalent"]
["Public School Teacher","Master's Degree or MBA","Master's Degree or MBA","Master's Degree or MBA","Master's Degree or MBA","Master's Degree or MBA"]
["Assistant School Principal","Master's Degree or MBA","Master's Degree or MBA","Master's Degree or MBA","Master's Degree or MBA","Master's Degree or MBA"]
["School Principal","Master's Degree or MBA","Master's Degree or MBA","Master's Degree or MBA","Master's Degree or MBA","Master's Degree or MBA"]
["School Superintendent","Master's Degree or MBA","Master's Degree or MBA","Master's Degree or MBA","Master's Degree or MBA","Master's Degree or MBA"]