{"text_format":"1","workbook":"xlsx","n_sheets":10,"sheets":["Table 1-Revenue Requirement","Table 2-Residential Avg Usage","Table 3 Inputs","Table 3-Current Bill","Table 4-Impact to Avg Bill","EXAMPLES","Table Ex2-Residential Avg Usa","Table Ex3 Inputs","Table Ex3-Current Bill","Table Ex4-Impact to Avg Bill"],"not_rendered":{"charts":0,"images":0,"macros":1,"external_links":1,"defined_names":56,"comments":2,"pivot_tables":0},"unopened":[],"bounds":{"document_bytes":16777216,"sheet_cells":100000,"rows_first":2000,"rows_last":500,"rows_between":2000,"halvings":0,"cell_chars":16384,"cell_head_chars":4096},"cells_cut":0,"cells_raw":0,"read":"whole","date_system":"1900"}

{"sheet":"Table 1-Revenue Requirement","index":0,"n_rows":47,"n_cols":12,"rows_kept":47,"cut":false,"hidden":false,"merged":[[3,4,3,6],[2,8,2,10],[3,8,3,10],[6,7,6,11],[7,12,8,12],[7,10,8,10],[7,11,8,11],[2,7,3,7],[2,11,3,11],[2,4,2,6],[7,0,8,0],[7,4,8,4],[7,7,8,7],[7,8,8,8],[7,9,8,9],[7,5,8,5],[7,6,8,6]]}
[]
[]
["Company: ",null,"Filing Date:",null,"Company-Wide Number of Connections \n(As of 12/31/20XX):",null,null,null,"Number of Connections in Ratemaking Area\n (As of 12/31/20XX):"]
["Ratemaking Area:",null,"Filing Year:",{"$f":"YEAR(TODAY())","v":2021},{"$f":"\"(As of 12/31/\"&D4-1&\")\"","v":"(As of 12/31/2020)"},null,null,null,{"$f":"\"(As of 12/31/\"&D4-1&\")\"","v":"(As of 12/31/2020)"}]
[]
[]
[null,null,null,null,null,null,null,"Annual Revenue Requirements (End of Year)"]
[null,"Latest Adopted Company-Wide Revenue Requirement \n(Adopted on XX/XX/XXX Per Filing #)",null,"Latest Adopted Ratemaking Area Revenue Requirement \n(Adopted on XX/XX/XXX Per Filing #)",null,null,null,"Year 1","Year 2","Year 3","Year 4","Year 5"]
[null,"$",null,"$"]
["Status","Proceedings ","Footnote Reference","Description of Filing","Revenue Recovery Mechanism ","Effective Date or Proposed Effective Date","Expiration Date or Proposed Expiration Date",{"$f":"D4","v":2021},{"$f":"H10+1","v":2022},{"$f":"I10+1","v":2023},{"$f":"J10+1","v":2024},{"$f":"K10+1","v":2025}]
{"$rows_left_out":38}
{"sheet":"Table 2-Residential Avg Usage","index":1,"n_rows":12,"n_cols":7,"rows_kept":12,"cut":false,"hidden":false,"merged":[[17,10,17,11],[17,12,17,13]]}
[]
[null,"Company: ",{"$f":"IF(ISBLANK('Table 1-Revenue Requirement'!B3),\"\",'Table 1-Revenue Requirement'!B3)","v":""},null,"Filing Date:",{"$f":"IF(ISBLANK('Table 1-Revenue Requirement'!D3),\"\",'Table 1-Revenue Requirement'!D3)","v":""}]
[null,"Ratemaking Area:",{"$f":"IF(ISBLANK('Table 1-Revenue Requirement'!B4),\"\",'Table 1-Revenue Requirement'!B4)","v":""},null,"Filing Year:",{"$f":"IF(ISBLANK('Table 1-Revenue Requirement'!D4),\"\",'Table 1-Revenue Requirement'!D4)","v":2021}]
[]
[null,null,"All Residential Customers","Non-Customer Assistance Program (CAP) Customers","CAP Customers","Tier 1 Usage (up to XX Units/month) for Non-CAP Customers","Tier 1 Usage (up to XX Units/month) for CAP Customers"]
[null,"Total Residential Usage (in units used by service area) in 12 Months (from last GRC filing)",{"$f":"IF(AND(ISBLANK(D6),ISBLANK(E6)),\"\",D6+E6)","v":18000000},15000000,3000000,"N/A","N/A"]
[null,"Total Number of Residential Connections (from last GRC filing)",{"$f":"IF(AND(ISBLANK(D7),ISBLANK(E7)),\"\",D7+E7)","v":121000},100000,21000,"N/A","N/A"]
[null,"Residential Average Annual Usage (in units used by service area) Per Connection, or Tier 1 Annual Usage Amount",{"$f":"IFERROR(C6/C7,\"-\")","v":148.7603305785124},{"$f":"IFERROR(D6/D7,\"-\")","v":150},{"$f":"IFERROR(E6/E7,\"-\")","v":142.85714285714286},{"$f":"IFERROR('Table 3 Inputs'!I7*bills,\"-\")","v":144},{"$f":"MIN(tier1break*12,LIRA_Avg_Usage)","v":142.85714285714286}]
[null,"Current Residential Average Annual Bill","N/A",{"$f":"IFERROR('Table 3-Current Bill'!C24,\"-\")","v":318.12},{"$f":"IFERROR('Table 3-Current Bill'!D24,\"-\")","v":213.30428571428573},{"$f":"'Table 3-Current Bill'!E24","v":304.42},{"$f":"'Table 3-Current Bill'!F24","v":213.30428571428573}]
[]
{"$rows_left_out":3}
{"sheet":"Table 3 Inputs","index":2,"n_rows":30,"n_cols":12,"rows_kept":30,"cut":false,"hidden":false,"merged":[]}
[null,null,"Quantity Basis","CCF"]
[]
[null,null,"Variable Charge Calculation",null,null,null,null,null,"Non-CAP Average Use","CAP Average Use"]
[null,null,"Number of Tiers",2,null,null,null,null,{"$f":"IFERROR(Non_LIRA_Avg_Usage/bills,0)","v":12.5},{"$f":"IFERROR(LIRA_Avg_Usage/bills,0)","v":11.904761904761905}]
[null,null,null,"Tier Start",{"$f":"\"Tier End \n(\"&D1&\")\"","v":"Tier End \n(CCF)"},"Tier Width","Non-CAP Tier Rate","CAP Tier Rate","Non-CAP Average Consumption  In Tier","CAP Avg Consumption  in Tier","Average Monthly Bill in Tier","Average CAP Monthly Bill in Tier"]
[null,null,null,null,null,null,"(A)","(B)","(C)","(D)","(E)  = (A) * (C) ","(F) = (B) * (D)"]
[null,1,"Tier 1",{"$f":"IF(D4=1,\"Uniform Rate\",\"0 \"&D1&\" to\")","v":"0 CCF to"},12,{"$f":"IF(D4=1,\"\",E7)","v":12},1,0.9,{"$f":"IF(B7<=$D$4,MIN($F7,I$4),\"\")","v":12},{"$f":"IF(B7<=$D$4,MIN($F7,J$4),\"\")","v":11.904761904761905},{"$f":"IF($B7<=$D$4,I7*G7,\"\")","v":12},{"$f":"H7*J7","v":10.714285714285715}]
[null,2,{"$f":"IF($B8<=$D$4,\"Tier \"&B8,\"\")","v":"Tier 2"},{"$f":"IF($B8<$D$4,E7&\" \"&$D$1&\" to\",IF($B8=D$4,\"Over \"&E7&\" \"&$D$1,\"\"))","v":"Over 12 CCF"},null,{"$f":"IF($B8<$D$4,E8-E7,\"\")","v":""},2,2,{"$f":"IF(B8<=$D$4,MIN(I$4-SUM(I$7:I7),$F8),\"\")","v":0.5},{"$f":"IF(B8<=$D$4,MIN(J$4-SUM(J$7:J7),$F8),\"\")","v":0},1,{"$f":"H8*J8","v":0}]
[null,3,"","",null,"",null,null,{"$f":"IF(B9<=$D$4,MIN(I$4-SUM(I$7:I8),$F9),\"\")","v":""},{"$f":"IF(B9<=$D$4,MIN(J$4-SUM(J$7:J8),$F9),\"\")","v":""},{"$f":"IF($B9<=$D$4,I9*G9,\"\")","v":""},{"$f":"IF($B9<=$D$4,J9*IF(#REF!=\"percentage\",G9*(1-#REF!),H9),\"\")","v":""}]
[null,4,"","",null,"",null,null,{"$f":"IF(B10<=$D$4,MIN(I$4-SUM(I$7:I9),$F10),\"\")","v":""},{"$f":"IF(B10<=$D$4,MIN(J$4-SUM(J$7:J9),$F10),\"\")","v":""},"",{"$f":"IF($B10<=$D$4,J10*IF(#REF!=\"percentage\",G10*(1-#REF!),H10),\"\")","v":""}]
{"$rows_left_out":21}
{"sheet":"Table 3-Current Bill","index":3,"n_rows":79,"n_cols":7,"rows_kept":79,"cut":false,"hidden":false,"merged":[[4,1,4,6],[26,1,26,6],[64,1,64,6],[65,2,65,3],[65,4,65,5],[49,2,49,3],[49,4,49,5],[56,2,56,3],[56,4,56,5],[5,2,5,3],[5,4,5,5],[27,2,27,3],[27,4,27,5],[48,1,48,6]]}
[]
[null,"Company: ",{"$f":"IF(ISBLANK('Table 1-Revenue Requirement'!B3),\"\",'Table 1-Revenue Requirement'!B3)","v":""},null,null,"Filing Date:",{"$f":"IF(ISBLANK('Table 1-Revenue Requirement'!D3),\"\",'Table 1-Revenue Requirement'!D3)","v":""}]
[null,"Ratemaking Area:",null,null,null,"Filing Year:",{"$f":"IF(ISBLANK('Table 1-Revenue Requirement'!D4),\"\",'Table 1-Revenue Requirement'!D4)","v":2021}]
[]
[null,{"$f":"\"Average Annual Bill Calculation for Residential \"&'Table 3 Inputs'!D20&\" Meter as of the filing date:\"","v":"Average Annual Bill Calculation for Residential 5/8\" x 3/4\" Meter as of the filing date:"}]
[null,null,"Average Usage",null,"Tier 1 Usage",null,"Appropriate Rate"]
[null,null,"Non-CAP","CAP","Non-CAP","CAP"]
[null,"Usage (Ccfs/Year)",{"$f":"Non_LIRA_Avg_Usage","v":150},{"$f":"LIRA_Avg_Usage","v":142.85714285714286},{"$f":"Non_LIRA_Tier_1_Usage","v":144},{"$f":"LIRA_Tier_1_Usage","v":142.85714285714286}," (Incl. Start and Expiration Date as Appropriate)"]
[]
[null,"Service Charge",{"$f":"'Table 3 Inputs'!D22*bills","v":120},{"$f":"'Table 3 Inputs'!E22*bills","v":120},{"$f":"'Table 3 Inputs'!D22*bills","v":120},{"$f":"'Table 3 Inputs'!E22*bills","v":120},"$XX.XX per month or bimonthly"]
{"$rows_left_out":70}
{"sheet":"Table 4-Impact to Avg Bill","index":4,"n_rows":155,"n_cols":13,"rows_kept":155,"cut":false,"hidden":false,"merged":[[3,8,3,12],[3,1,3,7],[40,1,40,7],[77,1,77,7],[114,1,114,7]]}
[null,"Company: ",{"$f":"IF(ISBLANK('Table 1-Revenue Requirement'!B3),\"\",'Table 1-Revenue Requirement'!B3)","v":""},null,null,"Filing Date:",{"$f":"IF(ISBLANK('Table 1-Revenue Requirement'!D3),\"\",'Table 1-Revenue Requirement'!D3)","v":""}]
[null,"Ratemaking Area:",{"$f":"IF(ISBLANK('Table 1-Revenue Requirement'!B4),\"\",'Table 1-Revenue Requirement'!B4)","v":""},null,null,"Filing Year:",{"$f":"IF(ISBLANK('Table 1-Revenue Requirement'!D4),\"\",'Table 1-Revenue Requirement'!D4)","v":2021}]
[]
[null,"Non-CAP Residential Customers - Average Usage",null,null,null,null,null,null,"Annual Bill Impacts \n(For Both Non-CAP and CAP Customers at Average and Tier 1 Usage Amounts)"]
[null,"Status","Proceedings ","Footnote Reference","Description of Filing","Revenue Recovery Mechanism ","Effective Date or Proposed Effective Date","Expiration Date or Proposed Expiration Date",{"$f":"G2","v":2021},{"$f":"I5+1","v":2022},{"$f":"J5+1","v":2023},{"$f":"K5+1","v":2024},{"$f":"L5+1","v":2025}]
[null,"Baseline bill (incl. service & quantity charges)","D.XX-XX-XXX/A. or AL",null,null,null,null,null,{"$f":"Baseline_Bill_Non_LIRA_Avg","v":276},{"$f":"Baseline_Bill_Non_LIRA_Avg","v":276},{"$f":"Baseline_Bill_Non_LIRA_Avg","v":276},{"$f":"Baseline_Bill_Non_LIRA_Avg","v":276},{"$f":"Baseline_Bill_Non_LIRA_Avg","v":276}]
[null,"Active",{"$f":"IF(ISBLANK('Table 1-Revenue Requirement'!B12),\"\",'Table 1-Revenue Requirement'!B12)","v":"A.18-XX-XX; D.19-XX-XXX"},{"$f":"IF(ISBLANK('Table 1-Revenue Requirement'!C12),\"\",'Table 1-Revenue Requirement'!C12)","v":""},{"$f":"IF(ISBLANK('Table 1-Revenue Requirement'!D12),\"\",'Table 1-Revenue Requirement'!D12)","v":"(e.g. Bal. Acct., IRMA, WRAM)"},{"$f":"IF(ISBLANK('Table 1-Revenue Requirement'!E12),\"\",'Table 1-Revenue Requirement'!E12)","v":"(e.g., amortization of balancing account, GRC base rate increase, etc.)"},{"$f":"IF(ISBLANK('Table 1-Revenue Requirement'!F12),\"\",'Table 1-Revenue Requirement'!F12)","v":""},{"$f":"IF(ISBLANK('Table 1-Revenue Requirement'!G12),\"\",'Table 1-Revenue Requirement'!G12)","v":""}]
[null,"Active",{"$f":"IF(ISBLANK('Table 1-Revenue Requirement'!B13),\"\",'Table 1-Revenue Requirement'!B13)","v":"A.18-XX-XXX; D.19-XX-XXX"},{"$f":"IF(ISBLANK('Table 1-Revenue Requirement'!C13),\"\",'Table 1-Revenue Requirement'!C13)","v":""},{"$f":"IF(ISBLANK('Table 1-Revenue Requirement'!D13),\"\",'Table 1-Revenue Requirement'!D13)","v":""},{"$f":"IF(ISBLANK('Table 1-Revenue Requirement'!E13),\"\",'Table 1-Revenue Requirement'!E13)","v":""},{"$f":"IF(ISBLANK('Table 1-Revenue Requirement'!F13),\"\",'Table 1-Revenue Requirement'!F13)","v":""},{"$f":"IF(ISBLANK('Table 1-Revenue Requirement'!G13),\"\",'Table 1-Revenue Requirement'!G13)","v":""}]
[null,"Active",{"$f":"IF(ISBLANK('Table 1-Revenue Requirement'!B14),\"\",'Table 1-Revenue Requirement'!B14)","v":"AL # XXXX"},{"$f":"IF(ISBLANK('Table 1-Revenue Requirement'!C14),\"\",'Table 1-Revenue Requirement'!C14)","v":""},{"$f":"IF(ISBLANK('Table 1-Revenue Requirement'!D14),\"\",'Table 1-Revenue Requirement'!D14)","v":""},{"$f":"IF(ISBLANK('Table 1-Revenue Requirement'!E14),\"\",'Table 1-Revenue Requirement'!E14)","v":""},{"$f":"IF(ISBLANK('Table 1-Revenue Requirement'!F14),\"\",'Table 1-Revenue Requirement'!F14)","v":""},{"$f":"IF(ISBLANK('Table 1-Revenue Requirement'!G14),\"\",'Table 1-Revenue Requirement'!G14)","v":""}]
[null,"Active",{"$f":"IF(ISBLANK('Table 1-Revenue Requirement'!B15),\"\",'Table 1-Revenue Requirement'!B15)","v":"AL # XXXX"},{"$f":"IF(ISBLANK('Table 1-Revenue Requirement'!C15),\"\",'Table 1-Revenue Requirement'!C15)","v":""},{"$f":"IF(ISBLANK('Table 1-Revenue Requirement'!D15),\"\",'Table 1-Revenue Requirement'!D15)","v":""},{"$f":"IF(ISBLANK('Table 1-Revenue Requirement'!E15),\"\",'Table 1-Revenue Requirement'!E15)","v":""},{"$f":"IF(ISBLANK('Table 1-Revenue Requirement'!F15),\"\",'Table 1-Revenue Requirement'!F15)","v":""},{"$f":"IF(ISBLANK('Table 1-Revenue Requirement'!G15),\"\",'Table 1-Revenue Requirement'!G15)","v":""}]
{"$rows_left_out":146}
{"sheet":"EXAMPLES","index":5,"n_rows":3,"n_cols":1,"rows_kept":3,"cut":false,"hidden":false,"merged":[]}
["The next three sheets present hypothetical examples included to assist you with filling out the template."]
["Tables Ex2 and Ex3 (i.e., example tables 2 and 3) depict how named cells carry through and prepopulate across tables."]
["Tables Ex3 and Ex4 depict how to depict an escalation year request, as well as temporary surcharges (using two hypothetical surcharges)."]

{"sheet":"Table Ex2-Residential Avg Usa","index":6,"n_rows":12,"n_cols":7,"rows_kept":12,"cut":false,"hidden":false,"merged":[[17,10,17,11],[17,12,17,13]]}
[]
[null,"Company: ",null,null,"Filing Date:","2019-09-01"]
[null,"Ratemaking Area:",null,null,"Filing Year:",2019]
[]
[null,null,"All Residential Customers","Non-Customer Assistance Program (CAP) Customers","CAP Customers","Tier 1 Usage (up to 12 CCFs/month) for Non-CAP Customers","Tier 1 Usage (up to 12 CCFs/month) for CAP Customers"]
[null,"Total Residential CCFs Used in 12 Months (for last calendar year)",{"$f":"D6+E6","v":18000000},15000000,3000000,"N/A","N/A"]
[null,"Total Number of Residential Connections (at the end of the last calendar year)",{"$f":"D7+E7","v":121000},100000,21000,"N/A","N/A"]
[null,"Residential Average Annual Usage (CCFs) Per Connection, or Tier 1 Annual Usage Amount",{"$f":"C6/C7","v":148.7603305785124},{"$f":"D6/D7","v":150},{"$f":"E6/E7","v":142.85714285714286},{"$f":"12*12","v":144},{"$f":"MIN(LIRA_Avg_Usage_Exp,'Table Ex3 Inputs'!F7*12)","v":142.85714285714286}]
[null,"Current Residential Average Annual Bill","N/A",{"$f":"'Table Ex3-Current Bill'!C22","v":318.12},{"$f":"'Table Ex3-Current Bill'!D22","v":213.30428571428573},{"$f":"'Table Ex3-Current Bill'!E22","v":304.42},{"$f":"'Table Ex3-Current Bill'!F22","v":213.30428571428573}]
[]
{"$rows_left_out":3}
{"sheet":"Table Ex3 Inputs","index":7,"n_rows":29,"n_cols":12,"rows_kept":29,"cut":false,"hidden":false,"merged":[]}
[null,null,"Quantity Basis","CCF"]
[]
[null,null,"Variable Charge Calculation",null,null,null,null,null,"Non-CAP Average Use","CAP Average Use"]
[null,null,"Number of Tiers",2,null,null,null,null,{"$f":"IFERROR(Non_LIRA_Avg_Usage/bills,0)","v":12.5},{"$f":"IFERROR(LIRA_Avg_Usage/bills,0)","v":11.904761904761905}]
[null,null,null,"Tier Start",{"$f":"\"Tier End \n(\"&D1&\")\"","v":"Tier End \n(CCF)"},"Tier Width","Non-CAP Tier Rate","CAP Tier Rate","Non-CAP Average Consumption  In Tier","CAP Avg Consumption  in Tier","Average Monthly Bill in Tier","Average CAP Monthly Bill in Tier"]
[null,1,null,null,null,null,"(A)","(B)","(C)","(D)","(E)  = (A) * (C) ","(F) = (B) * (D)"]
[null,1,"Tier 1",{"$f":"IF(D4=1,\"Uniform Rate\",\"0 \"&D1&\" to\")","v":"0 CCF to"},12,{"$f":"IF(D4=1,\"\",E7)","v":12},1,0.9,{"$f":"IF(B7<=$D$4,MIN($F7,I$4),\"\")","v":12},{"$f":"IF(B7<=$D$4,MIN($F7,J$4),\"\")","v":11.904761904761905},{"$f":"IF($B7<=$D$4,I7*G7,\"\")","v":12},{"$f":"H7*J7","v":10.714285714285715}]
[null,2,{"$f":"IF($B8<=$D$4,\"Tier \"&B8,\"\")","v":"Tier 2"},{"$f":"IF($B8<$D$4,E7&\" \"&$D$1&\" to\",IF($B8=D$4,\"Over \"&E7&\" \"&$D$1,\"\"))","v":"Over 12 CCF"},null,{"$f":"IF($B8<$D$4,E8-E7,\"\")","v":""},2,2,{"$f":"IF(B8<=$D$4,MIN(I$4-SUM(I$7:I7),$F8),\"\")","v":0.5},{"$f":"IF(B8<=$D$4,MIN(J$4-SUM(J$7:J7),$F8),\"\")","v":0},1,{"$f":"H8*J8","v":0}]
[null,3,"","",null,"",null,null,{"$f":"IF(B9<=$D$4,MIN(I$4-SUM(I$7:I8),$F9),\"\")","v":""},{"$f":"IF(B9<=$D$4,MIN(J$4-SUM(J$7:J8),$F9),\"\")","v":""},{"$f":"IF($B9<=$D$4,I9*G9,\"\")","v":""},{"$f":"IF($B9<=$D$4,J9*IF(#REF!=\"percentage\",G9*(1-#REF!),H9),\"\")","v":""}]
[null,4,"","",null,"",null,null,{"$f":"IF(B10<=$D$4,MIN(I$4-SUM(I$7:I9),$F10),\"\")","v":""},{"$f":"IF(B10<=$D$4,MIN(J$4-SUM(J$7:J9),$F10),\"\")","v":""},"",{"$f":"IF($B10<=$D$4,J10*IF(#REF!=\"percentage\",G10*(1-#REF!),H10),\"\")","v":""}]
{"$rows_left_out":20}
{"sheet":"Table Ex3-Current Bill","index":8,"n_rows":65,"n_cols":7,"rows_kept":65,"cut":false,"hidden":false,"merged":[[52,2,52,3],[52,4,52,5],[5,2,5,3],[5,4,5,5],[25,2,25,3],[25,4,25,5],[45,2,45,3],[45,4,45,5]]}
[]
[null,"Company: ",null,null,null,"Filing Date:","2019-09-01"]
[null,"Ratemaking Area:",null,null,null,"Filing Year:",2019]
[]
[null,{"$f":"\"Average Annual Bill Calculation for Residential \"&'Table Ex3 Inputs'!D19&\" Meter as of the filing date:\"","v":"Average Annual Bill Calculation for Residential 5/8\" x 3/4\" Meter as of the filing date:"}]
[null,null,"Average Usage",null,"Tier 1 Usage",null,"Appropriate Rate"]
[null,null,"Non-CAP","CAP","Non-CAP","CAP"]
[null,"Usage (Ccfs/Year)",{"$f":"Non_LIRA_Avg_Usage_Exp","v":150},{"$f":"LIRA_Avg_Usage_Exp","v":142.85714285714286},{"$f":"Non_LIRA_Tier_1_Usage_Exp","v":144},{"$f":"LIRA_Tier_1_Usage_Exp","v":142.85714285714286}," (Incl. Start and Expiration Date as Appropriate)"]
[]
[null,"Service Charge",{"$f":"'Table Ex3 Inputs'!D21*bills_exp","v":120},{"$f":"'Table Ex3 Inputs'!E21*bills_exp","v":120},{"$f":"'Table Ex3 Inputs'!D21*bills_exp","v":120},{"$f":"'Table Ex3 Inputs'!E21*bills_exp","v":120},"$10.00 per month"]
{"$rows_left_out":56}
{"sheet":"Table Ex4-Impact to Avg Bill","index":9,"n_rows":151,"n_cols":13,"rows_kept":151,"cut":false,"hidden":false,"merged":[[3,8,3,12],[4,0,38,0],[40,0,74,0],[76,0,110,0],[112,0,146,0]]}
[null,"Company: ",null,null,null,"Filing Date:","2019-09-01"]
[null,"Ratemaking Area:",null,null,null,"Filing Year:",2019]
[]
[null,null,null,null,null,null,null,null,"Annual Bill Impacts \n(For Both Non-CAP and CAP Customers at Average and Tier 1 Usage Amounts)"]
["Non-CAP Residential Customers - Average Usage","Status","Proceedings ","Footnote Reference","Description of Filing","Revenue Recovery Mechanism ","Effective Date or Proposed Effective Date","Expiration Date or Proposed Expiration Date",2019,2020,2021,2022,2023]
[null,"Baseline bill (incl. service & quantity charges)","D.XX-XX-XXX/A. or AL",null,null,null,null,null,{"$f":"Baseline_Bill_Non_LIRA_Avg_Exp","v":276},{"$f":"Baseline_Bill_Non_LIRA_Avg_Exp","v":276},{"$f":"Baseline_Bill_Non_LIRA_Avg_Exp","v":276},{"$f":"Baseline_Bill_Non_LIRA_Avg_Exp","v":276},{"$f":"Baseline_Bill_Non_LIRA_Avg_Exp","v":276}]
[null,"CAP Surcharge","A.18-XX-XXX; D.19-XX-XXX",null,"(e.g., Bal. Acct., IRMA, WRAM)","(e.g., amortization of balancing account, GRC base rate increase, etc.)",null,null,{"$f":"'Table Ex3-Current Bill'!C15","v":15},{"$f":"'Table Ex3-Current Bill'!C15","v":15},{"$f":"'Table Ex3-Current Bill'!C15","v":15},"TBD","TBD"]
[null,"Temporary Surcharge #1","A.18-XX-XXX; D.19-XX-XXX",null,null,null,"2018-01-01","2019-10-01",{"$f":"'Table Ex3-Current Bill'!C16","v":22.5},0,0,0,0]
[null,"Temporary Surcharge #2","AL # XXXX",null,null,null,"2019-07-01","2020-03-01",{"$f":"'Table Ex3-Current Bill'!C17","v":0.75},{"$f":"ROUND((Non_LIRA_Avg_Usage_Exp*0.01),2)*(2/12)","v":0.25},0,0,0]
[]
{"$rows_left_out":141}