{"text_format":"1","workbook":"xlsx","n_sheets":13,"sheets":["Hypothetical Summary","Hypothetical SAR and RAR","Hypothetical Res Bill Impact","Hypothetical SAR and RAR (B-1)","Hypo. Bill Impact (B-1)","Selected Data","Summary","Authorized Rev Req","Incremental Rev Req","SAR and RAR","Res Bill Impact","SAR and AR (B-1)","Bill Impact (B-1)"],"not_rendered":{"charts":0,"images":0,"macros":1,"external_links":0,"defined_names":406,"comments":2,"pivot_tables":0},"unopened":[],"bounds":{"document_bytes":16777216,"sheet_cells":100000,"rows_first":2000,"rows_last":500,"rows_between":2000,"halvings":0,"cell_chars":16384,"cell_head_chars":4096},"cells_cut":0,"cells_raw":0,"read":"whole","date_system":"1900"}

{"sheet":"Hypothetical Summary","index":0,"n_rows":110,"n_cols":18,"rows_kept":110,"cut":false,"hidden":false,"merged":[[1,1,1,17],[108,1,108,2],[109,1,109,2],[93,1,93,7],[99,1,99,7],[105,1,105,7],[101,1,101,2],[102,1,102,2],[103,1,103,2],[107,1,107,2],[95,1,95,2],[96,1,96,2],[97,1,97,2],[9,15,10,15],[9,16,10,16],[48,1,48,2],[49,1,49,2],[38,1,38,7],[40,1,40,2],[41,1,41,2],[42,1,42,2],[45,1,45,7],[47,1,47,2],[35,1,35,2],[24,1,24,7],[24,9,24,15],[25,1,25,2],[25,9,25,10],[26,1,26,2],[34,1,34,2],[34,9,34,10],[35,9,35,10],[49,9,49,10],[62,1,62,2],[63,1,63,2],[62,9,62,10],[26,9,26,10],[28,1,28,2],[28,9,28,10],[31,1,31,7],[33,1,33,2],[31,9,31,15],[33,9,33,10],[41,9,41,10],[42,9,42,10],[45,9,45,15],[47,9,47,10],[48,9,48,10],[38,9,38,15],[40,9,40,10],[63,9,63,10],[66,1,66,7],[66,9,66,15],[52,1,52,7],[52,9,52,15],[54,1,54,2],[54,9,54,10],[55,1,55,2],[55,9,55,10],[56,1,56,2],[56,9,56,10],[59,1,59,7],[59,9,59,15],[61,1,61,2],[91,1,91,2],[91,9,91,10],[68,1,68,2],[68,9,68,10],[87,1,87,7],[87,9,87,15],[70,1,70,2],[77,1,77,2],[75,1,75,2],[75,9,75,10],[76,1,76,2],[76,9,76,10],[77,9,77,10],[80,1,80,7],[80,9,80,15],[82,1,82,2],[61,9,61,10],[89,1,89,2],[89,9,89,10],[90,1,90,2],[90,9,90,10],[82,9,82,10],[83,1,83,2],[84,1,84,2],[84,9,84,10],[69,1,69,2],[69,9,69,10],[73,1,73,7],[73,9,73,15],[83,9,83,10],[70,9,70,10]]}
[]
[null,"NOTE: Rate and bill calculations are illustrative and may not tie to other filed sources."]
[null,"Inputs:",null,null,null,null,null,null,null,"Assumptions:"]
[null,null,null,null,null,null,null,null,null,"Current Effective Rates",null,"2024-03-01"]
[null,null,"Baseline Region - (Residential bill)","X - Warm",null,"1) For residential, select climate zone (baseline region)",null,null,null,"Sales Forecast",null,2024]
[null,null,null,null,null,"2) Input revenue, truncating by 000 i.e. input 1,000,000 for one billion",null,null,null,"Summer season",null,4,"months"]
{"$rows_left_out":105}
{"sheet":"Hypothetical SAR and RAR","index":1,"n_rows":30,"n_cols":25,"rows_kept":30,"cut":false,"hidden":true,"merged":[[72,19,72,20],[32,4,32,6],[37,19,37,20],[47,19,47,20],[53,19,53,20],[65,19,65,20],[0,1,0,22],[3,5,3,14],[7,5,7,16],[15,19,15,20],[26,4,26,7],[26,14,26,17],[17,5,17,15],[17,19,17,20]]}
[]
[]
[null,null,"Revenue Change"]
[null,"Generation",{"$f":"'Hypothetical Summary'!D8","v":0},null,null,"Allocation"]
[null,"NSGC",{"$f":"'Hypothetical Summary'!D9","v":0},null,null,"Generation","Distribution","NDC","PPPC","NSGC","Transmission","CTC","ECRA","FERC BAs","GHG Rev","DWRBC","WHC","PCIA","Distribution (Wildfire)"]
[null,"Distribution",{"$f":"'Hypothetical Summary'!D10","v":0},null,"Residential",{"$f":"'SAR and RAR'!G6","v":0.41963557549628494},{"$f":"'SAR and RAR'!H6","v":0.41248645343349127},{"$f":"'SAR and RAR'!I6","v":0.34374584048159085},{"$f":"'SAR and RAR'!J6","v":0.32744449367049838},{"$f":"'SAR and RAR'!K6","v":0.47268993749771782},{"$f":"'SAR and RAR'!L6","v":0.46778394463327705},{"$f":"'SAR and RAR'!M6","v":0.36971075562333439},{"$f":"'SAR and RAR'!N6","v":0.35127959810528381},{"$f":"'SAR and RAR'!O6","v":0.34777781543166375},{"$f":"'SAR and RAR'!P6","v":0.86318626849318725},{"$f":"'SAR and RAR'!Q6","v":0.26631071752033519},{"$f":"'SAR and RAR'!R6","v":0.33394270255494779},{"$f":"'SAR and RAR'!S6","v":0.3819272913100783},{"$f":"'SAR and RAR'!T6","v":0.41548885571985544}]
{"$rows_left_out":25}
{"sheet":"Hypothetical Res Bill Impact","index":2,"n_rows":126,"n_cols":30,"rows_kept":126,"cut":false,"hidden":true,"merged":[[98,10,98,11],[98,12,98,13],[98,14,98,15],[112,10,112,15],[113,10,113,11],[113,12,113,13],[113,14,113,15],[81,10,81,15],[82,10,82,11],[82,12,82,13],[82,14,82,15],[97,10,97,15],[50,10,50,11],[50,12,50,13],[50,14,50,15],[65,10,65,15],[66,10,66,11],[66,12,66,13],[66,14,66,15],[113,2,113,3],[113,4,113,5],[113,6,113,7],[112,2,112,7],[98,2,98,3],[98,4,98,5],[98,6,98,7],[97,2,97,7],[82,2,82,3],[82,4,82,5],[82,6,82,7],[81,2,81,7],[19,28,19,29],[20,24,20,25],[20,26,20,27],[66,2,66,3],[66,4,66,5],[66,6,66,7],[65,2,65,7],[33,10,33,15],[34,10,34,11],[34,2,34,3],[34,4,34,5],[34,6,34,7],[50,2,50,3],[50,4,50,5],[50,6,50,7],[33,2,33,7],[49,2,49,7],[1,1,1,3],[19,20,19,21],[20,16,20,17],[20,18,20,19],[2,4,2,8],[2,15,2,19],[34,12,34,13],[34,14,34,15],[49,10,49,15]]}
[]
[]
[null,null,null,null,"Schedule E-1",null,null,null,null,null,null,null,null,null,null,"Schedule EL-1"]
[null,null,null,null,{"$f":"'Hypothetical Summary'!$L$5","v":2024},{"$f":"'Hypothetical Summary'!$L$4","v":"2024-03-01"},{"$f":"'Hypothetical Summary'!$L$4","v":"2024-03-01"},"Proposed","Proposed",null,null,null,null,null,null,{"$f":"'Hypothetical Summary'!$L$5","v":2024},{"$f":"'Hypothetical Summary'!$L$4","v":"2024-03-01"},{"$f":"'Hypothetical Summary'!$L$4","v":"2024-03-01"},"Proposed","Proposed"]
[null,null,null,null,"Sales Forecast","Rates","Revenue"," Rates","Revenue",null,null,null,null,null,null,"Sales Forecast","Rates","Revenue"," Rates","Revenue"]
[]
{"$rows_left_out":121}
{"sheet":"Hypothetical SAR and RAR (B-1)","index":3,"n_rows":30,"n_cols":25,"rows_kept":30,"cut":false,"hidden":true,"merged":[[65,19,65,20],[72,19,72,20],[26,4,26,7],[26,14,26,17],[32,4,32,6],[37,19,37,20],[47,19,47,20],[53,19,53,20],[0,1,0,22],[3,5,3,14],[7,5,7,16],[15,19,15,20],[17,5,17,15],[17,19,17,20]]}
[]
[]
[null,null,"Revenue Change"]
[null,"Generation",{"$f":"'Hypothetical Summary'!D8","v":0},null,null,"Allocation"]
[null,"NSGC",{"$f":"'Hypothetical Summary'!D9","v":0},null,null,"Generation","Distribution","NDC","PPPC","NSGC","Transmission","CTC","ECRA","FERC BAs","GHG Rev","DWRBC","WHC","PCIA","Distribution (Wildfire)"]
[null,"Distribution",{"$f":"'Hypothetical Summary'!D10","v":0},null,"B-1",{"$f":"'SAR and AR (B-1)'!G35","v":8.0038435165354832E-2},{"$f":"'SAR and AR (B-1)'!H35","v":0.11680268547110666},{"$f":"'SAR and AR (B-1)'!I35","v":7.9772721601086574E-2},{"$f":"'SAR and AR (B-1)'!J35","v":8.9796606812165364E-2},{"$f":"'SAR and AR (B-1)'!K35","v":7.7249774469423049E-2},{"$f":"'SAR and AR (B-1)'!L35","v":7.5847606010290752E-2},{"$f":"'SAR and AR (B-1)'!M35","v":8.2198432787364203E-2},{"$f":"'SAR and AR (B-1)'!N35","v":8.1519430695566733E-2},{"$f":"'SAR and AR (B-1)'!O35","v":8.2532709631647869E-2},{"$f":"'SAR and AR (B-1)'!P35","v":5.9032404279706616E-2},{"$f":"'SAR and AR (B-1)'!Q35","v":9.1733663004078703E-2},{"$f":"'SAR and AR (B-1)'!R35","v":0.11375535953174022},{"$f":"'SAR and AR (B-1)'!S35","v":9.0447532358110705E-2},{"$f":"'SAR and AR (B-1)'!T35","v":0.10032636488098344}]
{"$rows_left_out":25}
{"sheet":"Hypo. Bill Impact (B-1)","index":4,"n_rows":41,"n_cols":28,"rows_kept":41,"cut":false,"hidden":true,"merged":[[29,2,29,9],[30,2,30,3],[30,4,30,5],[30,6,30,7],[1,1,1,3],[2,4,2,10],[19,16,19,18],[19,19,19,21],[19,28,19,29],[20,24,20,25],[20,26,20,27]]}
[]
[]
[null,null,null,null,"Schedule B-1"]
[null,null,null,null,{"$f":"Summary!D3","v":2024},{"$f":"Summary!L3","v":"2024-03-01"},{"$f":"Summary!L3","v":"2024-03-01"},"Proposed","Proposed"]
[null,null,null,null,"Sales Forecast","Rates","Revenue","Rates","Revenue"]
[]
{"$rows_left_out":36}
{"sheet":"Selected Data","index":5,"n_rows":54,"n_cols":21,"rows_kept":54,"cut":false,"hidden":true,"merged":[[25,1,25,15],[31,1,31,14]]}
["Summary of Selected Data "]
[null,null,null,null,null,null,null,null,null,null,null,null,null,null,null,null,"Revenue"]
[null,null,null,null,null,null,null,null,null,null,null,null,null,null,null,null," Requirement"]
[null,null,null,null,null,null,null,null,null,null,null,null,null,null,null,null,"$000"]
[1,"Current total system-level revenue requirement that is used for defining the reporting threshold:",null,null,null,null,null,null,null,null,null,null,null,null,null,null,{"$f":"'Incremental Rev Req'!B5","v":20734135.471295606}]
[null,"A","One-percent reporting threshold",null,null,null,null,null,null,null,null,null,null,null,null,null,{"$f":"Q5*0.01","v":207341.35471295606}]
{"$rows_left_out":49}
{"sheet":"Summary","index":6,"n_rows":116,"n_cols":20,"rows_kept":116,"cut":false,"hidden":true,"merged":[[109,1,109,2],[113,1,113,2],[114,1,114,2],[115,1,115,2],[99,1,99,9],[105,1,105,9],[111,1,111,9],[101,1,101,2],[102,1,102,2],[103,1,103,2],[107,1,107,2],[108,1,108,2],[97,1,97,2],[62,11,62,12],[83,11,83,12],[69,11,69,12],[76,11,76,12],[90,11,90,12],[97,11,97,12],[62,1,62,2],[69,1,69,2],[76,1,76,2],[83,1,83,2],[90,1,90,2],[65,1,65,9],[67,1,67,2],[68,1,68,2],[67,11,67,12],[54,1,54,2],[55,1,55,2],[44,1,44,9],[46,1,46,2],[47,1,47,2],[48,1,48,2],[51,1,51,9],[53,1,53,2],[41,1,41,2],[30,1,30,9],[30,11,30,19],[31,1,31,2],[31,11,31,12],[32,1,32,2],[32,11,32,12],[34,1,34,2],[34,11,34,12],[37,1,37,9],[39,1,39,2],[40,1,40,2],[41,11,41,12],[37,11,37,19],[39,11,39,12],[40,11,40,12],[58,1,58,9],[60,1,60,2],[61,1,61,2],[60,11,60,12],[61,11,61,12],[68,11,68,12],[72,1,72,9],[74,1,74,2],[75,1,75,2],[74,11,74,12],[75,11,75,12],[89,1,89,2],[93,1,93,9],[95,1,95,2],[96,1,96,2],[79,1,79,9],[81,1,81,2],[82,1,82,2],[86,1,86,9],[88,1,88,2],[44,11,44,19],[46,11,46,12],[47,11,47,12],[48,11,48,12],[51,11,51,19],[65,11,65,19],[53,11,53,12],[54,11,54,12],[55,11,55,12],[58,11,58,19],[89,11,89,12],[93,11,93,19],[95,11,95,12],[96,11,96,12],[72,11,72,19],[79,11,79,19],[81,11,81,12],[82,11,82,12],[86,11,86,19],[88,11,88,12]]}
[]
[null,"Inputs:",null,null,null,null,null,null,null,"Assumptions:"]
[null,null,{"$f":"\"Rate Impact for Year (\"&'Incremental Rev Req'!$F$9&\" - \"&'Incremental Rev Req'!$I$9&\")\"","v":"Rate Impact for Year (2024 - 2027)"},2024,null,null,null,null,null,"Current Effective Rates",null,"2024-03-01"]
[null,null,"Baseline Region - (Residential bill)","X - Warm",null,null,null,null,null,"Sales Forecast",null,{"$f":"D3","v":2024}]
[null,null,null,null,null,null,null,null,null,"Summer season",null,4,"months"]
[null,null,null,null,null,null,null,null,null,"Winter Season",null,8,"months"]
{"$rows_left_out":111}
{"sheet":"Authorized Rev Req","index":7,"n_rows":144,"n_cols":22,"rows_kept":144,"cut":false,"hidden":true,"merged":[[6,8,6,14],[6,1,6,7]]}
[]
["Annual Period 2024"]
["Reporting Date: March 1, 2024"]
[]
[null,"January 1, 2023","March 1","June 1","July 1","September 1","January 1, 2024","March 1, 2024","January 1, 2023","March 1","June 1","July 1","September 1","January 1, 2024","March 1, 2024"]
[null,"6805-E","6863-E-A","6946-E","6968-E","7009-E","7116-E","7191-E",{"$f":"B6","v":"6805-E"},"6863-E-A","6946-E","6968-E","7009-E","7116-E","7191-E"]
{"$rows_left_out":139}
{"sheet":"Incremental Rev Req","index":8,"n_rows":142,"n_cols":21,"rows_kept":142,"cut":false,"hidden":true,"merged":[[6,0,6,9],[110,0,110,12],[111,5,111,7],[111,10,111,13]]}
[]
[{"$f":"'Authorized Rev Req'!A2","v":"Annual Period 2024"}]
[{"$f":"'Authorized Rev Req'!A3","v":"Reporting Date: March 1, 2024"}]
[]
["Current Revenue Requirement ($000):",{"$f":"'Authorized Rev Req'!O132","v":20734135.471295606}]
["Current Revenue Requirement Effective:",{"$f":"'Authorized Rev Req'!O5","v":"March 1, 2024"}]
{"$rows_left_out":137}
{"sheet":"SAR and RAR","index":9,"n_rows":65,"n_cols":40,"rows_kept":65,"cut":false,"hidden":true,"merged":[[1,2,1,3],[3,6,3,15],[7,6,7,17],[49,19,49,20],[59,19,59,20],[16,20,16,21],[15,20,15,21],[24,34,24,39],[24,26,24,31],[65,19,65,20],[16,6,16,16],[25,5,25,10],[25,15,25,20]]}
[]
[null,null,"Revenue Change ($000)"]
[null,null,"Authorized","w/ Pending"]
[null,"Generation",{"$f":"INDEX('Incremental Rev Req'!$Q$9:$U$24,MATCH(B4,'Incremental Rev Req'!$Q$9:$Q$24,0),MATCH(Summary!$D$3,'Incremental Rev Req'!$Q$9:$U$9,0))","v":4424925.3443182372},{"$f":"INDEX('Incremental Rev Req'!$Q$112:$U$127,MATCH(B4,'Incremental Rev Req'!$Q$112:$Q$127,0),MATCH(Summary!$D$3,'Incremental Rev Req'!$Q$112:$U$112,0))","v":4424925.3443182372},null,null,"Allocation"]
[null,"NSGC",{"$f":"INDEX('Incremental Rev Req'!$Q$9:$U$24,MATCH(B5,'Incremental Rev Req'!$Q$9:$Q$24,0),MATCH(Summary!$D$3,'Incremental Rev Req'!$Q$9:$U$9,0))","v":444350.2979319889},{"$f":"INDEX('Incremental Rev Req'!$Q$112:$U$127,MATCH(B5,'Incremental Rev Req'!$Q$112:$Q$127,0),MATCH(Summary!$D$3,'Incremental Rev Req'!$Q$112:$U$112,0))","v":444350.2979319889},null,null,"Generation","Distribution","NDC","PPPC","NSGC","Transmission","CTC","ECRA","FERC BAs","GHG Rev","DWRBC","WHC","PCIA","Distribution (Wildfire)"]
[null,"Distribution",{"$f":"INDEX('Incremental Rev Req'!$Q$9:$U$24,MATCH(B6,'Incremental Rev Req'!$Q$9:$Q$24,0),MATCH(Summary!$D$3,'Incremental Rev Req'!$Q$9:$U$9,0))","v":9286773.2473816667},{"$f":"INDEX('Incremental Rev Req'!$Q$112:$U$127,MATCH(B6,'Incremental Rev Req'!$Q$112:$Q$127,0),MATCH(Summary!$D$3,'Incremental Rev Req'!$Q$112:$U$112,0))","v":9286773.2473816667},null,"Residential",{"$f":"VLOOKUP(Summary!$D$3,$F$35:$T$38,G$33,FALSE)","v":0.41963557549628494},{"$f":"VLOOKUP(Summary!$D$3,$F$35:$T$38,H$33,FALSE)","v":0.41248645343349127},{"$f":"VLOOKUP(Summary!$D$3,$F$35:$T$38,I$33,FALSE)","v":0.34374584048159085},{"$f":"VLOOKUP(Summary!$D$3,$F$35:$T$38,J$33,FALSE)","v":0.32744449367049838},{"$f":"VLOOKUP(Summary!$D$3,$F$35:$T$38,K$33,FALSE)","v":0.47268993749771782},{"$f":"VLOOKUP(Summary!$D$3,$F$35:$T$38,L$33,FALSE)","v":0.46778394463327705},{"$f":"VLOOKUP(Summary!$D$3,$F$35:$T$38,M$33,FALSE)","v":0.36971075562333439},{"$f":"VLOOKUP(Summary!$D$3,$F$35:$T$38,N$33,FALSE)","v":0.35127959810528381},{"$f":"VLOOKUP(Summary!$D$3,$F$35:$T$38,O$33,FALSE)","v":0.34777781543166375},{"$f":"VLOOKUP(Summary!$D$3,$F$35:$T$38,P$33,FALSE)","v":0.86318626849318725},{"$f":"VLOOKUP(Summary!$D$3,$F$35:$T$38,Q$33,FALSE)","v":0.26631071752033519},{"$f":"VLOOKUP(Summary!$D$3,$F$35:$T$38,R$33,FALSE)","v":0.33394270255494779},{"$f":"VLOOKUP(Summary!$D$3,$F$35:$T$38,S$33,FALSE)","v":0.3819272913100783},{"$f":"VLOOKUP(Summary!$D$3,$F$35:$T$38,T$33,FALSE)","v":0.41548885571985544}]
{"$rows_left_out":60}
{"sheet":"Res Bill Impact","index":10,"n_rows":127,"n_cols":30,"rows_kept":127,"cut":false,"hidden":true,"merged":[[53,29,53,32],[66,2,66,9],[67,2,67,3],[67,4,67,5],[67,6,67,7],[67,8,67,9],[66,12,66,19],[67,12,67,13],[67,14,67,15],[67,16,67,17],[67,18,67,19],[50,2,50,9],[51,2,51,3],[51,4,51,5],[51,6,51,7],[51,8,51,9],[34,2,34,9],[35,2,35,3],[35,4,35,5],[35,6,35,7],[35,8,35,9],[1,1,1,3],[2,4,2,10],[2,15,2,21],[19,20,19,21],[20,16,20,17],[20,18,20,19],[82,2,82,9],[83,2,83,3],[83,4,83,5],[83,6,83,7],[83,8,83,9],[82,12,82,19],[83,12,83,13],[83,14,83,15],[83,16,83,17],[83,18,83,19],[98,2,98,9],[99,2,99,3],[99,4,99,5],[99,6,99,7],[99,8,99,9],[113,2,113,9],[114,2,114,3],[114,4,114,5],[114,6,114,7],[114,8,114,9],[98,12,98,19],[99,12,99,13],[99,14,99,15],[99,16,99,17],[99,18,99,19],[113,12,113,19],[114,12,114,13],[114,14,114,15],[114,16,114,17],[114,18,114,19],[19,28,19,29],[20,24,20,25],[20,26,20,27],[50,12,50,19],[51,12,51,13],[51,14,51,15],[51,16,51,17],[51,18,51,19],[34,12,34,19],[35,12,35,13],[35,14,35,15],[35,16,35,17],[35,18,35,19],[36,29,36,32],[42,29,42,32],[47,29,47,32]]}
[]
[]
[null,null,null,null,"Schedule E-1",null,null,null,null,null,null,null,null,null,null,"Schedule EL-1"]
[null,null,null,null,{"$f":"Summary!D3","v":2024},{"$f":"Summary!L3","v":"2024-03-01"},{"$f":"Summary!L3","v":"2024-03-01"},"Proposed","Proposed","Proposed","Proposed",null,null,null,null,{"$f":"E4","v":2024},{"$f":"Summary!L3","v":"2024-03-01"},{"$f":"Summary!L3","v":"2024-03-01"},"Proposed","Proposed","Proposed","Proposed"]
[null,null,null,null,"Sales Forecast","Rates","Revenue","Authorized Rates","Authorized Revenue","w/Pending Rates","w/Pending Revenue",null,null,null,null,"Sales Forecast","Rates","Revenue","Authorized Rates","Authorized Revenue","w/Pending Rates","w/Pending Revenue"]
[]
{"$rows_left_out":122}
{"sheet":"SAR and AR (B-1)","index":11,"n_rows":65,"n_cols":40,"rows_kept":65,"cut":false,"hidden":true,"merged":[[65,19,65,20],[24,26,24,31],[24,34,24,39],[25,5,25,10],[25,15,25,20],[49,19,49,20],[59,19,59,20],[1,2,1,3],[3,6,3,15],[7,6,7,17],[15,20,15,21],[16,6,16,16],[16,20,16,21]]}
[]
[null,null,"Revenue Change ($000)"]
[null,null,"Authorized","w/ Pending"]
[null,"Generation",{"$f":"INDEX('Incremental Rev Req'!$Q$9:$U$24,MATCH(B4,'Incremental Rev Req'!$Q$9:$Q$24,0),MATCH(Summary!$D$3,'Incremental Rev Req'!$Q$9:$U$9,0))","v":4424925.3443182372},{"$f":"INDEX('Incremental Rev Req'!$Q$112:$U$127,MATCH(B4,'Incremental Rev Req'!$Q$112:$Q$127,0),MATCH(Summary!$D$3,'Incremental Rev Req'!$Q$112:$U$112,0))","v":4424925.3443182372},null,null,"Allocation"]
[null,"NSGC",{"$f":"INDEX('Incremental Rev Req'!$Q$9:$U$24,MATCH(B5,'Incremental Rev Req'!$Q$9:$Q$24,0),MATCH(Summary!$D$3,'Incremental Rev Req'!$Q$9:$U$9,0))","v":444350.2979319889},{"$f":"INDEX('Incremental Rev Req'!$Q$112:$U$127,MATCH(B5,'Incremental Rev Req'!$Q$112:$Q$127,0),MATCH(Summary!$D$3,'Incremental Rev Req'!$Q$112:$U$112,0))","v":444350.2979319889},null,null,"Generation","Distribution","NDC","PPPC","NSGC","Transmission","CTC","ECRA","FERC BAs","GHG Rev","DWRBC","WHC","PCIA","Distribution (Wildfire)"]
[null,"Distribution",{"$f":"INDEX('Incremental Rev Req'!$Q$9:$U$24,MATCH(B6,'Incremental Rev Req'!$Q$9:$Q$24,0),MATCH(Summary!$D$3,'Incremental Rev Req'!$Q$9:$U$9,0))","v":9286773.2473816667},{"$f":"INDEX('Incremental Rev Req'!$Q$112:$U$127,MATCH(B6,'Incremental Rev Req'!$Q$112:$Q$127,0),MATCH(Summary!$D$3,'Incremental Rev Req'!$Q$112:$U$112,0))","v":9286773.2473816667},null,"B-1",{"$f":"VLOOKUP(Summary!$D$3,$F$35:$T$38,G$33,FALSE)","v":8.0038435165354832E-2},{"$f":"VLOOKUP(Summary!$D$3,$F$35:$T$38,H$33,FALSE)","v":0.11680268547110666},{"$f":"VLOOKUP(Summary!$D$3,$F$35:$T$38,I$33,FALSE)","v":7.9772721601086574E-2},{"$f":"VLOOKUP(Summary!$D$3,$F$35:$T$38,J$33,FALSE)","v":8.9796606812165364E-2},{"$f":"VLOOKUP(Summary!$D$3,$F$35:$T$38,K$33,FALSE)","v":7.7249774469423049E-2},{"$f":"VLOOKUP(Summary!$D$3,$F$35:$T$38,L$33,FALSE)","v":7.5847606010290752E-2},{"$f":"VLOOKUP(Summary!$D$3,$F$35:$T$38,M$33,FALSE)","v":8.2198432787364203E-2},{"$f":"VLOOKUP(Summary!$D$3,$F$35:$T$38,N$33,FALSE)","v":8.1519430695566733E-2},{"$f":"VLOOKUP(Summary!$D$3,$F$35:$T$38,O$33,FALSE)","v":8.2532709631647869E-2},{"$f":"VLOOKUP(Summary!$D$3,$F$35:$T$38,P$33,FALSE)","v":5.9032404279706616E-2},{"$f":"VLOOKUP(Summary!$D$3,$F$35:$T$38,Q$33,FALSE)","v":9.1733663004078703E-2},{"$f":"VLOOKUP(Summary!$D$3,$F$35:$T$38,R$33,FALSE)","v":0.11375535953174022},{"$f":"VLOOKUP(Summary!$D$3,$F$35:$T$38,S$33,FALSE)","v":9.0447532358110705E-2},{"$f":"VLOOKUP(Summary!$D$3,$F$35:$T$38,T$33,FALSE)","v":0.10032636488098344}]
{"$rows_left_out":60}
{"sheet":"Bill Impact (B-1)","index":12,"n_rows":41,"n_cols":28,"rows_kept":41,"cut":false,"hidden":true,"merged":[[20,24,20,25],[20,26,20,27],[29,2,29,9],[30,2,30,3],[30,4,30,5],[30,6,30,7],[30,8,30,9],[1,1,1,3],[2,4,2,10],[19,16,19,18],[19,28,19,29],[19,19,19,21]]}
[]
[]
[null,null,null,null,"Schedule B-1"]
[null,null,null,null,{"$f":"Summary!D3","v":2024},{"$f":"Summary!L3","v":"2024-03-01"},{"$f":"Summary!L3","v":"2024-03-01"},"Proposed","Proposed","Proposed","Proposed"]
[null,null,null,null,"Sales Forecast","Rates","Revenue","Authorized Rates","Authorized Revenue","w/Pending Rates","w/Pending Revenue"]
[]
{"$rows_left_out":35}