{"text_format":"1","workbook":"xlsx","n_sheets":13,"sheets":["Summary","Selected Data","Authorized Rev Req","Incremental Rev Req","SAR and AR (GS1)","Bill Impact (GS1)","SAR and RAR","Res Bill Impact","Simple Bill Insert Calc (2)","SAR and RAR (2)","Res Bill Impact (2)","SAR and AR (GS1) (2)","Bill Impact (GS1) (2)"],"not_rendered":{"charts":0,"images":0,"macros":1,"external_links":0,"defined_names":149,"comments":4,"pivot_tables":0},"unopened":[],"bounds":{"document_bytes":16777216,"sheet_cells":100000,"rows_first":2000,"rows_last":500,"rows_between":2000,"halvings":0,"cell_chars":16384,"cell_head_chars":4096},"cells_cut":0,"cells_raw":0,"read":"whole","date_system":"1900"}

{"sheet":"Summary","index":0,"n_rows":129,"n_cols":20,"rows_kept":129,"cut":false,"hidden":false,"merged":[[122,1,122,2],[126,1,126,2],[127,1,127,2],[128,1,128,2],[114,1,114,2],[115,1,115,2],[116,1,116,2],[120,1,120,2],[121,1,121,2],[109,1,109,2],[110,1,110,2],[102,1,102,2],[103,1,103,2],[104,1,104,2],[108,1,108,2],[67,1,67,2],[72,1,72,2],[96,1,96,2],[97,1,97,2],[98,1,98,2],[40,1,40,2],[45,1,45,2],[58,1,58,2],[90,1,90,2],[91,1,91,2],[85,1,85,2],[86,1,86,2],[59,1,59,2],[80,1,80,2],[81,1,81,2],[60,1,60,2],[61,1,61,2],[75,1,75,2],[73,1,73,2],[74,1,74,2],[65,1,65,2],[46,1,46,2],[41,1,41,2],[66,1,66,2],[68,1,68,2],[30,11,30,19],[34,1,34,2],[31,1,31,2],[32,1,32,2],[31,11,31,12],[32,11,32,12],[34,11,34,12],[53,1,53,2],[51,1,51,2],[52,1,52,2],[47,1,47,2],[39,1,39,2]]}
[]
[null,"Inputs:",null,null,null,null,null,null,null,null,null,"Assumptions:",null,"Current year plus three required data set."]
[null,null,"Rate Impact for Year (2025-2029)",2025,null,null,null,null,"Include CA Climate Credit in Rates","N",null,"Current Effective Rates",null,"2025-11-15"]
[null,null,"Baseline Region - (Residential bill)","9 warm",null,null,null,null,"Typical residential average usage kWh/month",500,null,"Sales Forecast",null,{"$f":"D3","v":2025}]
[null,null,null,null,null,null,null,null,null,null,null,"Residential bill calculated using ",null,"Schedule D, Basic, Single Family",null,null,null,null,"Annual Usage"]
[null,null,null,null,null,null,null,null,null,null,null,"Non-CARE bill impact calculated with average summer usage of ",null,null,null,{"$f":"IF($D$4=\"All\",SUMPRODUCT('Res Bill Impact'!P$22:P$30,'Res Bill Impact'!$T$22:$T$30),VLOOKUP(D$4,'Res Bill Impact'!$O$22:$S$30,2,FALSE))","v":736.18963415586904},"kWh per month","Non-CARE",{"$f":"(P6*4)+(P7*8)","v":6577.1927029417802}]
[null,"Pending Proceedings",null,"Include in Impact (Y)","Applicable Year(s)",null,null,null,null,null,null,"Non-CARE bill impact calculated with average winter usage of ",null,null,null,{"$f":"IF($D$4=\"All\",SUMPRODUCT('Res Bill Impact'!Q$22:Q$30,'Res Bill Impact'!$T$22:$T$30),VLOOKUP(D$4,'Res Bill Impact'!$O$22:$S$30,3,FALSE))","v":454.05427078978795},"kWh per month"]
[null,"2026 ERRA Forecast",null,"Y",2026,null,null,null,null,null,null,"CARE bill impact calculated with average summer usage of ",null,null,null,{"$f":"IF($D$4=\"All\",SUMPRODUCT('Res Bill Impact'!R$22:R$30,'Res Bill Impact'!$U$22:$U$30),VLOOKUP(D$4,'Res Bill Impact'!$O$22:$S$30,4,FALSE))","v":685.49662095013514},"kWh per month","CARE",{"$f":"(P8*4)+(P10*8)","v":6135.9435655042907}]
[null,"2022 ERRA Review",null,"Y",2026]
[null,"2023 ERRA Review",null,"Y",2026,null,null,null,null,null,null,"CARE bill impact calculated with average winter usage of ",null,null,null,{"$f":"IF($D$4=\"All\",SUMPRODUCT('Res Bill Impact'!S$22:S$30,'Res Bill Impact'!$U$22:$U$30),VLOOKUP(D$4,'Res Bill Impact'!$O$22:$S$30,5,FALSE))","v":424.24463521296872},"kWh per month"]
[null,"2024 ERRA Review",null,"Y",2027,null,null,null,null,null,null,"Essential Use (Basic) bill impact calculated with average summer usage of ",null,null,null,{"$f":"IF($D$4=\"All\",SUMPRODUCT('Res Bill Impact'!I$22:I$30,'Res Bill Impact'!$T$22:$T$30),VLOOKUP(D$4,'Res Bill Impact'!$H$22:$L$30,2,FALSE))","v":514.04729999999995},"kWh per month","Essential Use (Basic)",{"$f":"(P11*4)+(P12*8)","v":4976.2212}]
[null,"Woolsey CEMA (As Filed, does not yet reflect settled value)",null,"Y",2026,null,null,null,null,null,null,"Essential Use (Basic) bill impact calculated with average winter usage of ",null,null,null,{"$f":"IF($D$4=\"All\",SUMPRODUCT('Res Bill Impact'!J$22:J$30,'Res Bill Impact'!$T$22:$T$30),VLOOKUP(D$4,'Res Bill Impact'!$H$22:$L$30,3,FALSE))","v":365.00400000000002},"kWh per month"]
[null,"Woolsey WEMA FRC (As Filed, does not yet reflect settled value)",null,"Y","2026-2029",null,null,null,null,null,null,"Essential Use (All-Electric) bill impact calculated with average summer usage of ",null,null,null,{"$f":"IF($D$4=\"All\",SUMPRODUCT('Res Bill Impact'!K$22:K$30,'Res Bill Impact'!$T$22:$T$30),VLOOKUP(D$4,'Res Bill Impact'!$H$22:$L$30,4,FALSE))","v":380.21250000000003},"kWh per month","Essential Use (All-Electric)",{"$f":"(P13*4)+(P15*8)","v":4903.2204000000002}]
[null,"Section 851 - Sale of Hydroelectric San Bernardino",null,"Y",2026]
[null,"Section 851 - Sale of Hydroelectric Fontana Union Water",null,"Y",2026,null,null,null,null,null,null,"Essential Use (All-Electric) bill impact calculated with average winter usage of ",null,null,null,{"$f":"IF($D$4=\"All\",SUMPRODUCT('Res Bill Impact'!L$22:L$30,'Res Bill Impact'!$T$22:$T$30),VLOOKUP(D$4,'Res Bill Impact'!$H$22:$L$30,5,FALSE))","v":422.79630000000003},"kWh per month"]
[null,"Section 851 - Sale of Hydroelectric TULE",null,"Y",2026,null,null,null,null,null,null,"Average monthly usage is for all customers (Non-CARE and CARE) based on seasonal usage in",null,null,null,null,null,2024]
[null,"2026 Cost of Capital (Prorposed Decision)",null,"Y","2026-2029",null,null,null,null,null,null,"Summer season",null,4,"months"]
[null,"NextGen",null,"Y","2026-2029",null,null,null,null,null,null,"Winter Season",null,8,"months"]
[null,"Diablo Canyon Extended Operations NBC",null,"Y","2026-2029",null,null,null,null,null,null,"Residential Bi-Annual Climate Credit",null,-56]
[null,"IQP 2027 Bridge Funding",null,"Y","2027-2029"]
[null,"2024 WMCE (to be filed 12/4)",null,"Y",2027]
[null,"Energy Efficiency Program and Portfolio",null,"Y","2026-2029"]
[]
[]
[]
[]
[]
[]
[null,"Outputs:"]
[null,null,null,"(A)","(B)","(C)","(D)","(D)/(A)","(D)/(B)","(D)/(C)",null,null,null,"(A)","(B)","(C)","(D)","(D)/(A)","(D)/(B)","(D)/(C)"]
[null,"Bundled Average Rates - ¢/kWh",null,null,null,null,null,null,null,null,null,"Total System (Bundled and Unbundled) Average Rates - ¢/kWh"]
[null,"Customer Group",null,"2025-01-01",{"$f":"N3","v":"2025-11-15"},{"$f":"$D$3&\" Authorized\"","v":"2025 Authorized"},{"$f":"$D$3&\" w/Pending\"","v":"2025 w/Pending"},{"$f":"\"% Change over \"&MONTH(D32)&\"/\"&DAY(D32)&\"/\"&YEAR(D32)","v":"% Change over 1/1/2025"},{"$f":"\"% Change over \"&MONTH(E32)&\"/\"&DAY(E32)&\"/\"&YEAR(E32)","v":"% Change over 11/15/2025"},"% Change over Authorized",null,"Customer Group",null,{"$f":"$D$32","v":"2025-01-01"},{"$f":"$E$32","v":"2025-11-15"},{"$f":"$D$3&\" Authorized\"","v":"2025 Authorized"},{"$f":"$D$3&\" w/Pending\"","v":"2025 w/Pending"},{"$f":"$H$32","v":"% Change over 1/1/2025"},{"$f":"$I$32","v":"% Change over 11/15/2025"},"% Change over Authorized"]
[null,"Residential",null,{"$f":"IF(J3=\"Y\",'SAR and RAR'!W28,'SAR and RAR'!X28)","v":31.629738146992409},{"$f":"'SAR and RAR'!G28","v":35.260672614547445},{"$f":"'SAR and RAR'!H28","v":35.197078523586271},{"$f":"'SAR and RAR'!I28","v":35.197078523586271},{"$f":"$G33/D33-1","v":0.1127843790554135},{"$f":"$G33/E33-1","v":-1.8035416299726492E-3},{"$f":"$G33/F33-1","v":0},null,"Total Residential (RAR)",null,{"$f":"IF(J3=\"Y\",'SAR and RAR'!Z28,'SAR and RAR'!AA28)","v":28.361307178419636},{"$f":"'SAR and RAR'!O28","v":31.475217358277142},{"$f":"'SAR and RAR'!P28","v":31.752031839349016},{"$f":"'SAR and RAR'!Q28","v":31.752031839349016},{"$f":"$Q33/N33-1","v":0.11955459738151308},8.7946805234397907E-3,0]
[null,null,"Small Commercial",{"$f":"IF(J3=\"Y\",'SAR and AR (GS1)'!W28,'SAR and AR (GS1)'!X28)","v":29.174067662266477},{"$f":"'SAR and AR (GS1)'!G28","v":31.983408553249816},{"$f":"'SAR and AR (GS1)'!H28","v":31.833930226113377},{"$f":"'SAR and AR (GS1)'!I28","v":31.833930226113377},9.1172153113470156E-2,{"$f":"$G34/E34-1","v":-4.6736209146555074E-3},{"$f":"$G34/F34-1","v":0},null,null,"Total Small Commercial (AR)",{"$f":"IF(J3=\"Y\",'SAR and AR (GS1)'!Z28,'SAR and AR (GS1)'!AA28)","v":25.779500964262311},{"$f":"'SAR and AR (GS1)'!O28","v":28.072807513619431},{"$f":"'SAR and AR (GS1)'!P28","v":27.948381357308026},{"$f":"'SAR and AR (GS1)'!Q28","v":27.948381357308026},{"$f":"$Q34/N34-1","v":8.4131977420835113E-2},{"$f":"$Q34/O34-1","v":-4.4322662153060133E-3},{"$f":"$Q34/P34-1","v":0}]
[null,"System",null,{"$f":"IF(J3=\"Y\",'SAR and RAR'!W29,'SAR and RAR'!X29)","v":27.30660684898934},{"$f":"'SAR and RAR'!G29","v":30.163203046939159},{"$f":"'SAR and RAR'!H29","v":30.050623636323813},{"$f":"'SAR and RAR'!I29","v":30.050623636323813},0.10048911615087874,{"$f":"$G35/E35-1","v":-3.7323426971649365E-3},{"$f":"$G35/F35-1","v":0},null,"Total System (SAR)",null,{"$f":"IF(J3=\"Y\",'SAR and RAR'!Z29,'SAR and RAR'!AA29)","v":22.919117042486967},{"$f":"'SAR and RAR'!O29","v":25.126029785552312},{"$f":"'SAR and RAR'!P29","v":25.324032700589299},{"$f":"'SAR and RAR'!Q29","v":25.324032700589299},0.10493055442075505,7.8803900467729893E-3,0]
[]
[]
[null,"Bundled Residential Monthly Average Bills"]
[null,null,null,{"$f":"$D$32","v":"2025-01-01"},{"$f":"$E$32","v":"2025-11-15"},{"$f":"$D$3&\" Authorized\"","v":"2025 Authorized"},{"$f":"$D$3&\" w/Pending\"","v":"2025 w/Pending"},{"$f":"$H$32","v":"% Change over 1/1/2025"},{"$f":"$I$32","v":"% Change over 11/15/2025"},"% Change over Authorized"]
[null,"Non-CARE",null,{"$f":"((D46*4)+(D52*8))/12","v":186.85931371422498},{"$f":"((E46*4)+(E52*8))/12","v":203.61179403623942},201.43381618513976,201.43381618513976,{"$f":"$G40/D40-1","v":7.7997195757683491E-2},-1.0696717552186596E-2,{"$f":"$G40/F40-1","v":0}]
[null,"CARE",null,104.26733922458469,{"$f":"((E47*4)+(E53*8))/12","v":110.97977942385789},109.66092543158022,109.66092543158022,5.1728434302692916E-2,-1.1883732326054219E-2,0]
[null,"Total",null,157.95212264285087,{"$f":"((E48*4)+(E54*8))/12","v":171.19058892190591},169.31330442139392,169.31330442139392,7.192800950343714E-2,-1.0966049666248701E-2,{"$f":"$G42/F42-1","v":0}]
[]
[null,"Bundled Residential Monthly Average Bills - Summer"]
[null,null,null,{"$f":"$D$32","v":"2025-01-01"},{"$f":"$E$32","v":"2025-11-15"},{"$f":"$D$3&\" Authorized\"","v":"2025 Authorized"},{"$f":"$D$3&\" w/Pending\"","v":"2025 w/Pending"},{"$f":"$H$32","v":"% Change over 1/1/2025"},{"$f":"$I$32","v":"% Change over 11/15/2025"},"% Change over Authorized"]
[null,"Non-CARE",null,{"$f":"VLOOKUP($D$4,'Res Bill Impact'!$B$37:$J$46,2,FALSE)+O19","v":257.94911025955139},{"$f":"VLOOKUP($D$4,'Res Bill Impact'!$B$37:$J$46,4,FALSE)","v":272.88753625101879},{"$f":"VLOOKUP($D$4,'Res Bill Impact'!$B$37:$J$46,6,FALSE)","v":269.91037976504401},{"$f":"VLOOKUP($D$4,'Res Bill Impact'!$B$37:$J$46,8,FALSE)","v":269.91037976504401},{"$f":"$G46/D46-1","v":4.63706561866295E-2},-1.0909829473619514E-2,{"$f":"$G46/F46-1","v":0}]
[null,"CARE",null,{"$f":"VLOOKUP($D$4,'Res Bill Impact'!$B$52:$J$61,2,FALSE)","v":145.43341208684404},{"$f":"VLOOKUP($D$4,'Res Bill Impact'!$B$52:$J$61,4,FALSE)","v":152.87465182804561},{"$f":"VLOOKUP($D$4,'Res Bill Impact'!$B$52:$J$61,6,FALSE)","v":151.07249031908427},{"$f":"VLOOKUP($D$4,'Res Bill Impact'!$B$52:$J$61,8,FALSE)","v":151.07249031908427},3.8774296437966482E-2,-1.1788491338566964E-2,0]
[null,"Total",null,{"$f":"D46*0.65+D47*0.35","v":218.5686158991038},{"$f":"E46*0.65+E47*0.35","v":230.88302670297819},{"$f":"F46*0.65+F47*0.35","v":228.31711845895811},{"$f":"G46*0.65+G47*0.35","v":228.31711845895811},4.4601566056283293E-2,-1.1113455504553005E-2,{"$f":"$G48/F48-1","v":0}]
[]
[null,"Bundled Residential Monthly Average Bills - Winter"]
[null,null,null,{"$f":"$D$32","v":"2025-01-01"},{"$f":"$E$32","v":"2025-11-15"},{"$f":"$D$3&\" Authorized\"","v":"2025 Authorized"},{"$f":"$D$3&\" w/Pending\"","v":"2025 w/Pending"},{"$f":"$H$32","v":"% Change over 1/1/2025"},{"$f":"$I$32","v":"% Change over 11/15/2025"},"% Change over Authorized"]
[null,"Non-CARE",null,{"$f":"VLOOKUP($D$4,'Res Bill Impact'!$B$37:$J$46,3,FALSE)","v":151.31441544156175},{"$f":"VLOOKUP($D$4,'Res Bill Impact'!$B$37:$J$46,5,FALSE)","v":168.97392292884976},{"$f":"VLOOKUP($D$4,'Res Bill Impact'!$B$37:$J$46,7,FALSE)","v":167.19553439518762},{"$f":"VLOOKUP($D$4,'Res Bill Impact'!$B$37:$J$46,9,FALSE)","v":167.19553439518762},{"$f":"$G52/D52-1","v":0.10495443482553868},-1.0524633048917043E-2,{"$f":"$G52/F52-1","v":0}]
[null,"CARE",null,{"$f":"VLOOKUP($D$4,'Res Bill Impact'!$B$52:$J$61,3,FALSE)","v":83.684302793455004},{"$f":"VLOOKUP($D$4,'Res Bill Impact'!$B$52:$J$61,5,FALSE)","v":90.032343221764023},{"$f":"VLOOKUP($D$4,'Res Bill Impact'!$B$52:$J$61,7,FALSE)","v":88.955142987828197},{"$f":"VLOOKUP($D$4,'Res Bill Impact'!$B$52:$J$61,9,FALSE)","v":88.955142987828197},6.2984813381099514E-2,-1.1964591783227396E-2,0]
[null,"Total",null,{"$f":"D52*0.65+D53*0.35","v":127.6438760147244},{"$f":"E52*0.65+E53*0.35","v":141.34437003136975},{"$f":"F52*0.65+F53*0.35","v":139.81139740261182},{"$f":"G52*0.65+G53*0.35","v":139.81139740261182},9.5323972976845583E-2,-1.0845657513049223E-2,0]
[]
[]
[null,"Bundled Residential Monthly Average Bills"]
[null,null,null,{"$f":"$D$32","v":"2025-01-01"},{"$f":"$E$32","v":"2025-11-15"},{"$f":"$D$3&\" Authorized\"","v":"2025 Authorized"},{"$f":"$D$3&\" w/Pending\"","v":"2025 w/Pending"},{"$f":"$H$32","v":"% Change over 1/1/2025"},{"$f":"$I$32","v":"% Change over 11/15/2025"},"% Change over Authorized"]
[null,"Essential Use (Basic) - Non-CARE",null,{"$f":"((D66*4)+(D73*8))/12","v":129.72997977466665},147.10950726866665,145.58335094935555,145.58335094935555,{"$f":"$G59/D59-1","v":0.12220283393418607},-1.0374287479080979E-2,{"$f":"$G59/F59-1","v":0}]
[null,"Essential Use (Basic) - CARE",null,77.884621844666682,83.844208941666665,82.838396246114186,82.838396246114186,6.3604011730676868E-2,-1.1996209496737631E-2,{"$f":"$G60/F60-1","v":0}]
[null,"Essential Use (All-Electric) - Non-CARE",null,127.70372090266669,145.16878100066666,143.66501328261685,143.66501328261685,0.12498690145540525,-1.0358754187258068E-2,0]
[null,"Essential Use (All-Electric) - CARE",null,76.614529592666699,82.565174091666663,81.574116594581952,81.574116594581952,6.473428771649048E-2,-1.2003335643480884E-2,0]
[]
[null,"Bundled Residential Monthly Average Bills - Summer"]
[null,null,null,{"$f":"$D$32","v":"2025-01-01"},{"$f":"$E$32","v":"2025-11-15"},{"$f":"$D$3&\" Authorized\"","v":"2025 Authorized"},{"$f":"$D$3&\" w/Pending\"","v":"2025 w/Pending"},{"$f":"$H$32","v":"% Change over 1/1/2025"},{"$f":"$I$32","v":"% Change over 11/15/2025"},"% Change over Authorized"]
[null,"Essential Use (Basic) - Non-CARE",null,{"$f":"VLOOKUP($D$4,'Res Bill Impact'!$L$37:$T$46,2,FALSE)","v":162.82554135066664},{"$f":"VLOOKUP($D$4,'Res Bill Impact'!$L$37:$T$46,4,FALSE)","v":178.80803631266664},{"$f":"VLOOKUP($D$4,'Res Bill Impact'!$L$37:$T$46,6,FALSE)","v":176.91619950608785},{"$f":"VLOOKUP($D$4,'Res Bill Impact'!$L$37:$T$46,8,FALSE)","v":176.91619950608785},{"$f":"$G66/D66-1","v":8.6538377447031412E-2},-1.0580267227311313E-2,{"$f":"$G66/F66-1","v":0}]
[null,"Essential Use (Basic) - CARE",null,{"$f":"VLOOKUP($D$4,'Res Bill Impact'!$V$37:$AD$46,2,FALSE)","v":98.629461960666674},{"$f":"VLOOKUP($D$4,'Res Bill Impact'!$V$37:$AD$46,4,FALSE)","v":104.73511149166666},{"$f":"VLOOKUP($D$4,'Res Bill Impact'!$V$37:$AD$46,6,FALSE)","v":103.48829722114071},{"$f":"VLOOKUP($D$4,'Res Bill Impact'!$V$37:$AD$46,8,FALSE)","v":103.48829722114071},4.926352799543543E-2,-1.1904453556868089E-2,{"$f":"$G67/F67-1","v":0}]
[null,"Essential Use (All-Electric) - Non-CARE",null,{"$f":"VLOOKUP($D$4,'Res Bill Impact'!$L$52:$T$61,2,FALSE)","v":118.24784616666668},{"$f":"VLOOKUP($D$4,'Res Bill Impact'!$L$52:$T$61,4,FALSE)","v":136.11205841666666},{"$f":"VLOOKUP($D$4,'Res Bill Impact'!$L$52:$T$61,6,FALSE)","v":134.71277083783619},{"$f":"VLOOKUP($D$4,'Res Bill Impact'!$L$52:$T$61,8,FALSE)","v":134.71277083783619},0.13924079976867154,-1.0280408621453407E-2,0]
[null,"Essential Use (All-Electric) - CARE",null,{"$f":"VLOOKUP($D$4,'Res Bill Impact'!$V$52:$AD$61,2,FALSE)","v":70.687432416666681},{"$f":"VLOOKUP($D$4,'Res Bill Impact'!$V$52:$AD$61,4,FALSE)","v":76.596344791666667},{"$f":"VLOOKUP($D$4,'Res Bill Impact'!$V$46:$AD$61,6,FALSE)","v":75.67414488743151},{"$f":"VLOOKUP($D$4,'Res Bill Impact'!$V$52:$AD$61,8,FALSE)","v":75.67414488743151},7.0545955628585899E-2,-1.2039737754372393E-2,0]
[]
[null,"Bundled Residential Monthly Average Bills - Winter"]
[null,null,null,{"$f":"$D$32","v":"2025-01-01"},{"$f":"$E$32","v":"2025-11-15"},{"$f":"$D$3&\" Authorized\"","v":"2025 Authorized"},{"$f":"$D$3&\" w/Pending\"","v":"2025 w/Pending"},{"$f":"$H$32","v":"% Change over 1/1/2025"},{"$f":"$I$32","v":"% Change over 11/15/2025"},"% Change over Authorized"]
[null,"Essential Use (Basic) - Non-CARE",null,{"$f":"VLOOKUP($D$4,'Res Bill Impact'!$L$37:$T$46,3,FALSE)","v":113.18219898666668},{"$f":"VLOOKUP($D$4,'Res Bill Impact'!$L$37:$T$46,5,FALSE)","v":131.26024274666665},{"$f":"VLOOKUP($D$4,'Res Bill Impact'!$L$37:$T$46,7,FALSE)","v":129.9169266709894},{"$f":"VLOOKUP($D$4,'Res Bill Impact'!$L$37:$T$46,9,FALSE)","v":129.9169266709894},{"$f":"$G73/D73-1","v":0.14785653427968959},-1.0233990487659383E-2,{"$f":"$G73/F73-1","v":0}]
[null,"Essential Use (Basic) - CARE",null,{"$f":"VLOOKUP($D$4,'Res Bill Impact'!$V$37:$AD$46,3,FALSE)","v":67.512201786666679},{"$f":"VLOOKUP($D$4,'Res Bill Impact'!$V$37:$AD$46,5,FALSE)","v":73.398757666666668},{"$f":"VLOOKUP($D$4,'Res Bill Impact'!$V$37:$AD$46,7,FALSE)","v":72.513445758600909},{"$f":"VLOOKUP($D$4,'Res Bill Impact'!$V$37:$AD$46,9,FALSE)","v":72.513445758600909},7.4079112213489617E-2,-1.2061674287272228E-2,0]
[null,"Essential Use (All-Electric) - Non-CARE",null,{"$f":"VLOOKUP($D$4,'Res Bill Impact'!$L$52:$T$61,3,FALSE)","v":132.43165827066667},{"$f":"VLOOKUP($D$4,'Res Bill Impact'!$L$52:$T$61,5,FALSE)","v":149.69714229266665},{"$f":"VLOOKUP($D$4,'Res Bill Impact'!$L$52:$T$61,7,FALSE)","v":148.14113450500719},{"$f":"VLOOKUP($D$4,'Res Bill Impact'!$L$52:$T$61,9,FALSE)","v":148.14113450500719},0.11862326908444465,-1.0394372022262011E-2,0]
[null,"Essential Use (All-Electric) - CARE",null,{"$f":"VLOOKUP($D$4,'Res Bill Impact'!$V$52:$AD$61,3,FALSE)","v":79.578078180666694},{"$f":"VLOOKUP($D$4,'Res Bill Impact'!$V$52:$AD$61,5,FALSE)","v":85.549588741666668},{"$f":"VLOOKUP($D$4,'Res Bill Impact'!$V$46:$AD$61,7,FALSE)","v":84.524102448157166},{"$f":"VLOOKUP($D$4,'Res Bill Impact'!$V$52:$AD$61,9,FALSE)","v":84.524102448157166},6.2153100207590795E-2,-1.1987039430500945E-2,0]
[]
[]
[null,"Bundled Residential Monthly Average Bills"]
[null,null,null,{"$f":"$D$32","v":"2025-01-01"},{"$f":"$E$32","v":"2025-11-15"},{"$f":"$D$3&\" Authorized\"","v":"2025 Authorized"},{"$f":"$D$3&\" w/Pending\"","v":"2025 w/Pending"},{"$f":"$H$32","v":"% Change over 1/1/2025"},{"$f":"$I$32","v":"% Change over 11/15/2025"},"% Change over Authorized"]
[null,{"$f":"J4&\"kWh Monthly Usage - Non-CARE\"","v":"500kWh Monthly Usage - Non-CARE"},null,{"$f":"((D86*4)+(D91*8))/12","v":166.70811298666666},183.73048802666668,181.78186484558992,181.78186484558992,{"$f":"$G81/D81-1","v":9.0420025689624817E-2},{"$f":"$G81/E81-1","v":-1.0605878218719611E-2},{"$f":"$G81/F81-1","v":0}]
[null,{"$f":"J4&\"kWh Monthly Usage - CARE\"","v":"500kWh Monthly Usage - CARE"},null,101.47539544000001,108.12917858666667,106.84320968825891,106.84320968825891,{"$f":"$G82/D82-1","v":5.2897692341911107E-2},{"$f":"$G82/E82-1","v":-1.1892894362246942E-2},0]
[]
[null,"Bundled Residential Monthly Average Bills - Summer"]
[null,null,null,{"$f":"$D$32","v":"2025-01-01"},{"$f":"$E$32","v":"2025-11-15"},{"$f":"$D$3&\" Authorized\"","v":"2025 Authorized"},{"$f":"$D$3&\" w/Pending\"","v":"2025 w/Pending"},{"$f":"$H$32","v":"% Change over 1/1/2025"},{"$f":"$I$32","v":"% Change over 11/15/2025"},"% Change over Authorized"]
[null,{"$f":"J4&\"kWh Monthly Usage - Non-CARE\"","v":"500kWh Monthly Usage - Non-CARE"},null,{"$f":"VLOOKUP($D$4,'Res Bill Impact'!$L$67:$T$76,2,FALSE)","v":158.14666666666665},{"$f":"VLOOKUP($D$4,'Res Bill Impact'!$L$67:$T$76,4,FALSE)","v":174.32666666666665},{"$f":"VLOOKUP($D$4,'Res Bill Impact'!$L$67:$T$76,6,FALSE)","v":172.48652782479473},{"$f":"VLOOKUP($D$4,'Res Bill Impact'!$L$67:$T$76,8,FALSE)","v":172.48652782479473},{"$f":"$G86/D86-1","v":9.0674444554389E-2},{"$f":"$G86/E86-1","v":-1.0555693383333509E-2},{"$f":"$G86/F86-1","v":0}]
[null,{"$f":"J4&\"kWh Monthly Usage - CARE\"","v":"500kWh Monthly Usage - CARE"},null,{"$f":"VLOOKUP($D$4,'Res Bill Impact'!$V$67:$AD$76,2,FALSE)","v":95.696666666666687},{"$f":"VLOOKUP($D$4,'Res Bill Impact'!$V$67:$AD$76,4,FALSE)","v":101.78166666666667},{"$f":"VLOOKUP($D$4,'Res Bill Impact'!$V$67:$AD$76,6,FALSE)","v":100.5689239185519},{"$f":"VLOOKUP($D$4,'Res Bill Impact'!$V$67:$AD$76,8,FALSE)","v":100.5689239185519},{"$f":"$G87/D87-1","v":5.0913552390036809E-2},{"$f":"$G87/E87-1","v":-1.1915139413922859E-2},0]
[]
[null,"Bundled Residential Monthly Average Bills - Winter"]
[null,null,null,{"$f":"$D$32","v":"2025-01-01"},{"$f":"$E$32","v":"2025-11-15"},{"$f":"$D$3&\" Authorized\"","v":"2025 Authorized"},{"$f":"$D$3&\" w/Pending\"","v":"2025 w/Pending"},{"$f":"$H$32","v":"% Change over 1/1/2025"},{"$f":"$I$32","v":"% Change over 11/15/2025"},"% Change over Authorized"]
[null,{"$f":"J4&\"kWh Monthly Usage - Non-CARE\"","v":"500kWh Monthly Usage - Non-CARE"},null,{"$f":"VLOOKUP($D$4,'Res Bill Impact'!$L$67:$T$76,3,FALSE)","v":170.98883614666667},{"$f":"VLOOKUP($D$4,'Res Bill Impact'!$L$67:$T$76,5,FALSE)","v":188.43239870666667},{"$f":"VLOOKUP($D$4,'Res Bill Impact'!$L$67:$T$76,7,FALSE)","v":186.4295333559875},{"$f":"VLOOKUP($D$4,'Res Bill Impact'!$L$67:$T$76,9,FALSE)","v":186.4295333559875},{"$f":"$G91/D91-1","v":9.0302370361047934E-2},{"$f":"$G91/E91-1","v":-1.0629092260280748E-2},{"$f":"$G91/F91-1","v":0}]
[null,{"$f":"J4&\"kWh Monthly Usage - CARE\"","v":"500kWh Monthly Usage - CARE"},null,{"$f":"VLOOKUP($D$4,'Res Bill Impact'!$V$67:$AD$76,3,FALSE)","v":104.36475982666667},{"$f":"VLOOKUP($D$4,'Res Bill Impact'!$V$67:$AD$76,5,FALSE)","v":111.30293454666668},{"$f":"VLOOKUP($D$4,'Res Bill Impact'!$V$67:$AD$76,7,FALSE)","v":109.9803525731124},{"$f":"VLOOKUP($D$4,'Res Bill Impact'!$V$67:$AD$76,9,FALSE)","v":109.9803525731124},{"$f":"$G92/D92-1","v":5.3807365204235014E-2},{"$f":"$G92/E92-1","v":-1.1882723298726194E-2},0]
[]
[]
[null,"Bundled Residential Monthly Average Bills"]
[null,null,null,{"$f":"$D$32","v":"2025-01-01"},{"$f":"$E$32","v":"2025-11-15"},{"$f":"$D$3&\" Authorized\"","v":"2025 Authorized"},{"$f":"$D$3&\" w/Pending\"","v":"2025 w/Pending"},{"$f":"$H$32","v":"% Change over 1/1/2025"},{"$f":"$I$32","v":"% Change over 11/15/2025"},"% Change over Authorized"]
[null,"All-Electric - Non-CARE",null,{"$f":"((D103*4)+(D109*8))/12","v":139.73811524275743},{"$f":"((E103*4)+(E109*8))/12","v":157.36670238301022},155.72221703643712,155.72221703643712,{"$f":"$G97/D97-1","v":0.11438612697696393},-1.0450021012517907E-2,{"$f":"$G97/F97-1","v":0}]
[null,"All-Electric - CARE",null,{"$f":"((D104*4)+(D110*8))/12","v":81.865819568528522},88.107318013380606,87.052325250183458,87.052325250183458,6.3353737970135438E-2,-1.1973951619284717E-2,0]
[null,"All-Electric - Total",null,{"$f":"((D105*4)+(D111*8))/12","v":119.48281175677732},133.12591785363986,131.68775491124836,131.68775491124836,0.10214810795812013,-1.080302743131234E-2,{"$f":"$G99/F99-1","v":0}]
[]
[null,"Bundled Residential Monthly Average Bills - Summer"]
[null,null,null,{"$f":"$D$32","v":"2025-01-01"},{"$f":"$E$32","v":"2025-11-15"},{"$f":"$D$3&\" Authorized\"","v":"2025 Authorized"},{"$f":"$D$3&\" w/Pending\"","v":"2025 w/Pending"},{"$f":"$H$32","v":"% Change over 1/1/2025"},{"$f":"$I$32","v":"% Change over 11/15/2025"},"% Change over Authorized"]
[null,"All-Electric - Non-CARE",null,{"$f":"VLOOKUP($D$4,'Res Bill Impact'!$B$67:$J$76,2,FALSE)","v":182.74270527969233},{"$f":"VLOOKUP($D$4,'Res Bill Impact'!$B$67:$J$76,4,FALSE)","v":199.89902692033894},{"$f":"VLOOKUP($D$4,'Res Bill Impact'!$B$67:$J$76,6,FALSE)","v":197.76388028346278},{"$f":"VLOOKUP($D$4,'Res Bill Impact'!$B$67:$J$76,8,FALSE)","v":197.76388028346278},{"$f":"$G103/D103-1","v":8.2198493126060201E-2},{"$f":"$G103/E103-1","v":-1.0681125715169326E-2},{"$f":"$G103/F103-1","v":0}]
[null,"All-Electric - CARE",null,{"$f":"VLOOKUP($D$4,'Res Bill Impact'!$B$82:$J$91,2,FALSE)","v":106.12090488259082},{"$f":"VLOOKUP($D$4,'Res Bill Impact'!$B$82:$J$91,4,FALSE)","v":113.04094129330475},{"$f":"VLOOKUP($D$4,'Res Bill Impact'!$B$82:$J$91,6,FALSE)","v":111.69830933089762},{"$f":"VLOOKUP($D$4,'Res Bill Impact'!$B$82:$J$91,8,FALSE)","v":111.69830933089762},{"$f":"$G104/D104-1","v":5.2557075860571345E-2},{"$f":"$G104/E104-1","v":-1.1877395455540674E-2},{"$f":"$G104/F104-1","v":0}]
[null,"All-Electric - Total",null,{"$f":"D103*0.65+D104*0.35","v":155.92507514070681},{"$f":"E103*0.65+E104*0.35","v":169.49869695087699},{"$f":"F103*0.65+F104*0.35","v":167.64093045006499},{"$f":"G103*0.65+G104*0.35","v":167.64093045006499},{"$f":"$G105/D105-1","v":7.5137724312691834E-2},{"$f":"$G105/E105-1","v":-1.0960358599986231E-2},{"$f":"$G105/F105-1","v":0}]
[]
[null,"Bundled Residential Monthly Average Bills - Winter"]
[null,null,null,{"$f":"$D$32","v":"2025-01-01"},{"$f":"$E$32","v":"2025-11-15"},{"$f":"$D$3&\" Authorized\"","v":"2025 Authorized"},{"$f":"$D$3&\" w/Pending\"","v":"2025 w/Pending"},{"$f":"$H$32","v":"% Change over 1/1/2025"},{"$f":"$I$32","v":"% Change over 11/15/2025"},"% Change over Authorized"]
[null,"All-Electric - Non-CARE",null,{"$f":"VLOOKUP($D$4,'Res Bill Impact'!$B$67:$J$76,3,FALSE)","v":118.23582022428999},{"$f":"VLOOKUP($D$4,'Res Bill Impact'!$B$67:$J$76,5,FALSE)","v":136.10054011434588},{"$f":"VLOOKUP($D$4,'Res Bill Impact'!$B$67:$J$76,7,FALSE)","v":134.70138541292431},{"$f":"VLOOKUP($D$4,'Res Bill Impact'!$B$67:$J$76,9,FALSE)","v":134.70138541292431},{"$f":"$G109/D109-1","v":0.13926037944676661},-1.0280302343003589E-2,{"$f":"$G109/F109-1","v":0}]
[null,"All-Electric - CARE",null,{"$f":"VLOOKUP($D$4,'Res Bill Impact'!$B$82:$J$91,3,FALSE)","v":69.738276911497366},{"$f":"VLOOKUP($D$4,'Res Bill Impact'!$B$82:$J$91,5,FALSE)","v":75.640506373418518},{"$f":"VLOOKUP($D$4,'Res Bill Impact'!$B$82:$J$91,7,FALSE)","v":74.729333209826393},{"$f":"VLOOKUP($D$4,'Res Bill Impact'!$B$82:$J$91,9,FALSE)","v":74.729333209826393},7.1568391410975263E-2,-1.2046100790149228E-2,0]
[null,"All-Electric - Total",null,{"$f":"D109*0.65+D110*0.35","v":101.26168006481257},{"$f":"E109*0.65+E110*0.35","v":114.93952830502131},{"$f":"F109*0.65+F110*0.35","v":113.71116714184004},{"$f":"G109*0.65+G110*0.35","v":113.71116714184004},0.12294371443431684,-1.0687021090964532E-2,0]
[]
[null,"Small Commercial Monthly Average Bills"]
[null,null,null,{"$f":"$D$32","v":"2025-01-01"},{"$f":"$E$32","v":"2025-11-15"},{"$f":"$D$3&\" Authorized\"","v":"2025 Authorized"},{"$f":"$D$3&\" w/Pending\"","v":"2025 w/Pending"},{"$f":"$H$32","v":"% Change over 1/1/2025"},{"$f":"$I$32","v":"% Change over 11/15/2025"},"% Change over Authorized"]
[null,"NAICS 531",null,{"$f":"((D121*4)+(D127*8))/12","v":200.01926318686915},{"$f":"((E121*4)+(E127*8))/12","v":218.97116877072119},218.15396310885112,218.15396310885112,{"$f":"$G115/D115-1","v":9.066476714814975E-2},-3.7320240215082956E-3,{"$f":"$G115/F115-1","v":0}]
[null,"NAICS 621",null,{"$f":"((D122*4)+(D128*8))/12","v":276.15071000888247},302.60796377198847,301.45692133459357,301.45692133459357,9.1639131852665257E-2,-3.803741392153781E-3,0]
[null,"NAICS 722",null,{"$f":"((D123*4)+(D129*8))/12","v":798.56103234169098},879.28982265194372,875.83695107022106,875.83695107022106,9.6768957661165889E-2,-3.926886781549177E-3,{"$f":"$G117/F117-1","v":0}]
[]
[null,"Small Commercial Monthly Average Bills - Summer"]
[null,null,null,{"$f":"D114","v":"2025-01-01"},{"$f":"$E$32","v":"2025-11-15"},{"$f":"$D$3&\" Authorized\"","v":"2025 Authorized"},{"$f":"$D$3&\" w/Pending\"","v":"2025 w/Pending"},{"$f":"$H$32","v":"% Change over 1/1/2025"},{"$f":"$I$32","v":"% Change over 11/15/2025"},"% Change over Authorized"]
[null,"NAICS 531",null,{"$f":"'Bill Impact (GS1)'!C37","v":221.67376357053666},{"$f":"'Bill Impact (GS1)'!E37","v":244.01758868702501},{"$f":"'Bill Impact (GS1)'!G37","v":243.10041008784697},{"$f":"'Bill Impact (GS1)'!I37","v":243.10041008784697},{"$f":"$G121/D121-1","v":9.6658468608046721E-2},{"$f":"$G121/E121-1","v":-3.7586577431285573E-3},{"$f":"$G121/F121-1","v":0}]
[null,"NAICS 621",null,{"$f":"'Bill Impact (GS1)'!C38","v":369.4697689996658},{"$f":"'Bill Impact (GS1)'!E38","v":408.18922386145016},{"$f":"'Bill Impact (GS1)'!G38","v":406.61675318277014},{"$f":"'Bill Impact (GS1)'!I38","v":406.61675318277014},{"$f":"$G122/D122-1","v":0.10054133598989523},{"$f":"$G122/E122-1","v":-3.8523081618974109E-3},{"$f":"$G122/F122-1","v":0}]
[null,"NAICS 722",null,{"$f":"'Bill Impact (GS1)'!C39","v":1048.7876611703905},{"$f":"'Bill Impact (GS1)'!E39","v":1162.6425736294943},{"$f":"'Bill Impact (GS1)'!G39","v":1158.0586978202546},{"$f":"'Bill Impact (GS1)'!I39","v":1158.0586978202546},{"$f":"$G123/D123-1","v":0.10418795023572591},{"$f":"$G123/E123-1","v":-3.9426354351793647E-3},{"$f":"$G123/F123-1","v":0}]
[]
[null,"Small Commercial Monthly Average Bills - Winter"]
[null,null,null,{"$f":"D114","v":"2025-01-01"},{"$f":"$E$32","v":"2025-11-15"},{"$f":"$D$3&\" Authorized\"","v":"2025 Authorized"},{"$f":"$D$3&\" w/Pending\"","v":"2025 w/Pending"},{"$f":"$H$32","v":"% Change over 1/1/2025"},{"$f":"$I$32","v":"% Change over 11/15/2025"},"% Change over Authorized"]
[null,"NAICS 531",null,{"$f":"'Bill Impact (GS1)'!D37","v":189.19201299503538},{"$f":"'Bill Impact (GS1)'!F37","v":206.44795881256928},{"$f":"'Bill Impact (GS1)'!H37","v":205.68073961935315},{"$f":"'Bill Impact (GS1)'!J37","v":205.68073961935315},{"$f":"$G127/D127-1","v":8.7153397034527291E-2},-3.7162837435107399E-3,{"$f":"$G127/F127-1","v":0}]
[null,"NAICS 621",null,{"$f":"'Bill Impact (GS1)'!D38","v":229.4911805134908},{"$f":"'Bill Impact (GS1)'!F38","v":249.81733372725762},{"$f":"'Bill Impact (GS1)'!H38","v":248.87700541050532},{"$f":"'Bill Impact (GS1)'!J38","v":248.87700541050532},8.4473071486400375E-2,-3.7640635368357822E-3,0]
[null,"NAICS 722",null,{"$f":"'Bill Impact (GS1)'!D39","v":673.44771792734139},{"$f":"'Bill Impact (GS1)'!F39","v":737.61344716316853},{"$f":"'Bill Impact (GS1)'!H39","v":734.72607769520425},{"$f":"'Bill Impact (GS1)'!J39","v":734.72607769520425},9.0992007451533574E-2,-3.914475094060399E-3,0]

{"sheet":"Selected Data","index":1,"n_rows":76,"n_cols":21,"rows_kept":76,"cut":false,"hidden":false,"merged":[]}
["Summary of Selected Data "]
[null,null,null,null,null,null,null,null,null,null,null,null,null,"2025 Revenue"]
[null,null,null,null,null,null,null,null,null,null,null,null,null," Requirement"]
[null,null,null,null,null,null,null,null,null,null,null,null,null,"$000"]
[1,"Current total system-level revenue requirement that is used for defining the reporting threshold:",null,null,null,null,null,null,null,null,null,null,null,{"$f":"'Authorized Rev Req'!J99","v":19339861.87672767}]
[]
[null,"A","One-percent reporting threshold",null,null,null,null,null,null,null,null,null,null,{"$f":"N5*0.01","v":193398.6187672767}]
[]
[2,"List of currently open proceedings that exceed the threshold for use of the affordability metrics (proceedings shaded gray filed prior to D.22-08-023):"]
[null,null,null,null,null,null,null,null,null,null,null,null,null,"Annual Revenue"]
[null,"A","A.24-10-002","Woolsey WEMA FRC/CEMA",null,null,null,null,null,null,null,null,null,{"$f":"SUM('Incremental Rev Req'!D113:D114)","v":419967}]
[null,"B","A.25-03-012","2026 Cost of Capital",null,null,null,null,null,null,null,null,null,{"$f":"SUM('Incremental Rev Req'!D116:D118)","v":-65059.64101280352}]
[null,"C","A.25-03-009","NextGen",null,null,null,null,null,null,null,null,null,145266,"Average annual revenue requirement from 2025-2032"]
[null,"D","A.25-05-008 ","2026 ERRA (Amended October Update)",null,null,null,null,null,null,null,null,null,{"$f":"SUM('Incremental Rev Req'!M93:M104)","v":261527.86889668636},"Incremental change from the current 2025 ERRA revenue requirement"]
[]
[]
[]
[3,"List of currently open proceedings for which affordability metrics have been filed:",null,null,null,null,null,null,null,null,null,null,null,"Annual Revenue"]
[null,"A",{"$f":"C11","v":"A.24-10-002"},{"$f":"D11","v":"Woolsey WEMA FRC/CEMA"},null,null,null,null,null,null,null,null,null,{"$f":"N11","v":419967}]
[null,"B",{"$f":"C12","v":"A.25-03-012"},{"$f":"D12","v":"2026 Cost of Capital"},null,null,null,null,null,null,null,null,null,{"$f":"N12","v":-65059.64101280352}]
[null,"C",{"$f":"C13","v":"A.25-03-009"},"NextGen",null,null,null,null,null,null,null,null,null,{"$f":"N13","v":145266}]
[null,"D","A.25-05-008 ","2026 ERRA (Amended October Update)",null,null,null,null,null,null,null,null,null,{"$f":"N14","v":261527.86889668636}]
[]
[]
[]
[4,"List of currently open proceedings that do not exceed the threshold for use of the affordability metrics (proceedings shaded gray filed prior to D.22-08-023):"]
[null,null,null,null,null,null,null,null,null,null,null,null,null,"Annual Revenue"]
[null,"A",{"$f":"'Incremental Rev Req'!B105","v":"A.23-04-003"},{"$f":"'Incremental Rev Req'!A105","v":"2022 ERRA Review"},null,null,null,null,null,null,null,null,null,{"$f":"'Incremental Rev Req'!D105+'Incremental Rev Req'!D106","v":50874}]
[null,"B",{"$f":"'Incremental Rev Req'!B108","v":"A.24-04-001"},"2023 ERRA Review",null,null,null,null,null,null,null,null,null,{"$f":"SUM('Incremental Rev Req'!D107:D108)","v":-63195}]
[null,"C","A.24-08-012","Section 851 - Sale of Hydroelectric San Bernardino",null,null,null,null,null,null,null,null,null,{"$f":"'Incremental Rev Req'!D111","v":60300}]
[null,"D","A.24-09-008","Section 851 - Sale of Hydroelectric Fontana Union Water",null,null,null,null,null,null,null,null,null,{"$f":"'Incremental Rev Req'!D112","v":9500}]
[null,"E","A.25-03-001","Section 851 - Sale of Hydroelectric TULE",null,null,null,null,null,null,null,null,null,{"$f":"'Incremental Rev Req'!D115","v":31100}]
[null,"F","A.25-04-004","2024 ERRA Review",null,null,null,null,null,null,null,null,null,{"$f":"SUM('Incremental Rev Req'!D109:D110)","v":3992}]
[null,"G","A.25-06-022","IQP 2027 Bridge Funding",null,null,null,null,null,null,null,null,null,{"$f":"SUM('Incremental Rev Req'!D121:D122)","v":72176.28}]
[null,"H","A.25-12-XXX","2024 WMCE (to be filed 12/4)",null,null,null,null,null,null,null,null,null,{"$f":"'Incremental Rev Req'!D123","v":50000}]
[]
[]
[]
[5,"Total system-level revenue requirement if all pending revenue were granted in full"]
[null,"A","YE 2025",null,null,null,null,null,null,null,null,null,null,{"$f":"'Incremental Rev Req'!$T$83","v":19403169.590911627}]
[null,"B","YE 2026",null,null,null,null,null,null,null,null,null,null,{"$f":"'Incremental Rev Req'!$U$83","v":19328689.035859909}]
[null,"C","YE 2027",null,null,null,null,null,null,null,null,null,null,{"$f":"'Incremental Rev Req'!$V$83","v":18547799.59832019}]
[null,"D","YE 2028",null,null,null,null,null,null,null,null,null,null,{"$f":"'Incremental Rev Req'!$W$83","v":19091839.30215634}]
[null,"E","YE 2029",null,null,null,null,null,null,null,null,null,null,{"$f":"'Incremental Rev Req'!$X$83","v":19199570.30215634}]
[]
[6,"Bundled residential average rate (RAR) if all pending revenue were granted in full (from Cost and Rate Tracker (CRT) as submitted by utility):"]
[null,null,null,null,null,null,null,null,null,null,null,null,null,"cents/kWh"]
[null,"A","YE 2025",null,null,null,null,null,null,null,null,null,null,35.197078523586271,null,null,null,{"$f":"Summary!G33","v":35.197078523586271},{"$f":"Summary!G33","v":35.197078523586271}]
[null,"B","YE 2026",null,null,null,null,null,null,null,null,null,null,33.233999331651304]
[null,"C","YE 2027",null,null,null,null,null,null,null,null,null,null,31.539482316175388]
[null,"D","YE 2028",null,null,null,null,null,null,null,null,null,null,31.908253344763104]
[null,"E","YE 2029",null,null,null,null,null,null,null,null,null,null,32.081905912159975]
[]
[7,"Bundled residential average monthly bill corresponding to RAR above for typical customer in climate zone 9 using 500 kWh (from CRT as submitted by utility):"]
[null,null,null,null,null,null,null,null,null,null,null,null,"Non-CARE","CARE"]
[null,"A","YE 2025",null,null,null,null,null,null,null,null,null,181.78186484558992,106.84320968825891,null,null,{"$f":"Summary!G81","v":181.78186484558992},{"$f":"Summary!G82","v":106.84320968825891},{"$f":"Summary!G81","v":181.78186484558992},{"$f":"Summary!G82","v":106.84320968825891}]
[null,"B","YE 2026",null,null,null,null,null,null,null,null,null,170.72501111733007,99.546380754442509]
[null,"C","YE 2027",null,null,null,null,null,null,null,null,null,162.35073667838853,94.019885647646461]
[null,"D","YE 2028",null,null,null,null,null,null,null,null,null,164.52091960677859,95.45207006219448]
[null,"E","YE 2029",null,null,null,null,null,null,null,null,null,165.4403952173501,96.058866209095569]
[]
[8,"Bundled small commercial average rate (TOU-GS-1) if all pending revenue were granted in full (from Cost and Rate Tracker (CRT) as submitted by utility):"]
[null,null,null,null,null,null,null,null,null,null,null,null,null,"cents/kWh"]
[null,"A","YE 2025",null,null,null,null,null,null,null,null,null,null,31.833930226113377,null,null,null,{"$f":"Summary!G34","v":31.833930226113377},{"$f":"Summary!G34","v":31.833930226113377}]
[null,"B","YE 2026",null,null,null,null,null,null,null,null,null,null,29.951013989553932]
[null,"C","YE 2027",null,null,null,null,null,null,null,null,null,null,28.247906260554913]
[null,"D","YE 2028",null,null,null,null,null,null,null,null,null,null,28.474253239109125]
[null,"E","YE 2029",null,null,null,null,null,null,null,null,null,null,28.607793200288214]
[]
[9,"Bundled small commercial average monthly bill corresponding to TOU-GS-1 rate above for typical customer by NAICS (from CRT as submitted by utility):"]
[null,null,null,null,null,null,null,null,null,null,null,"NAICS 531","NAICS 621","NAICS 722"]
[null,"A","YE 2025",null,null,null,null,null,null,null,null,218.15396310885112,301.45692133459357,875.83695107022106,null,{"$f":"Summary!G115","v":218.15396310885112},{"$f":"Summary!G116","v":301.45692133459357},{"$f":"Summary!G117","v":875.83695107022106},{"$f":"Summary!G115","v":218.15396310885112},{"$f":"Summary!G116","v":301.45692133459357},{"$f":"Summary!G117","v":875.83695107022106}]
[null,"B","YE 2026",null,null,null,null,null,null,null,null,205.25966254360469,283.29516861599592,821.35572796410031,null,{"$f":"M73/M72-1","v":-6.0246593902017365E-2},-6.2204755165385373E-2,{"$error":"#DIV/0!"},-1.0002761654798449,-1.0002063470790121,{"$error":"#DIV/0!"}]
[null,"C","YE 2027",null,null,null,null,null,null,null,null,194.15457273094879,267.65353733287856,774.43430926167719,null,-5.5213194632060425E-2,-5.7126793062888259E-2,{"$error":"#DIV/0!"},-8.3546619716677428E-2,-8.1633021285851926E-2,{"$error":"#DIV/0!"}]
[null,"D","YE 2028",null,null,null,null,null,null,null,null,195.82507229396779,270.00645285757554,781.49253308165032,null,8.790900161990578E-3,9.1140381250700564E-3,{"$error":"#DIV/0!"},-1.1592173794791798,-1.1595405174422593,{"$error":"#DIV/0!"}]
[null,"E","YE 2029",null,null,null,null,null,null,null,null,196.72293253325401,271.27109808274793,785.28618778724251,null,4.6837592649664472E-3,4.8543710208370783E-3,{"$error":"#DIV/0!"},-0.46720367895682313,-0.46737429071268399,{"$error":"#DIV/0!"}]

{"sheet":"Authorized Rev Req","index":2,"n_rows":105,"n_cols":14,"rows_kept":105,"cut":false,"hidden":false,"merged":[[102,1,103,2],[104,1,105,11]]}
[]
[null,"Annual Period 2025"]
[null,"Reporting Date: Quarter Ended December 31"]
[null,null,"January 1, 2024","March 1, 2024","June 1, 2024","October 1, 2024","January 1, 2025","March 1, 2025","June 1, 2025","October 1, 2025","January 1, 20261"]
[null,null,"5178-E","5235-E","5307-E","5379-E / E-A","5449-E","5484-E","5555-E","5643-E","5687-E"]
[null,"Filing Description",null,null,null,null,null,null,null,null,null,"Revenue Recovery Mechanism","Authority for Revenue Requirement","Balancing Account "]
["Safety Affordability Reliability Proceedings","Safety Affordability Reliability Proceedings"]
["2018 GRC (Attrition Years)","General Rate Case (GRC-G)",754977,766648.83474591305,766648.83474591305,766648.83474591305,760627.57525422366,760627.57525422366,760627.57525422366,891445.04850682383,922658.06501504721,"Generation","D.25-09-030; Advice 5677-E","N"]
["2018 GRC (Attrition Years)","General Rate Case (GRC-N)",61347,62607.606140024051,62607.606140024051,62607.606140024051,61952.343776436493,61952.343776436493,61952.343776436493,65975.905899915058,65590.073438758889,"New System Gen","D.25-09-030; Advice 5677-E","N"]
["2018 GRC (Attrition Years)","General Rate Case (GRC-D)",7565233,7752988.2460202966,7752988.2460202966,7752988.2460202966,7655298.4891713113,7655298.4891713113,7655298.4891713113,8702553.2886549234,9198253.0440584607,"Distribution","D.25-09-030; Advice 5677-E","N"]
["2018 GRC Memo Account/One-Time/FF&U","2025 GRCRRMA (24-month amortization)",0,0,0,0,0,0,0,51458.934570626829,51504.780689855201,"Generation","D.25-09-030; Advice 5642-E/E-A; Uncollectibles Factor Update only","Y"]
["2018 GRC Memo Account/One-Time/FF&U","2025 GRCRRMA (24-month amortization)",0,0,0,0,0,0,0,1530.6625465673762,1532.0262541177535,"New System Gen","D.25-09-030; Advice 5642-E/E-A; Uncollectibles Factor Update only","Y"]
["Non-utility Affiliate Credits","2025 GRCRRMA (24-month amortization)",0,0,0,0,0,0,0,398114.14928574377,398468.8396598635,"Distribution","D.25-09-030; Advice 5642-E/E-A; Uncollectibles Factor Update only","Y"]
[null,"2025 GRC One-Time Recovery of Accounts",0,0,0,0,0,0,0,52205.497004632591,52252.008255983244,"Distribution","D.25-09-030; Advice 5642-E/E-A; Uncollectibles Factor Update only","N"]
[null,"2025 GRC - FF&U Impact on Non-GRC Items",0,0,0,0,0,0,0,1496.8491641683504,0,"Generation","Now Incorporated in individual Line Items","N"]
[null,"2025 GRC - FF&U Impact on Non-GRC Items",0,0,0,0,0,0,0,174.95518485258799,0,"New System Gen","Now Incorporated in individual Line Items","N"]
[null,"2025 GRC - FF&U Impact on Non-GRC Items",0,0,0,0,0,0,0,1.5385848029409317,0,"MCAM","Now Incorporated in individual Line Items","N"]
[null,"2025 GRC - FF&U Impact on Non-GRC Items",0,0,0,0,0,0,0,122.30124915373744,0,"Distribution","Now Incorporated in individual Line Items","N"]
[null,"2025 GRC - FF&U Impact on Non-GRC Items",0,0,0,0,0,0,0,416.7023247985635,0,"Public Purpose","Now Incorporated in individual Line Items","N"]
[null,"2025 GRC - FF&U Impact on Non-GRC Items",0,0,0,0,0,0,0,-0.29909578675665216,0,"Nuclear","Now Incorporated in individual Line Items","N"]
["Pole Loading & Deteriorated Poles Balancing Account","Non-utility Affiliate Credits",-4485.8914764990359,-4485.8914764990359,-4485.8914764990359,-4485.8914764990359,-4572.5803140547996,-4572.5803140547996,-4572.5803140547996,-4572.5803140547996,-4508.1031541244702,"Distribution","D.15-10-037","N"]
["Tax Accounting Memorandum Account (TAMA)","Pole Loading & Deteriorated Pole Programs Balancing Account",-51916.650430410773,-51916.650430410773,-51916.650430410773,-51916.650430410773,-14072.56849006865,-14072.56849006865,-14072.56849006865,-14072.56849006865,4694.932147861372,"Distribution","D.21-08-036","Y"]
[null,"2023/2024 TAMA Balance",19974.103589806855,19974.103589806855,19974.103589806855,19974.103589806855,14976.030088812353,14976.030088812353,14976.030088812353,14976.030088812353,-5713.7619465120224,"Generation","Advice 5515-E","Y"]
[null,"2023/2024 TAMA Balance",129422.39223046113,129422.39223046113,129422.39223046113,97197.380394544045,97197.380394544045,97197.380394544045,97197.380394544045,-37050.255779514962,-37083.264827566243,"Distribution","Advice 5515-E","Y"]
["Pension/PBOP/Medical Balancing Accounts","Pension/PBOP/Medical Balancing Accounts",-12071.660011385939,-12071.660011385939,-12071.660011385939,-12071.660011385939,-10009.343023179386,-10009.343023179386,-10009.343023179386,-10009.343023179386,-3022.5309987429223,"Generation","D.21-08-036; D.25-09-030","Y"]
["2019 ERRA Forecast","Pension/PBOP/Medical Balancing Accounts",-78219.429064886717,-78219.429064886717,-78219.429064886717,-78219.429064886717,-64990.518798429417,-64990.518798429417,-64990.518798429417,-64990.518798429417,-20485.738754430789,"Distribution","D.21-08-036; D.25-09-030","Y"]
["2019 ERRA Forecast","ERRA Forecast",4703703,4703703,4703703,4703703,4088354.6687030564,4088354.6687030564,4088354.6687030564,4088354.6687030564,4215455.4352467358,"Generation","A.25-05-008 (Amended October Update)","N"]
["2020 ERRA Forecast","ERRA Forecast",402997,402997,402997,402997,457466.73907256091,457466.73907256091,457466.73907256091,457466.73907256091,473468.50744434149,"New System Gen","A.25-05-008 (Amended October Update)","N"]
["2019 ERRA Forecast","ERRA Forecast (BA)",222439.78249055831,222439.78249055831,222439.78249055831,222439.78249055831,78023.957609340869,78023.957609340869,78023.957609340869,78023.957609340869,-23473.581057849922,"New System Gen","A.25-05-008 (Amended October Update)","Y"]
["2019 ERRA Forecast","ERRA Forecast",-955105,-955105,-955105,-955105,-641623.9438718505,-641623.9438718505,-641623.9438718505,-641623.9438718505,-443279,"GHG Revenue","A.25-05-008 (Amended October Update)","N"]
["2019 ERRA Forecast","ERRA Forecast",4958,4958,4958,4958,5157.1790224296492,5157.1790224296492,5157.1790224296492,5157.1790224296492,5336.996733802267,"Nuclear","A.25-05-008 (Amended October Update)","N"]
["2019 ERRA Forecast","ERRA Forecast",-3582,-3582,-3582,-3582,-19169.386585016884,-19169.386585016884,-19169.386585016884,-19169.386585016884,-2686.1566957162595,"Distribution","A.25-05-008 (Amended October Update)","N"]
[null,"ERRA Forecast",6584.5460872713084,6584.5460872713084,6584.5460872713084,6584.5460872713084,2344.4997013776792,2344.4997013776792,2344.4997013776792,2344.4997013776792,28843.044462928839,"Public Purpose","A.25-05-008 (Amended October Update)","N"]
[null,"Modified CAM (MCAM) Rate Component:",2362.884396062841,2362.884396062841,2362.884396062841,2362.884396062841,4709.1936642246847,4709.1936642246847,4709.1936642246847,4709.1936642246847,6367.1398930982486,"MCAM","A.25-05-008 (Amended October Update)","A portion is in the Balancing Account"]
["2018 ERRA Balancing Account Trigger","TMNBA/BMNBC BA",8772.9520004042643,8772.9520004042643,8772.9520004042643,8772.9520004042643,18400.889046503136,18400.889046503136,18400.889046503136,18400.889046503136,11080.477872680807,"Public Purpose","A.25-05-008 (Amended October Update)","Y"]
[null,"ERRA/PABA/ESMA Balancing Account",676260.15705896821,676260.15705896821,676260.15705896821,676260.15705896821,459053.56166877813,459053.56166877813,459053.56166877813,459053.56166877813,442848.92492462648,"Generation","A.25-05-008 (Amended October Update)","Y"]
[null,"2023 ERRA Trigger",459077.86021180276,459077.86021180276,0,{"$f":"E37","v":0},0,0,0,0,0,"Generation","D.23-04-012; Advice 5036-E","Y"]
[null,"2024 ERRA Trigger",null,null,null,-750729.82256741822,-750729.82256741822,-750729.82256741822,-750729.82256741822,0,0,"Generation","D.24-08-015","Y"]
[null,"DAC-GT/CSGT Clean Energy Programs (BA)",2572.4539127286921,2572.4539127286921,2572.4539127286921,2572.4539127286921,2996.6903924306757,2996.6903924306757,2996.6903924306757,2996.6903924306757,3280.1284958733913,"Public Purpose","A.25-05-008 (Amended October Update)","N"]
[null,"2021 ERRA Review",0,0,0,0,0,0,0,0,2037.6740343573588,"Generation","D.25-06-006; Advice 5604-E","N"]
[null,"2021 ERRA Review",0,0,0,0,0,0,0,0,26947.029256805465,"Distribution","D.25-06-006; Advice 5604-E","N"]
["BRRBA","BRRBA Balancing Account",4756.555824788984,4756.555824788984,4756.555824788984,4756.555824788984,-484.35668115041807,-484.35668115041807,-484.35668115041807,-484.35668115041807,699.40449881808797,"Generation","D.15-10-037","Y"]
["NDAM Balancing Account","BRRBA (Inc. FRC FF)",695357.18504806422,695357.18504806422,695357.18504806422,695357.18504806422,676672.12182817794,676672.12182817794,676672.12182817794,676675.81947442214,351336.31923031004,"Distribution","D.15-10-037; D.25-08-033","Y"]
["CARE Balancing Account","NDAM Balancing Account",1927,1927,1927,1927,-6072.6306642878781,-6072.6306642878781,-6072.6306642878781,-6072.6306642878781,-4226,"Nuclear","D.15-10-037","Y"]
["PPPAM Balancing Account","CARE Balancing Account",55214.930722502482,55214.930722502482,55214.930722502482,55214.930722502482,107382.17470550838,107382.17470550838,107382.17470550838,107382.17470550838,-91436.179503370688,"Public Purpose","D.15-10-037","Y"]
[null,"PPPAM Balancing Account",57989.277856698558,57989.277856698558,57989.277856698558,57989.277856698558,191863.32063009514,191863.32063009514,191863.32063009514,191863.32063009514,216363,"Public Purpose","D.15-10-037","Y"]
[null,"Intentionally Left Blank"]
[null,"Intentionally Left Blank"]
[null,"Emergency Reliability UOS",17006,17591,17591,17591,29550.512537807663,29550.512537807663,29550.512537807663,29550.512537807663,30251.683420036719,"Generation","Advice 4894-E; Advice 5142-E; Advice 5408-E; Advice 5674-E","N"]
[null,"Emergency Reliability UOS",62428,64611,64611,64611,79159.143714744365,79159.143714744365,79159.143714744365,79159.143714744365,81599.115176889041,"Distribution","Advice 4894-E; Advice 5142-E; Advice 5408-E; Advice 5674-E","N"]
[null,"2021 GRC Track 2 O&M (36-Month Amortization)",135161.69012109609,135161.69012109609,135161.69012109609,135161.69012109609,135161.69012109609,0,0,0,0,"Distribution","D.21-01-012; Advice 4658-E/E-A","N"]
[null,"2021 GRC Track 3 O&M (36-Month Amortization)",135415.57954872175,135415.57954872175,135415.57954872175,135415.57954872175,135415.57954872175,135415.57954872175,135415.57954872175,0,0,"Distribution","D.22-06-032","N"]
[null,"VMBA Undercollection Threshold",29215.513444206365,29215.513444206365,29215.513444206365,34738.530283465407,34738.530283465407,34738.530283465407,34738.530283465407,39014.127446854989,39048.886159864582,"Distribution","Advice 5534-E; Uncollectibles Factor Update only","Y"]
[null,"WRMBA Undercollection",0,0,0,129014.05782358669,129014.05782358669,129014.05782358669,129014.05782358669,0,0,"Distribution","Advice 5267-E","Y"]
[null,"2020 Vegetation Management Z-Factor",37644.69531487787,37644.69531487787,37644.69531487787,0,0,0,0,0,0,"Distribution","Resolution E-5287","N"]
[null,"2021 Wildfire Mitigation/Vegetation Management",0,0,378956.96673910116,378956.96673910116,378956.96673910116,378956.96673910116,0,0,0,"Distribution","D.24-03-008","N"]
[null,"2022 WM/VM (non-IRR portion)",0,0,0,0,0,0,0,137017.1376651804,137139.2098394713,"Distribution","D.25-06-051; Advice 5601-E; Uncollectibles Factor Update only","N"]
[null,"2022 WM/VM (55% Interm Rate Recovery)",0,0,0,149902.81456841179,149902.81456841179,149902.81456841179,149902.81456841179,149902.81456841179,150085.38671919479,"Distribution","D.24-07-012; Uncollectibles Factor Update only","N"]
[null,"2023 WMCE",0,0,0,0,0,0,0,416027.00882850366,416397.65824066353,"Distribution","D.25-06-017; Uncollectibles Factor Update only","N"]
[null,"Mobilehome Master Meter Balancing Account",18034.352362473768,18034.352362473768,18034.352362473768,18034.352362473768,23332.929382073369,23332.929382073369,23332.929382073369,23332.929382073369,17467.806515932261,"Distribution","D.15-10-037","Y"]
[null,"WEMA 2",214140.32573293196,214140.32573293196,0,0,0,0,0,0,0,"Distribution","D.23-05-033","N"]
[null,"CEMA - 2020 Storms",0,0,0,288149.18073814461,288149.18073814461,288149.18073814461,288149.18073814461,0,0,"Distribution","D.24-05-037","N"]
[null,"CEMA Reimbursement - 2020 Creek",137221.32981912937,137221.32981912937,137221.32981912937,137221.32981912937,0,0,0,-16761.221435292795,-16776.154448631438,"Distribution","Advice 5495-E; Uncollectibles Factor Update only","N"]
[null,"2017 Thomas Fire - CEMA",0,0,0,0,0,0,34656.779359488304,34656.779359488304,34698.98912562972,"Distribution","D.25-01-042; Uncollectibles Factor Update only","N"]
[null,"Wildfire Self-Insurance Credit",0,0,-24268.433138949924,-24268.433138949924,-24268.433138949924,-24268.433138949924,0,0,0,"Distribution","D.23-05-013","N"]
[null,"CSRP Track 2",38155.50099652254,38155.50099652254,0,0,0,0,0,0,0,"Distribution","D.23-03-019","N"]
[null,"Diablo Canyon Extended Operations NBC",0,0,0,0,282858.69088729238,282858.69088729238,282858.69088729238,282858.69088729238,121955,"DCPP","PD in A.25-03-015","N"]
["SJV DAC Pilots","GSRP Recovery Bonds FRC #1 (AB 1054)",19256.772000000001,19256.772000000001,19256.772000000001,19256.772000000001,19256.772000000001,19256.772000000001,19256.772000000001,19256.772000000001,19256.772000000001,"Securitization","D.20-11-007; Advice 4416-E","N"]
["SJV DAC Pilots","2021 GRC Tracks 1 and 2 Recovery Bonds FRC #2 (AB 1054)",31732.126,31732.126,31732.126,31732.126,31732.126,31732.126,31732.126,31732.126,31732.126,"Securitization","D.21-10-025; Advice 4717-E-A","N"]
["SJV DAC Pilots","2021 GRC Tracks 1 and 3 Recovery Bonds FRC #3 (AB 1054)",55255.381999999998,55255.381999999998,55255.381999999998,55255.381999999998,55255.381999999998,55255.381999999998,55255.381999999998,55255.381999999998,55255.381999999998,"Securitization","D.23-02-023; Advice 5018-E","N"]
[null,"2017 Thomas Fire - WEMA Recovery Bonds FRC #4",null,null,null,null,null,null,null,null,128100,"Securitization","D.25-08-033; Advice 5691-E","N"]
[]
["Public Policy Proceedings","   Subtotal Safety Affordability Reliability",{"$f":"SUM(C8:C72)","v":15661213.717786893},15864669.404693127,15507984.251352021,15259973.791603215,14918967.606939852,14783805.916818757,14463774.162578093,16755856.87640827,17089315.395425055]
["Demand Response","Public Policy Proceedings"]
["Energy Efficiency","Demand Response",10.111847141229134,11.123031855352048,11.123031855352048,11.123031855352048,11.042137078222215,11.042137078222215,11.042137078222215,11.042137078222215,12.148995278090503,"Generation","D.23-12-005; Uncollectibles Factor Update only","N"]
[null,"Demand Response (Inc. ELPBA 2023-2025)",40702.880866330495,49287.83908923401,49287.83908923401,49287.83908923401,52035.594681178991,52035.594681178991,52035.594681178991,52035.594681178991,57799.195402503276,"Distribution","D.23-12-005","N"]
[null,"Energy Efficiency (Inc. IDSM)",288996.5912963287,288996.5912963287,288996.5912963287,288996.5912963287,482807.02955389564,482807.02955389564,482807.02955389564,482807.02955389564,243133.16108757805,"Public Purpose","D.23-08-005; Advice 5123-E; D.24-09-031; Advice 5670-E","N"]
[null,"New Home Energy Storage Pilot (NHESP)",5055.9235706145673,5055.9235706145673,0,0,0,0,0,0,0,"Public Purpose","D.22-04-044; Advice 4852-E","N"]
[null,"Energy Efficiency Market Transformation",6441,6441,6441,6441,6441,6441,6441,6441,8632.8735613564768,"Public Purpose","D.19-12-021; D.25-11-023","N"]
[null,"2020 RUBA Uncollectibles (36-Month Amortization)",25700.148339297579,25700.148339297579,25700.148339297579,25700.148339297579,25700.148339297579,0,0,0,0,"Public Purpose","Advice 4658-E/E-A","N"]
["CA Solar Initiatives/MASH/SASH","Charge Ready Programs (Pilot, Bridge and Schools and Parks)",41775,42322,42322,42322,76686.145320994081,76686.145320994081,76686.145320994081,76686.145320994081,73455.546949577096,"Distribution","Advice 5676-E","N"]
[null,"Transportation Electrification",15804,16033,16033,16033,27307.651041586287,27307.651041586287,27307.651041586287,27307.651041586287,21431.884751383113,"Distribution","Advice 5676-E","N"]
[null,"Low Income Programs (ESAP)",92017.808985185125,92017.808985185125,92017.808985185125,92017.808985185125,92462.203432163165,92462.203432163165,92462.203432163165,92462.203432163165,75728.055877278952,"Public Purpose","D.21-06-015","N"]
["Statewide ME&O","Low Income Programs (CARE/FERA Admin)",10571.120160090763,10571.120160090763,10571.120160090763,10571.120160090763,10971.649414170137,10971.649414170137,10971.649414170137,10971.649414170137,11089.155401848269,"Public Purpose","D.21-06-015; Advice 4638-E","N"]
["Self-Generation Incentive Program (SGIP)","EPIC - RD&D and Renewables",76885.429738335733,76885.429738335733,76885.429738335733,76885.429738335733,76885.429738335733,76885.429738335733,76885.429738335733,76885.429738335733,45469.534369507644,"Public Purpose","D.20-08-042; D.21-11-028","N"]
["Aliso Canyon Energy Storage","Self-Generation Incentive Program (SGIP)",56626.343990883157,56626.343990883157,56626.343990883157,56626.343990883157,0,0,0,0,0,"Public Purpose","D.20-01-021; D.21-11-028; Advice 4169-E","N"]
["Non-CPUC Jurisdictional Proceedings","   Subtotal Public Policy ",{"$f":"SUM(C75:C86)","v":660586.35879420734},669948.32820182503,664892.40463121049,664892.40463121049,851307.89365870005,825607.74531940243,825607.74531940243,825607.74531940243,536751.55639631092]
["DWR Bond/Power","Non-CPUC Jurisdictional Proceedings"]
["Wildfire Fund Charge","DWR Bond/Power",0,0,0,0,0,0,0,0,0,"DWR",null,"N"]
["Wildfire Fund Charge","DWR Bond Refund",0,0,0,0,0,0,0,0,0,"DWR",null,"N"]
["FERC Base Transmission","Wildfire Fund Charge (AB1054)",408912,408912,408912,408912,416803,416803,416803,416803,426374.14794351778,"DWR","PD in R.23-03-007","N"]
["TRBAA","FERC Base Transmission",1124500.46,1124500.46,1124500.46,1124500.46,1344347,1344347,1344347,1344347,1496918,"FERC","ER26-XXX","N"]
["RSBAA","TRBAA (BA)",-283956,-283956,-283956,-283956,-214482,-214482,-214482,{"$f":"I93","v":-214482},-178588.59299999999,"TOTCA","ER26-378","Y"]
["TACBAA","RSBAA (BA)",4738,4738,4738,4738,8496,8496,8496,{"$f":"I94","v":8496},9616.6239999999998,"TOTCA","ER26-318","Y"]
["Total Approved, Implemented Since Jan 1 or To Be Implemented","TACBAA (BA)",98974,98974,270811,270811,270811,270811,203233.255,{"$f":"I95","v":203233.255},213984.53,"TOTCA","ER25-1824-000","Y"]
[null,"   Subtotal Non-CPUC Jurisdictional",{"$f":"SUM(C90:C95)","v":1353168.46},{"$f":"SUM(D90:D95)","v":1353168.46},1525005.46,1525005.46,1825975,{"$f":"SUM(H90:H95)","v":1825975},{"$f":"SUM(I90:I95)","v":1758397.2549999999},1758397.2549999999,{"$f":"SUM(K90:K95)","v":1968304.7089435179}]
[null,"PUCRF",80194.531436816702,{"$f":"C97","v":80194.531436816702},{"$f":"D97","v":80194.531436816702},{"$f":"E97","v":80194.531436816702},63307.714183956326,63307.714183956326,63307.714183956326,63307.714183956326,63307.714183956326,"PUCRF",null,"N"]
[null,"Total Authorized Revenue",{"$f":"C73+C87+C96+C97","v":17755163.068017915},17967980.724331766,17778076.647420049,17530066.18767124,17659558.214782506,17498696.376322113,17111086.87708145,19403169.590911627,19657679.374948837]
[null,"w/o PUCRF",{"$f":"C98-C97","v":17674968.536581099},17887786.192894951,{"$f":"E98-E97","v":17697882.115983233},17449871.656234425,17596250.50059855,{"$f":"H98-H97","v":17435388.662138157},{"$f":"I98-I97","v":17047779.162897494},19339861.87672767,{"$f":"K98-K97","v":19594371.66076488}]
[null,null,0,0,0,0,0,0,0,0,0]
[]
[]
[]
[]
[null,"1/ This advice letter is SCE's preliminary revenue requirement to be implemented on January 1, 2026. In accordance with OP 2 of Resolution E-5217, SCE will submit a separate Tier 1 advice letter (Final Tier 1 Advice Letter) on or before December 31, 2025 to update the preliminary consolidated electric revenue requirement and rate change estimates with actual rate and revenue requirement changes authorized by the CPUC and the FERC that were included in the revenue requirements used to calculate January 1, 2026 rates."]

{"sheet":"Incremental Rev Req","index":3,"n_rows":143,"n_cols":24,"rows_kept":143,"cut":false,"hidden":false,"merged":[]}
[]
["Annual Period 2025"]
["Reporting Date: Quarter Ended December 31"]
[]
["Current Revenue Requirement ($000):",{"$f":"'Authorized Rev Req'!J98","v":19403169.590911627},"Inc. PUCRF"]
["Current Revenue Requirement Effective:","October 1, 2025"]
["Approved Application(s), Implemented Since Jan 1 or To Be Implemented"]
["Filing Description","Proceeding","Authority for Revenue Requirement","Authorized Revenue Requirement ($000)","Revenue Recovery Mechanism",2025,{"$f":"F8+1","v":2026},{"$f":"G8+1","v":2027},2028,2029,"Existing or New Item (if existing, use delta from prior for rate impact)",null,null,null,null,null,null,null,"Total Authorized"]
["Safety Affordability Reliability Proceedings",null,null,null,null,null,null,null,null,null,null,null,null,null,null,null,null,null,null,{"$f":"F8","v":2025},{"$f":"G8","v":2026},2027,2028,2029]
["General Rate Case (GRC-G)",null,"D.25-09-030; Advice 5642-E/E-A",{"$f":"'Authorized Rev Req'!J8","v":891445.04850682383},"Generation",{"$f":"'Authorized Rev Req'!J8","v":891445.04850682383},{"$f":"'Authorized Rev Req'!K8","v":922658.06501504721},951366.09748959425,978765.38711851963,{"$f":"I10","v":978765.38711851963},"Existing",null,null,null,null,null,null,null,"Generation",{"$f":"SUMIF($E$10:$E$85,$S10,F$10:F$85)+'Authorized Rev Req'!J15","v":5525852.9476728207},{"$f":"SUMIF($E$10:$E$85,$S10,G$10:G$85)","v":5545835.6940799728},{"$f":"SUMIF($E$10:$E$85,$S10,H$10:H$85)","v":5064270.8366614543},{"$f":"SUMIF($E$10:$E$85,$S10,I$10:I$85)","v":5091670.1262903791},{"$f":"SUMIF($E$10:$E$85,$S10,J$10:J$85)","v":5091670.1262903791}]
["General Rate Case (GRC-N)",null,"D.25-09-030; Advice 5642-E/E-A",{"$f":"'Authorized Rev Req'!J9","v":65975.905899915058},"New System Gen",{"$f":"'Authorized Rev Req'!J9","v":65975.905899915058},{"$f":"'Authorized Rev Req'!K9","v":65590.073438758889},65692.064840915264,65401.217233242191,{"$f":"I11","v":65401.217233242191},"Existing",null,null,null,null,null,null,null,"New System Gen",{"$f":"SUMIF($E$10:$E$85,$S11,F$10:F$85)+'Authorized Rev Req'!J16","v":603172.22031323682},602612.7963747785,523158.80391347618,522867.95630580309,522867.95630580309]
["General Rate Case (GRC-D)",null,"D.25-09-030; Advice 5642-E/E-A",{"$f":"'Authorized Rev Req'!J10","v":8702553.2886549234},"Distribution",{"$f":"'Authorized Rev Req'!J10","v":8702553.2886549234},{"$f":"'Authorized Rev Req'!K10","v":9198253.0440584607},9718528.5872238073,10139271.546868203,10139271.546868203,"Existing",null,null,null,null,null,null,null,"Distribution",{"$f":"SUMIF($E$10:$E$85,$S12,F$10:F$85)+'Authorized Rev Req'!J18","v":10708193.85627551},10179607.219828445,9898223.4826890714,10318966.442333467,10318966.442333467]
["2025 GRCRRMA (24-month amortization)",null,"D.25-09-030; Advice 5642-E/E-A",{"$f":"'Authorized Rev Req'!J11","v":51458.934570626829},"Generation",{"$f":"'Authorized Rev Req'!J11","v":51458.934570626829},{"$f":"'Authorized Rev Req'!K11","v":51504.780689855201},null,0,null,"New",null,null,null,null,null,null,null,"GHG Revenue",{"$f":"SUMIF($E$10:$E$85,$S13,F$10:F$85)","v":-641623.9438718505},-641623.9438718505,-641623.9438718505,-641623.9438718505,-641623.9438718505]
["2025 GRCRRMA (24-month amortization)",null,"D.25-09-030; Advice 5642-E/E-A",{"$f":"'Authorized Rev Req'!J12","v":1530.6625465673762},"New System Gen",{"$f":"'Authorized Rev Req'!J12","v":1530.6625465673762},{"$f":"'Authorized Rev Req'!K12","v":1532.0262541177535},null,0,null,"New",null,null,null,null,null,null,null,"MCAM",{"$f":"SUMIF($E$10:$E$85,$S14,F$10:F$85)+'Authorized Rev Req'!J17","v":4710.7322490276256},4709.1936642246847,4709.1936642246847,4709.1936642246847,4709.1936642246847]
["2025 GRCRRMA (24-month amortization)",null,"D.25-09-030; Advice 5642-E/E-A",{"$f":"'Authorized Rev Req'!J13","v":398114.14928574377},"Distribution",{"$f":"'Authorized Rev Req'!J13","v":398114.14928574377},{"$f":"'Authorized Rev Req'!K13","v":398468.8396598635},null,0,null,"New",null,null,null,null,null,null,null,"Nuclear",{"$f":"SUMIF($E$10:$E$85,$S15,F$10:F$85)+'Authorized Rev Req'!J20","v":-915.75073764498552},931.17902242964919,5157.1790224296492,5157.1790224296492,5157.1790224296492]
["2025 GRC One-Time Recovery of Accounts",null,"D.25-09-030; Advice 5642-E/E-A",{"$f":"'Authorized Rev Req'!J14","v":52205.497004632591},"Distribution",{"$f":"'Authorized Rev Req'!J14","v":52205.497004632591},0,0,0,null,"New",null,null,null,null,null,null,null,"Public Purpose",{"$f":"SUMIF($E$10:$E$85,$S16,F$10:F$85)+'Authorized Rev Req'!J19","v":992971.5889392785},772395.54840082768,778860.80930379964,778860.80930379964,778860.80930379964]
["2025 GRC - FF&U Impact on Non-GRC Items",null,"D.25-09-030; Advice 5642-E/E-A",{"$f":"SUM('Authorized Rev Req'!J15:J20)","v":2212.0474119894234},"All Revenue Recovery Mechanisms Combined",{"$f":"SUM('Authorized Rev Req'!J15:L20)","v":2212.0474119894234},{"$f":"SUM('Authorized Rev Req'!K15:M20)","v":0},0,0,null,"New",null,null,null,null,null,null,null,"DCPP",{"$f":"SUMIF($E$10:$E$85,$S17,F$10:F$85)","v":282858.69088729238},282858.69088729238,282858.69088729238,282858.69088729238,282858.69088729238]
["Non-utility Affiliate Credits",null,"D.15-10-037",{"$f":"'Authorized Rev Req'!J21","v":-4572.5803140547996},"Distribution",{"$f":"'Authorized Rev Req'!J21","v":-4572.5803140547996},{"$f":"'Authorized Rev Req'!K21","v":-4508.1031541244702},0,0,0,"Existing",null,null,null,null,null,null,null,"DWR",416803,426374.14794351778,426374.14794351778,426374.14794351778,426374.14794351778]
["Pole Loading & Deteriorated Pole Programs Balancing Account",null,"D.21-08-036",{"$f":"'Authorized Rev Req'!J22","v":-14072.56849006865},"Distribution",{"$f":"'Authorized Rev Req'!J22","v":-14072.56849006865},{"$f":"'Authorized Rev Req'!K22","v":4694.932147861372},0,0,0,"Existing",null,null,null,null,null,null,null,"FERC",1344347,1496918,1496918,1496918,1496918]
["2023/2024 TAMA Balance",null,"Advice 5560-E",{"$f":"'Authorized Rev Req'!J23","v":14976.030088812353},"Generation",{"$f":"'Authorized Rev Req'!J23","v":14976.030088812353},{"$f":"'Authorized Rev Req'!K23","v":-5713.7619465120224},{"$f":"G20","v":-5713.7619465120224},{"$f":"H20","v":-5713.7619465120224},-5713.7619465120224,"Existing",null,null,null,null,null,null,null,"TOTCA",-2752.7449999999953,45012.561000000016,45012.561000000016,45012.561000000016,45012.561000000016]
["2023/2024 TAMA Balance",null,"Advice 5515-E",{"$f":"'Authorized Rev Req'!J24","v":-37050.255779514962},"Distribution",{"$f":"'Authorized Rev Req'!J24","v":-37050.255779514962},{"$f":"'Authorized Rev Req'!K24","v":-37083.264827566243},{"$f":"G21","v":-37083.264827566243},{"$f":"H21","v":-37083.264827566243},-37083.264827566243,"Existing",null,null,null,null,null,null,null,"Securitization",106244.28,228176.28,228176.28,228176.28,228176.28]
["Pension/PBOP/Medical Balancing Accounts",null,"D.21-08-036; D.25-09-030",{"$f":"'Authorized Rev Req'!J25","v":-10009.343023179386},"Generation",{"$f":"'Authorized Rev Req'!J25","v":-10009.343023179386},{"$f":"'Authorized Rev Req'!K25","v":-3022.5309987429223},0,0,0,"Existing",null,null,null,null,null,null,null,"PUCRF",63307.714183956326,80445,80445,80445,80445]
["Pension/PBOP/Medical Balancing Accounts",null,"D.21-08-036; D.25-09-030",{"$f":"'Authorized Rev Req'!J26","v":-64990.518798429417},"Distribution",{"$f":"'Authorized Rev Req'!J26","v":-64990.518798429417},{"$f":"'Authorized Rev Req'!K26","v":-20485.738754430789},0,0,0,"Existing",null,null,null,null,null,null,null,null,{"$f":"SUM(T10:T22)","v":19403169.590911627},{"$f":"SUM(U10:U22)","v":19024252.367329642},{"$f":"SUM(V10:V22)","v":18192541.041213419},{"$f":"SUM(W10:W22)","v":18640392.442879066},{"$f":"SUM(X10:X22)","v":18640392.442879066}]
["2025 ERRA Forecast F&PP",null,"D.24-12-039",{"$f":"'Authorized Rev Req'!J27","v":4088354.6687030564},"Generation",{"$f":"'Authorized Rev Req'!J27","v":4088354.6687030564},{"$f":"F24","v":4088354.6687030564},{"$f":"G24","v":4088354.6687030564},4088354.6687030564,4088354.6687030564,"Existing",null,null,null,null,null,null,null,"Check",{"$f":"T23=F85","v":true},{"$f":"U23=G85","v":true},{"$f":"V23=H85","v":true},{"$f":"W23=I85","v":true},{"$f":"X23=J85","v":true}]
["2025 ERRA Forecast F&PP",null,"D.24-12-039",{"$f":"'Authorized Rev Req'!J28","v":457466.73907256091},"New System Gen",{"$f":"'Authorized Rev Req'!J28","v":457466.73907256091},{"$f":"F25","v":457466.73907256091},457466.73907256091,457466.73907256091,457466.73907256091,"Existing"]
["2025 ERRA Forecast (BA)",null,"D.24-12-039",{"$f":"'Authorized Rev Req'!J29","v":78023.957609340869},"New System Gen",{"$f":"'Authorized Rev Req'!J29","v":78023.957609340869},78023.957609340869,0,0,0,"Existing"]
["2025 ERRA Forecast",null,"D.24-12-039",{"$f":"'Authorized Rev Req'!J30","v":-641623.9438718505},"GHG Revenue",{"$f":"'Authorized Rev Req'!J30","v":-641623.9438718505},-641623.9438718505,-641623.9438718505,{"$f":"H27","v":-641623.9438718505},-641623.9438718505,"Existing"]
["2025 ERRA Forecast",null,"D.24-12-039",{"$f":"'Authorized Rev Req'!J31","v":5157.1790224296492},"Nuclear",{"$f":"'Authorized Rev Req'!J31","v":5157.1790224296492},5157.1790224296492,5157.1790224296492,5157.1790224296492,5157.1790224296492,"Existing"]
["2025 ERRA Forecast",null,"D.24-12-039",{"$f":"'Authorized Rev Req'!J32","v":-19169.386585016884},"Distribution",{"$f":"'Authorized Rev Req'!J32","v":-19169.386585016884},-19169.386585016884,-19169.386585016884,-19169.386585016884,-19169.386585016884,"Existing"]
["2025 ERRA Forecast",null,"D.24-12-039",{"$f":"'Authorized Rev Req'!J33","v":2344.4997013776792},"Public Purpose",{"$f":"'Authorized Rev Req'!J33","v":2344.4997013776792},2344.4997013776792,2344.4997013776792,2344.4997013776792,2344.4997013776792,"Existing"]
["2025 ERRA Forecast",null,"D.24-12-039",{"$f":"'Authorized Rev Req'!J34","v":4709.1936642246847},"MCAM",{"$f":"'Authorized Rev Req'!J34","v":4709.1936642246847},4709.1936642246847,4709.1936642246847,4709.1936642246847,4709.1936642246847,"Existing"]
["2025 ERRA Forecast (BA)",null,"D.24-12-039",{"$f":"'Authorized Rev Req'!J35","v":18400.889046503136},"Public Purpose",{"$f":"'Authorized Rev Req'!J35","v":18400.889046503136},18400.889046503136,0,0,0,"Existing"]
["2025 ERRA/PABA (BA)",null,"D.24-12-039",{"$f":"'Authorized Rev Req'!J36","v":459053.56166877813},"Generation",{"$f":"'Authorized Rev Req'!J36","v":459053.56166877813},459053.56166877813,0,{"$f":"H33","v":0},{"$f":"I33","v":0},"Existing"]
["DAC-GT/CSGT Clean Energy Programs (BA)",null,"D.24-12-039",{"$f":"'Authorized Rev Req'!J39","v":2996.6903924306757},"Public Purpose",{"$f":"'Authorized Rev Req'!J39","v":2996.6903924306757},2996.6903924306757,2996.6903924306757,{"$f":"H34","v":2996.6903924306757},{"$f":"I34","v":2996.6903924306757},"Existing"]
["2024 ERRA Trigger",null,"D.24-08-015",{"$f":"'Authorized Rev Req'!J38","v":0},"Generation",{"$f":"'Authorized Rev Req'!J38","v":0},{"$f":"'Authorized Rev Req'!K38","v":0},0,0,0,"Existing"]
["2021 ERRA Review",null,"D.25-06-006; Advice 5604-E",{"$f":"'Authorized Rev Req'!J40","v":0},"Generation",{"$f":"'Authorized Rev Req'!J40","v":0},{"$f":"'Authorized Rev Req'!K40","v":2037.6740343573588},0,0,0,"New"]
["2021 ERRA Review",null,"D.25-06-006; Advice 5604-E",{"$f":"'Authorized Rev Req'!J41","v":0},"Distribution",{"$f":"'Authorized Rev Req'!J41","v":0},{"$f":"'Authorized Rev Req'!K41","v":26947.029256805465},0,null,null,"New"]
["2023 WMCE",null,"D.25-06-017",{"$f":"'Authorized Rev Req'!J59","v":416027.00882850366},"Distribution",{"$f":"'Authorized Rev Req'!J59","v":416027.00882850366},0,0,null,null,"New"]
["BRRBA Balancing Account",null,"D.15-10-037",{"$f":"'Authorized Rev Req'!J42","v":-484.35668115041807},"Generation",{"$f":"'Authorized Rev Req'!J42","v":-484.35668115041807},{"$f":"'Authorized Rev Req'!K42","v":699.40449881808797},0,{"$f":"H39","v":0},0,"Existing"]
["BRRBA Balancing Account",null,"D.15-10-037",{"$f":"'Authorized Rev Req'!J43","v":676675.81947442214},"Distribution",{"$f":"'Authorized Rev Req'!J43","v":676675.81947442214},{"$f":"'Authorized Rev Req'!K43","v":351336.31923031004},2198,2198,2198,"Existing"]
["NDAM Balancing Account",null,"D.15-10-037",{"$f":"'Authorized Rev Req'!J44","v":-6072.6306642878781},"Nuclear",{"$f":"'Authorized Rev Req'!J44","v":-6072.6306642878781},{"$f":"'Authorized Rev Req'!K44","v":-4226},0,0,0,"Existing"]
["CARE Balancing Account",null,"D.15-10-037",{"$f":"'Authorized Rev Req'!J45","v":107382.17470550838},"Public Purpose",{"$f":"'Authorized Rev Req'!J45","v":107382.17470550838},{"$f":"'Authorized Rev Req'!K45","v":-91436.179503370688},0,{"$f":"H42","v":0},0,"Existing"]
["PPPAM Balancing Account",null,"D.15-10-037",{"$f":"'Authorized Rev Req'!J46","v":191863.32063009514},"Public Purpose",{"$f":"'Authorized Rev Req'!J46","v":191863.32063009514},{"$f":"'Authorized Rev Req'!K46","v":216363},150000,{"$f":"H43","v":150000},150000,"Existing"]
["Emergency Reliability UOS",null,"Advice 4894-E; Advice 5142-E; Advice 5408-E; Advice 5674-E",{"$f":"'Authorized Rev Req'!J49","v":29550.512537807663},"Generation",{"$f":"'Authorized Rev Req'!J49","v":29550.512537807663},{"$f":"'Authorized Rev Req'!K49","v":30251.683420036719},{"$f":"G44","v":30251.683420036719},30251.683420036719,30251.683420036719,"Existing"]
["Emergency Reliability UOS",null,"Advice 4894-E; Advice 5142-E; Advice 5408-E; Advice 5674-E",{"$f":"'Authorized Rev Req'!J50","v":79159.143714744365},"Distribution",{"$f":"'Authorized Rev Req'!J50","v":79159.143714744365},{"$f":"'Authorized Rev Req'!K50","v":81599.115176889041},81599.115176889041,81599.115176889041,81599.115176889041,"Existing"]
["CEMA - 2020 Storms",null,"D.24-05-037",{"$f":"'Authorized Rev Req'!J62","v":0},"Distribution",{"$f":"'Authorized Rev Req'!J62","v":0},0,0,0,0,"Existing"]
["CEMA Reimbursement - 2020 Creek",null,"Advice 5495-E",{"$f":"'Authorized Rev Req'!J63","v":-16761.221435292795},"Distribution",{"$f":"'Authorized Rev Req'!J63","v":-16761.221435292795},0,0,0,0,"New"]
["2021 GRC Track 3 O&M (36-Month Amortization)",null,"D.22-06-032",{"$f":"'Authorized Rev Req'!J52","v":0},"Distribution",0,0,0,0,0,"Existing"]
["VMBA Undercollection Threshold",null,"Advice 5534-E",{"$f":"'Authorized Rev Req'!J53","v":39014.127446854989},"Distribution",{"$f":"'Authorized Rev Req'!J53","v":39014.127446854989},0,0,0,0,"Existing"]
["2022 WM/VM (55% Interm Rate Recovery)",null,"D.24-07-012",{"$f":"'Authorized Rev Req'!J58","v":149902.81456841179},"Distribution",{"$f":"'Authorized Rev Req'!J58","v":149902.81456841179},null,0,0,0,"Existing"]
["2022 WM/VM (Non-IRR Portion)",null,"D.25-06-051; Advice 5601-E",{"$f":"'Authorized Rev Req'!J57","v":137017.1376651804},"Distribution",{"$f":"'Authorized Rev Req'!J57","v":137017.1376651804},0,0,0,0,"Existing"]
["WRMBA Undercollection",null,"Advice 5267-E",{"$f":"'Authorized Rev Req'!J54","v":0},"Distribution",0,0,0,0,0,"Existing"]
["Mobilehome Master Meter Balancing Account",null,"D.15-10-037",{"$f":"'Authorized Rev Req'!J60","v":23332.929382073369},"Distribution",{"$f":"'Authorized Rev Req'!J60","v":23332.929382073369},{"$f":"'Authorized Rev Req'!K60","v":17467.806515932261},0,{"$f":"H53","v":0},0,"Existing"]
["2017 Thomas Fire - CEMA",null,"D.25-01-042",{"$f":"'Authorized Rev Req'!J64","v":34656.779359488304},"Distribution",{"$f":"'Authorized Rev Req'!J64","v":34656.779359488304},0,0,0,0,"Existing"]
["Diablo Canyon Extended Operations NBC",null,"D.24-12-033",{"$f":"'Authorized Rev Req'!J67","v":282858.69088729238},"DCPP",{"$f":"'Authorized Rev Req'!J67","v":282858.69088729238},{"$f":"F55","v":282858.69088729238},{"$f":"G55","v":282858.69088729238},{"$f":"H55","v":282858.69088729238},{"$f":"I55","v":282858.69088729238},"Existing"]
["GSRP Recovery Bonds FRC #1 (AB 1054)",null,"D.20-11-007; Advice 4416-E",{"$f":"'Authorized Rev Req'!J68","v":19256.772000000001},"Securitization",{"$f":"'Authorized Rev Req'!J68","v":19256.772000000001},{"$f":"'Authorized Rev Req'!K68","v":19256.772000000001},{"$f":"G56","v":19256.772000000001},19256.772000000001,19256.772000000001,"Existing"]
["2021 GRC Tracks 1 and 2 Recovery Bonds FRC #2 (AB 1054)",null,"D.21-10-025; Advice 4717-E-A",{"$f":"'Authorized Rev Req'!J69","v":31732.126},"Securitization",{"$f":"'Authorized Rev Req'!J69","v":31732.126},{"$f":"'Authorized Rev Req'!K69","v":31732.126},31732.126,31732.126,31732.126,"Existing"]
[{"$f":"'Authorized Rev Req'!$B$70","v":"2021 GRC Tracks 1 and 3 Recovery Bonds FRC #3 (AB 1054)"},null,"D.23-02-023; Advice 5018-E",{"$f":"'Authorized Rev Req'!J70","v":55255.381999999998},"Securitization",{"$f":"'Authorized Rev Req'!J70","v":55255.381999999998},{"$f":"'Authorized Rev Req'!K70","v":55255.381999999998},55255.381999999998,55255.381999999998,55255.381999999998,"Existing"]
["2017 Thomas Fire - WEMA Recovery Bonds FRC #4",null,"D.25-08-033; Advice 5691-E",{"$f":"'Authorized Rev Req'!J71","v":0},"Securitization",{"$f":"'Authorized Rev Req'!J71","v":0},121932,{"$f":"G59","v":121932},121932,121932,"New"]
["Section 851 - Sale of GO 5 Property",null,"D.25-07-011",0,"Distribution",0,29400,0,0,0,"New"]
[]
[]
["Public Policy Proceedings"]
["Demand Response",null,"D.23-12-005; Advice 5421-E",{"$f":"'Authorized Rev Req'!J75","v":11.042137078222215},"Generation",{"$f":"'Authorized Rev Req'!J75","v":11.042137078222215},{"$f":"'Authorized Rev Req'!K75","v":12.148995278090503},{"$f":"G64","v":12.148995278090503},{"$f":"H64","v":12.148995278090503},{"$f":"I64","v":12.148995278090503},"Existing"]
["Demand Response",null,"D.23-12-005; Advice 5421-E",{"$f":"'Authorized Rev Req'!J76","v":52035.594681178991},"Distribution",{"$f":"'Authorized Rev Req'!J76","v":52035.594681178991},{"$f":"'Authorized Rev Req'!K76","v":57799.195402503276},57263,57263,{"$f":"I65","v":57263},"Existing"]
["Energy Efficiency (Inc. IDSM)",null,"D.23-08-005; Advice 5123-E; D.24-09-031",{"$f":"'Authorized Rev Req'!J77","v":482807.02955389564},"Public Purpose",{"$f":"'Authorized Rev Req'!J77","v":482807.02955389564},{"$f":"F66","v":482807.02955389564},482600,482600,482600,"Existing"]
["Energy Efficiency Market Transformation",null,"D.19-12-021; D.25-11-023",{"$f":"'Authorized Rev Req'!$J79","v":6441},"Public Purpose",{"$f":"'Authorized Rev Req'!J79","v":6441},{"$f":"'Authorized Rev Req'!K79","v":8632.8735613564768},{"$f":"G67","v":8632.8735613564768},8632.8735613564768,8632.8735613564768,"Existing"]
["Charge Ready Programs (Pilot, Bridge and Schools and Parks)",null,"Advice 5141-E; Advice 5407-E; Advice 5676-E",{"$f":"'Authorized Rev Req'!$J81","v":76686.145320994081},"Distribution",{"$f":"'Authorized Rev Req'!J81","v":76686.145320994081},{"$f":"'Authorized Rev Req'!K81","v":73455.546949577096},{"$f":"G68","v":73455.546949577096},73455.546949577096,73455.546949577096,"Existing",null,null,null,null,null,null,null,"Total w/Authorized and Pending"]
["Transportation Electrification",null,"Advice 5141-E; Advice 5407-E; Advice 5676-E",{"$f":"'Authorized Rev Req'!$J82","v":27307.651041586287},"Distribution",{"$f":"'Authorized Rev Req'!J82","v":27307.651041586287},{"$f":"'Authorized Rev Req'!K82","v":21431.884751383113},21431.884751383113,21431.884751383113,21431.884751383113,"Existing",null,null,null,null,null,null,null,null,{"$f":"T9","v":2025},{"$f":"U9","v":2026},{"$f":"V9","v":2027},{"$f":"W9","v":2028},{"$f":"X9","v":2029}]
["TE Funding Cycle 1",null,"D.22-11-040; Advice 4954-E",0,"Distribution",0,0,0,{"$f":"H70","v":0},{"$f":"H70","v":0},"On hold",null,null,null,null,null,null,null,"Generation",{"$f":"T10+SUMIFS(L$93:L$142,$Q$93:$Q$142,\"Y\",$E$93:$E$142,$S70)","v":5525852.9476728207},{"$f":"U10+SUMIFS(M$93:M$142,$Q$93:$Q$142,\"Y\",$E$93:$E$142,$S70)","v":5753042.5934985848},{"$f":"V10+SUMIFS(N$93:N$142,$Q$93:$Q$142,\"Y\",$E$93:$E$142,$S70)","v":5186221.8085080935},{"$f":"W10+SUMIFS(O$93:O$142,$Q$93:$Q$142,\"Y\",$E$93:$E$142,$S70)","v":5213523.7758601801},{"$f":"X10+SUMIFS(P$93:P$142,$Q$93:$Q$142,\"Y\",$E$93:$E$142,$S70)","v":5213523.7758601801}]
["Low Income Programs (ESAP)",null,"D.21-06-015",{"$f":"'Authorized Rev Req'!$J83","v":92462.203432163165},"Public Purpose",{"$f":"'Authorized Rev Req'!J83","v":92462.203432163165},{"$f":"'Authorized Rev Req'!K83","v":75728.055877278952},{"$f":"G71","v":75728.055877278952},{"$f":"H71","v":75728.055877278952},{"$f":"I71","v":75728.055877278952},"Existing",null,null,null,null,null,null,null,"New System Gen",603172.22031323682,516731.13872922433,538806.30808733602,538536.27191010863,538536.27191010863]
["Low Income Programs (CARE/FERA Admin)",null,"D.21-06-015; Advice 4638-E",{"$f":"'Authorized Rev Req'!$J84","v":10971.649414170137},"Public Purpose",{"$f":"'Authorized Rev Req'!J84","v":10971.649414170137},{"$f":"'Authorized Rev Req'!K84","v":11089.155401848269},{"$f":"G72","v":11089.155401848269},{"$f":"H72","v":11089.155401848269},{"$f":"I72","v":11089.155401848269},"Existing",null,null,null,null,null,null,null,"Distribution",10708193.85627551,10165753.926436001,9921889.2441611253,10439096.016822413,10546827.016822413]
["EPIC - RD&D and Renewables",null,"D.20-08-042; D.21-11-028",{"$f":"'Authorized Rev Req'!$J85","v":76885.429738335733},"Public Purpose",{"$f":"'Authorized Rev Req'!J85","v":76885.429738335733},{"$f":"'Authorized Rev Req'!K85","v":45469.534369507644},{"$f":"G73","v":45469.534369507644},45469.534369507644,45469.534369507644,"Existing",null,null,null,null,null,null,null,"GHG Revenue",-641623.9438718505,-443279,-443279,-443279,-443279]
[null,null,null,null,null,null,null,null,null,null,null,null,null,null,null,null,null,null,"MCAM",4710.7322490276256,6367.1398930982486,3685.2999966519797,3685.2999966519797,3685.2999966519797]
[null,null,null,null,null,null,null,null,null,null,null,null,null,null,null,null,null,null,"Nuclear",-915.75073764498552,1110.996733802267,5336.996733802267,5336.996733802267,5336.996733802267]
[null,null,null,null,null,null,null,null,null,null,null,null,null,null,null,null,null,null,"Public Purpose",992971.5889392785,563081.25162568165,569257.95188966626,569058.95188966626,569058.95188966626]
["Non-CPUC Jurisdictional Proceedings",null,null,null,null,null,null,null,null,null,null,null,null,null,null,null,null,null,"DCPP",282858.69088729238,121955,121955,121955,121955]
["Wildfire Fund Charge (AB1054)",null,"D.22-12-007",{"$f":"'Authorized Rev Req'!$J91","v":416803},"DWR",{"$f":"'Authorized Rev Req'!J91","v":416803},{"$f":"'Authorized Rev Req'!K91","v":426374.14794351778},{"$f":"G78","v":426374.14794351778},426374.14794351778,426374.14794351778,"Existing",null,null,null,null,null,null,null,"DWR",416803,426374.14794351778,426374.14794351778,426374.14794351778,426374.14794351778]
["FERC Base Transmission",null,"ER25-550; Advice 5449-E",{"$f":"'Authorized Rev Req'!$J92","v":1344347},"FERC",{"$f":"'Authorized Rev Req'!J92","v":1344347},{"$f":"'Authorized Rev Req'!K92","v":1496918},1496918,1496918,1496918,"Existing",null,null,null,null,null,null,null,"FERC",1344347,1496918,1496918,1496918,1496918]
["TRBAA (BA)",null,"ER25-267; Advice 5449-E",{"$f":"'Authorized Rev Req'!$J93","v":-214482},"TOTCA",{"$f":"'Authorized Rev Req'!J93","v":-214482},{"$f":"'Authorized Rev Req'!K93","v":-178588.59299999999},-178588.59299999999,-178588.59299999999,-178588.59299999999,"Existing",null,null,null,null,null,null,null,"TOTCA",-2752.7449999999953,45012.561000000016,45012.561000000016,45012.561000000016,45012.561000000016]
["RSBAA (BA)",null,"ER25-305; Advice 5449-E",{"$f":"'Authorized Rev Req'!$J94","v":8496},"TOTCA",{"$f":"'Authorized Rev Req'!J94","v":8496},{"$f":"'Authorized Rev Req'!K94","v":9616.6239999999998},9616.6239999999998,9616.6239999999998,9616.6239999999998,"Existing",null,null,null,null,null,null,null,"Securitization",106244.28,595176.28,595176.28,595176.28,595176.28]
["TACBAA (BA)",null,"ER25-1824-000",{"$f":"'Authorized Rev Req'!$J95","v":203233.255},"TOTCA",{"$f":"'Authorized Rev Req'!J95","v":203233.255},{"$f":"'Authorized Rev Req'!K95","v":213984.53},213984.53,213984.53,213984.53,"Existing",null,null,null,null,null,null,null,"PUCRF",63307.714183956326,80445,80445,80445,80445]
["Total Approved, Implemented Since Jan 1 or To Be Implemented",null,null,{"$f":"SUM(D10:D82)","v":19339861.876727667},null,{"$f":"SUM(F10:F82)","v":19339861.876727667},{"$f":"SUM(G10:G82)","v":18943807.367329642},{"$f":"SUM(H10:H82)","v":18112096.041213419},{"$f":"SUM(I10:I82)","v":18559947.44287907},{"$f":"SUM(J10:J82)","v":18559947.44287907},null,null,null,null,null,null,null,null,"Total",{"$f":"SUM(T70:T82)","v":19403169.590911627},19328689.035859909,18547799.59832019,19091839.30215634,19199570.30215634]
["PUCRF",null,null,{"$f":"'Authorized Rev Req'!H97","v":63307.714183956326},"PUCRF",{"$f":"D84","v":63307.714183956326},80445,{"$f":"G84","v":80445},{"$f":"H84","v":80445},{"$f":"I84","v":80445},null,null,null,null,null,null,null,null,"Increase over current",{"$f":"T83-T23","v":0},{"$f":"U83-U23","v":304436.66853026673},{"$f":"V83-V23","v":355258.55710677058},{"$f":"W83-W23","v":451446.85927727446},{"$f":"X83-X23","v":559177.85927727446}]
[null,null,null,{"$f":"SUM(D83:D84)","v":19403169.590911623},"w/PUCRF",{"$f":"SUM(F83:F84)","v":19403169.590911623},{"$f":"SUM(G83:G84)","v":19024252.367329642},{"$f":"SUM(H83:H84)","v":18192541.041213419},{"$f":"SUM(I83:I84)","v":18640392.44287907},{"$f":"SUM(J83:J84)","v":18640392.44287907}]
[null,null,null,{"$f":"-'Authorized Rev Req'!J98+D85","v":0},null,null,null,null,null,null,null,null,null,null,null,null,null,null,"Check",{"$f":"T84-L130","v":0},{"$f":"U84-M130","v":-6.1118043959140778E-9},{"$f":"V84-N130","v":-8.2654878497123718E-9},{"$f":"W84-O130","v":-2.7939677238464355E-9},{"$f":"X84-P130","v":-2.7939677238464355E-9}]
[]
[]
[]
["Pending Application(s), Not Yet Approved"]
["Filing Description","Proceeding","Basis for Revenue Requirement","Proposed Revenue Requirement ($000)","Proposed Revenue Recovery Mechanism",{"$f":"F8","v":2025},{"$f":"F91+1","v":2026},{"$f":"G91+1","v":2027},2028,2029,"Existing or New Item (if existing, use delta from prior for rate impact)",{"$f":"F91","v":2025},{"$f":"G91","v":2026},2027,2028,2029]
["Safety Affordability Reliability Proceedings",null,null,null,null,null,null,null,null,null,null,null,null,null,null,null,"Include in Impact"]
["2026 ERRA Forecast F&PP","A.25-05-008 (Amended October Update)","Filed Application",{"$f":"G93","v":4215455.4352467358},"Generation",0,{"$f":"'Authorized Rev Req'!K27","v":4215455.4352467358},{"$f":"G93","v":4215455.4352467358},{"$f":"H93","v":4215455.4352467358},{"$f":"H93","v":4215455.4352467358},"Existing",0,{"$f":"G93-G24","v":127100.76654367941},127100.76654367941,127100.76654367941,127100.76654367941,{"$f":"Q96","v":"Y"}]
["2026 ERRA Forecast F&PP","A.25-05-008 (Amended October Update)","Filed Application",{"$f":"G94","v":473468.50744434149},"New System Gen",0,{"$f":"'Authorized Rev Req'!K28","v":473468.50744434149},{"$f":"G94","v":473468.50744434149},{"$f":"H94","v":473468.50744434149},{"$f":"H94","v":473468.50744434149},"Existing",0,16001.768371780578,16001.768371780578,16001.768371780578,16001.768371780578,{"$f":"Q93","v":"Y"}]
["2026 ERRA Forecast (BA)","A.25-05-008 (Amended October Update)","Filed Application",-23473.581057849922,"New System Gen",0,{"$f":"'Authorized Rev Req'!K29","v":-23473.581057849922},0,0,0,"Existing",0,{"$f":"G95-G26","v":-101497.53866719079},{"$f":"H95-H26","v":0},{"$f":"I95-I26","v":0},0,"Y"]
["2026 ERRA Forecast","A.25-05-008 (Amended October Update)","Filed Application",-443279,"GHG Revenue",0,{"$f":"'Authorized Rev Req'!K30","v":-443279},{"$f":"G96","v":-443279},-443279,-443279,"Existing",0,198344.9438718505,198344.9438718505,198344.9438718505,198344.9438718505,{"$f":"VLOOKUP('Incremental Rev Req'!A96,Summary!$B$8:$D$24,3,FALSE)","v":"Y"}]
["2026 ERRA Forecast","A.25-05-008 (Amended October Update)","Filed Application",5336.996733802267,"Nuclear",0,{"$f":"'Authorized Rev Req'!K31","v":5336.996733802267},{"$f":"G97","v":5336.996733802267},5336.996733802267,5336.996733802267,"Existing",0,179.81771137261785,{"$f":"H97-H28","v":179.81771137261785},179.81771137261785,179.81771137261785,"Y"]
["2026 ERRA Forecast","A.25-05-008 (Amended October Update)","Filed Application",-2686.1566957162595,"Distribution",0,{"$f":"'Authorized Rev Req'!K32","v":-2686.1566957162595},{"$f":"G98","v":-2686.1566957162595},-2686.1566957162595,-2686.1566957162595,"Existing",0,16483.229889300623,{"$f":"H98-H29","v":16483.229889300623},16483.229889300623,16483.229889300623,"Y"]
["2026 ERRA Forecast","A.25-05-008 (Amended October Update)","Filed Application",28843.044462928839,"Public Purpose",0,{"$f":"'Authorized Rev Req'!K33","v":28843.044462928839},{"$f":"G99","v":28843.044462928839},28843.044462928839,28843.044462928839,"Existing",0,26498.544761551158,{"$f":"H99-H30","v":26498.544761551158},26498.544761551158,26498.544761551158,"Y"]
["2026 ERRA Forecast","A.25-05-008 (Amended October Update)","Filed Application",3685.2999966519797,"MCAM",0,3685.2999966519797,{"$f":"G100","v":3685.2999966519797},3685.2999966519797,3685.2999966519797,"Existing",0,-1023.893667572705,{"$f":"H100-H31","v":-1023.893667572705},-1023.893667572705,-1023.893667572705,"Y"]
["2026 ERRA Forecast","A.25-05-008 (Amended October Update)","Filed Application",2681.839896446269,"MCAM",0,2681.839896446269,0,0,0,"Existing",0,{"$f":"G101","v":2681.839896446269},null,{"$f":"I101","v":0},0,"Y"]
["2026 ERRA Forecast (BA)","A.25-05-008 (Amended October Update)","Filed Application",11080.477872680807,"Public Purpose",0,{"$f":"'Authorized Rev Req'!K35","v":11080.477872680807},0,0,0,"Existing",0,{"$f":"G102-G32","v":-7320.4111738223291},null,{"$f":"I102-I32","v":0},{"$f":"J102-J32","v":0},"Y"]
["2026 ERRA/PABA (BA)","A.25-05-008 (Amended October Update)","Filed Application",442848.92492462648,"Generation",0,{"$f":"'Authorized Rev Req'!K36","v":442848.92492462648},0,0,0,"Existing",0,{"$f":"G103-G33","v":-16204.636744151649},null,0,0,"Y"]
["DAC-GT/CSGT Clean Energy Programs","A.25-05-008 (Amended October Update)","Filed Application",3280.1284958733913,"Public Purpose",0,{"$f":"'Authorized Rev Req'!K39","v":3280.1284958733913},{"$f":"G104","v":3280.1284958733913},3280.1284958733913,3280.1284958733913,"Existing",0,{"$f":"G104-G34","v":283.4381034427156},{"$f":"H104-H34","v":283.4381034427156},283.4381034427156,283.4381034427156,"Y"]
["2022 ERRA Review","A.23-04-003","Filed Application",{"$f":"G105","v":50640},"Distribution",0,50640,0,0,0,"New",{"$f":"F105","v":0},{"$f":"G105","v":50640},{"$f":"H105","v":0},{"$f":"I105","v":0},{"$f":"J105","v":0},{"$f":"VLOOKUP('Incremental Rev Req'!A105,Summary!$B$8:$D$24,3,FALSE)","v":"Y"}]
["2022 ERRA Review","A.23-04-003","Filed Application",{"$f":"G106","v":234},"Public Purpose",0,234,0,0,0,"New",0,234,0,0,0,{"$f":"Q105","v":"Y"}]
["2023 ERRA Review","A.24-04-001","Filed Application",-73859,"Distribution",0,-73859,0,0,0,"New",0,-73859,0,0,0,{"$f":"VLOOKUP('Incremental Rev Req'!A107,Summary!$B$8:$D$24,3,FALSE)","v":"Y"}]
["2023 ERRA Review","A.24-04-001","Filed Application",10664,"Public Purpose",0,10664,null,0,0,"New",0,10664,0,0,0,{"$f":"Q107","v":"Y"}]
["2024 ERRA Review","A.25-04-004","Filed Application",{"$f":"H109","v":3793},"Distribution",0,0,3793,null,null,"New",0,0,3793,0,0,{"$f":"VLOOKUP('Incremental Rev Req'!A109,Summary!$B$8:$D$24,3,FALSE)","v":"Y"}]
["2024 ERRA Review","A.25-04-004","Filed Application",{"$f":"H110","v":199},"Public Purpose",0,0,199,null,null,"New",0,0,199,0,0,{"$f":"Q109","v":"Y"}]
["Section 851 - Sale of Hydroelectric San Bernardino","A.24-08-012","Filed Application",{"$f":"G111","v":60300},"Generation",0,60300,0,0,0,"New",0,60300,0,0,0,{"$f":"VLOOKUP('Incremental Rev Req'!A111,Summary!$B$8:$D$24,3,FALSE)","v":"Y"}]
["Section 851 - Sale of Hydroelectric Fontana Union Water","A.24-09-008","Filed Application",{"$f":"G112","v":9500},"Generation",0,9500,0,0,0,"New",0,9500,0,0,0,{"$f":"VLOOKUP('Incremental Rev Req'!A112,Summary!$B$8:$D$24,3,FALSE)","v":"Y"}]
["Woolsey CEMA (As Filed, does not yet reflect settled value)","A.24-10-002","Filed Application",{"$f":"G113","v":52967},"Distribution",0,52967,0,0,0,"New",{"$f":"F113","v":0},52967,0,{"$f":"I113","v":0},{"$f":"J113","v":0},{"$f":"VLOOKUP('Incremental Rev Req'!A113,Summary!$B$8:$D$24,3,FALSE)","v":"Y"}]
["Woolsey WEMA FRC (As Filed, does not yet reflect settled value)","A.24-10-002","Filed Application",{"$f":"I114","v":367000},"Securitization",0,367000,367000,367000,{"$f":"I114","v":367000},"New",0,367000,367000,{"$f":"I114","v":367000},{"$f":"J114","v":367000},{"$f":"VLOOKUP('Incremental Rev Req'!A114,Summary!$B$8:$D$24,3,FALSE)","v":"Y"}]
["Section 851 - Sale of Hydroelectric TULE","A.25-03-001","Filed Application",{"$f":"G115","v":31100},"Generation",0,31100,0,0,0,"New",0,31100,0,{"$f":"I115","v":0},{"$f":"J115","v":0},{"$f":"VLOOKUP('Incremental Rev Req'!A115,Summary!$B$8:$D$24,3,FALSE)","v":"Y"}]
["2026 Cost of Capital (Prorposed Decision)","A.25-03-012","Filed Application",{"$f":"G116","v":-4589.2303809158038},"Generation",0,-4589.2303809158038,-5149.7946970398771,-5247.1169738786994,{"$f":"I116","v":-5247.1169738786994},"New",{"$f":"F116","v":0},-4589.2303809158038,-5149.7946970398771,-5247.1169738786994,-5247.1169738786994,{"$f":"VLOOKUP('Incremental Rev Req'!A116,Summary!$B$8:$D$24,3,FALSE)","v":"Y"}]
["2026 Cost of Capital (Prorposed Decision)","A.25-03-012","Filed Application",-385.88735014396661,"New System Gen",0,-385.88735014396661,-354.26419792074012,-333.45276747509342,{"$f":"I117","v":-333.45276747509342},"New",0,-385.88735014396661,-354.26419792074012,-333.45276747509342,-333.45276747509342,{"$f":"VLOOKUP('Incremental Rev Req'!A117,Summary!$B$8:$D$24,3,FALSE)","v":"Y"}]
["2026 Cost of Capital (Prorposed Decision)","A.25-03-012","Filed Application",-60084.52328174375,"Distribution",0,-60084.52328174375,-67305.468417245895,-70351.655400354415,-70351.655400354415,"New",0,-60084.52328174375,-67305.468417245895,-70351.655400354415,-70351.655400354415,{"$f":"VLOOKUP('Incremental Rev Req'!A118,Summary!$B$8:$D$24,3,FALSE)","v":"Y"}]
["NextGen","A.25-03-009","Filed Application",{"$f":"H119","v":20695},"Distribution",0,0,20695,173998,281729,"New",0,0,20695,173998,281729,{"$f":"VLOOKUP('Incremental Rev Req'!A119,Summary!$B$8:$D$24,3,FALSE)","v":"Y"}]
["Diablo Canyon Extended Operations NBC","PD in A.25-03-015","Filed Application",{"$f":"G120","v":121955},"DCPP",0,{"$f":"'Authorized Rev Req'!K67","v":121955},{"$f":"G120","v":121955},{"$f":"G120","v":121955},{"$f":"G120","v":121955},"Existing",0,{"$f":"G120-G55","v":-160903.69088729238},{"$f":"H120-H55","v":-160903.69088729238},{"$f":"I120-I55","v":-160903.69088729238},{"$f":"J120-J55","v":-160903.69088729238},{"$f":"VLOOKUP('Incremental Rev Req'!A120,Summary!$B$8:$D$24,3,FALSE)","v":"Y"}]
["IQP 2027 Bridge Funding","A.25-06-022","Filed Application",{"$f":"H121","v":60834.49},"Public Purpose",0,0,60834.49,{"$f":"H121","v":60834.49},{"$f":"I121","v":60834.49},"Existing",0,{"$f":"G121","v":0},{"$f":"H121-H71","v":-14893.565877278954},{"$f":"I121-I71","v":-14893.565877278954},{"$f":"J121-J71","v":-14893.565877278954},{"$f":"VLOOKUP('Incremental Rev Req'!A121,Summary!$B$8:$D$24,3,FALSE)","v":"Y"}]
["IQP 2027 Bridge Funding","A.25-06-022","Filed Application",{"$f":"H122","v":11341.79},"Public Purpose",0,0,{"$f":"9606.7+1735.09","v":11341.79},{"$f":"H122","v":11341.79},{"$f":"I122","v":11341.79},"Existing",0,0,{"$f":"H122-H72","v":252.63459815173155},{"$f":"I122-I72","v":252.63459815173155},{"$f":"J122-J72","v":252.63459815173155},{"$f":"VLOOKUP('Incremental Rev Req'!A122,Summary!$B$8:$D$25,3,FALSE)","v":"Y"}]
["2024 WMCE (to be filed 12/4)","A.25-12-XXX","Filed Application",{"$f":"H123","v":50000},"Distribution",0,0,50000,0,0,"New",0,0,{"$f":"H123","v":50000},0,0,{"$f":"VLOOKUP('Incremental Rev Req'!A123,Summary!$B$8:$D$25,3,FALSE)","v":"Y"}]
["Energy Efficiency Program and Portfolio","Advice 5670-E","Filed Advice Letter",{"$f":"G124","v":243133.16108757805},"Public Purpose",0,243133.16108757805,260657.09099999999,{"$f":"H124","v":260657.09099999999},{"$f":"I124","v":260657.09099999999},"Existing",0,{"$f":"G124-G66","v":-239673.8684663176},{"$f":"H124-H66","v":-221942.90900000001},-221942.90900000001,-221942.90900000001,{"$f":"VLOOKUP('Incremental Rev Req'!A124,Summary!$B$8:$D$25,3,FALSE)","v":"Y"}]
[]
["Public Policy Proceedings"]
[]
["Non-CPUC Jurisdictional Proceedings"]
[]
["Total Pending, Filed but not Approved",null,null,{"$f":"SUM(D93:D129)","v":5672679.7173952954},null,{"$f":"SUM(F93:F129)","v":0},{"$f":"SUM(G93:G129)","v":5525816.4373952951},{"$f":"SUM(H93:H129)","v":5107770.0993724111},{"$f":"SUM(I93:I129)","v":5203958.4015429085},{"$f":"SUM(J93:J129)","v":5311689.4015429085},null,{"$f":"SUM(L93:L129)","v":0},{"$f":"SUM(M93:M129)","v":304436.66853027284},{"$f":"SUM(N93:N129)","v":355258.55710677884},{"$f":"SUM(O93:O129)","v":451446.85927727725},{"$f":"SUM(P93:P129)","v":559177.85927727725}]
[null,null,null,null,null,null,null,null,null,null,null,{"$f":"L130+F85","v":19403169.590911623},{"$f":"M130+G85","v":19328689.035859916},{"$f":"N130+H85","v":18547799.598320197},{"$f":"O130+I85","v":19091839.302156348},{"$f":"P130+J85","v":19199570.302156348}]
[]
[]
["Applications Projected to be Filed, Next 12 Months*"]
["Filing Description","Estimated Filing Date","Filing Basis","Proposed Revenue Requirement ($000)","Proposed Revenue Recovery Mechanism",{"$f":"F91","v":2025},{"$f":"F135+1","v":2026},{"$f":"G135+1","v":2027},{"$f":"H135+1","v":2028},{"$f":"I135+1","v":2029},"Existing or New Item (if existing, use delta from prior for rate impact)"]
["Safety Affordability Reliability Proceedings"]
[]
["Public Policy Proceedings"]
[]
[]
["Non-CPUC Jurisdictional Proceedings",null,null,null,null,{"$f":"SUM(F136:F140)","v":0},{"$f":"SUM(G136:G140)","v":0},{"$f":"SUM(H136:H140)","v":0},{"$f":"SUM(I136:I140)","v":0},{"$f":"SUM(J136:J140)","v":0},null,{"$f":"SUM(L136:L140)","v":0},0,{"$f":"SUM(N136:N140)","v":0},0,0]
[]
["* All amounts in this Projected section are estimates and subject to change. SCE provides this data in an effort to be as helpful and transparent as possible to further the Commission's efforts to understand the impact all pending rate increases."]

{"sheet":"SAR and AR (GS1)","index":4,"n_rows":77,"n_cols":27,"rows_kept":77,"cut":false,"hidden":true,"merged":[[25,5,25,10],[25,13,25,18],[63,18,63,19],[0,1,0,21],[1,2,1,3],[3,6,3,15],[7,6,7,15],[16,6,16,15],[16,18,16,19]]}
[null,"CONFIDENTIAL\nThis Excel Sheet Is Marked Confidential In Accordance With Applicable Law and Regulation.\nBasis for Confidentiality In Accompanying Confidentiality Declaration.\nPublic Disclosure Restricted."]
[null,null,"Total Revenue ($000)"]
[null,null,"Authorized","w/ Pending"]
[null,"Generation",{"$f":"INDEX('Incremental Rev Req'!$S$9:$X$22,MATCH(B4,'Incremental Rev Req'!$S$9:$S$22,0),MATCH(Summary!$D$3,'Incremental Rev Req'!$S$9:$X$9,0))","v":5525852.9476728207},{"$f":"INDEX('Incremental Rev Req'!$S$69:$X$82,MATCH(B4,'Incremental Rev Req'!$S$69:$S$82,0),MATCH(Summary!$D$3,'Incremental Rev Req'!$S$69:$X$69,0))","v":5525852.9476728207},null,null,"Allocation"]
[null,"Distribution",{"$f":"INDEX('Incremental Rev Req'!$S$9:$X$22,MATCH(B5,'Incremental Rev Req'!$S$9:$S$22,0),MATCH(Summary!$D$3,'Incremental Rev Req'!$S$9:$X$9,0))","v":10708193.85627551},{"$f":"INDEX('Incremental Rev Req'!$S$69:$X$82,MATCH(B5,'Incremental Rev Req'!$S$69:$S$82,0),MATCH(Summary!$D$3,'Incremental Rev Req'!$S$69:$X$69,0))","v":10708193.85627551},null,null,"Generation","Distribution","NDC","PPPC","DCPP","NSGC","Transmission","TOTCA","GHG Rev","DWRBC","PUCRF","SECURITIZATION"]
[null,"Nuclear",{"$f":"INDEX('Incremental Rev Req'!$S$9:$X$22,MATCH(B6,'Incremental Rev Req'!$S$9:$S$22,0),MATCH(Summary!$D$3,'Incremental Rev Req'!$S$9:$X$9,0))","v":-915.75073764498552},{"$f":"INDEX('Incremental Rev Req'!$S$69:$X$82,MATCH(B6,'Incremental Rev Req'!$S$69:$S$82,0),MATCH(Summary!$D$3,'Incremental Rev Req'!$S$69:$X$69,0))","v":-915.75073764498552},null,"GS-1",{"$f":"VLOOKUP(Summary!$D$3,'SAR and AR (GS1)'!$F$37:$R$42,'SAR and AR (GS1)'!G$35,FALSE)","v":8.56555441047092E-2},{"$f":"VLOOKUP(Summary!$D$3,'SAR and AR (GS1)'!$F$37:$R$42,'SAR and AR (GS1)'!H$35,FALSE)","v":6.6981813261656364E-2},{"$f":"VLOOKUP(Summary!$D$3,'SAR and AR (GS1)'!$F$37:$R$42,'SAR and AR (GS1)'!I$35,FALSE)","v":6.9772361086533924E-2},{"$f":"VLOOKUP(Summary!$D$3,'SAR and AR (GS1)'!$F$37:$R$42,'SAR and AR (GS1)'!J$35,FALSE)","v":7.0833414404385592E-2},{"$f":"VLOOKUP(Summary!$D$3,'SAR and AR (GS1)'!$F$37:$R$42,'SAR and AR (GS1)'!K$35,FALSE)","v":7.0452504542625E-2},{"$f":"VLOOKUP(Summary!$D$3,'SAR and AR (GS1)'!$F$37:$R$42,'SAR and AR (GS1)'!L$35,FALSE)","v":7.0228496137111671E-2},{"$f":"VLOOKUP(Summary!$D$3,'SAR and AR (GS1)'!$F$37:$R$42,'SAR and AR (GS1)'!M$35,FALSE)","v":6.906624045328115E-2},{"$f":"VLOOKUP(Summary!$D$3,'SAR and AR (GS1)'!$F$37:$R$42,'SAR and AR (GS1)'!N$35,FALSE)","v":7.0290661987155681E-2},{"$f":"VLOOKUP(Summary!$D$3,'SAR and AR (GS1)'!$F$37:$R$42,'SAR and AR (GS1)'!O$35,FALSE)","v":8.0333625621882176E-2},{"$f":"VLOOKUP(Summary!$D$3,'SAR and AR (GS1)'!$F$37:$R$42,'SAR and AR (GS1)'!P$35,FALSE)","v":7.8012925667049801E-2},{"$f":"VLOOKUP(Summary!$D$3,'SAR and AR (GS1)'!$F$37:$R$42,'SAR and AR (GS1)'!Q$35,FALSE)","v":6.9772360274023171E-2},{"$f":"VLOOKUP(Summary!$D$3,'SAR and AR (GS1)'!$F$37:$R$42,'SAR and AR (GS1)'!R$35,FALSE)","v":8.1486516886440832E-2}]
[null,"Public Purpose",{"$f":"INDEX('Incremental Rev Req'!$S$9:$X$22,MATCH(B7,'Incremental Rev Req'!$S$9:$S$22,0),MATCH(Summary!$D$3,'Incremental Rev Req'!$S$9:$X$9,0))","v":992971.5889392785},{"$f":"INDEX('Incremental Rev Req'!$S$69:$X$82,MATCH(B7,'Incremental Rev Req'!$S$69:$S$82,0),MATCH(Summary!$D$3,'Incremental Rev Req'!$S$69:$X$69,0))","v":992971.5889392785}]
[null,"DCPP",{"$f":"INDEX('Incremental Rev Req'!$S$9:$X$22,MATCH(B8,'Incremental Rev Req'!$S$9:$S$22,0),MATCH(Summary!$D$3,'Incremental Rev Req'!$S$9:$X$9,0))","v":282858.69088729238},{"$f":"INDEX('Incremental Rev Req'!$S$69:$X$82,MATCH(B8,'Incremental Rev Req'!$S$69:$S$82,0),MATCH(Summary!$D$3,'Incremental Rev Req'!$S$69:$X$69,0))","v":282858.69088729238},null,null,"Revenue ($000) - System",null,null,null,null,null,null,null,null,null,null,null,null,null,null,null,null,"Authorized","w/Pending"]
[null,"New System Gen",{"$f":"INDEX('Incremental Rev Req'!$S$9:$X$22,MATCH(B9,'Incremental Rev Req'!$S$9:$S$22,0),MATCH(Summary!$D$3,'Incremental Rev Req'!$S$9:$X$9,0))","v":603172.22031323682},{"$f":"INDEX('Incremental Rev Req'!$S$69:$X$82,MATCH(B9,'Incremental Rev Req'!$S$69:$S$82,0),MATCH(Summary!$D$3,'Incremental Rev Req'!$S$69:$X$69,0))","v":603172.22031323682},null,"Authorized","Generation","Distribution","NDC","PPPC","DCPP","NSGC","Transmission","TOTCA","GHG Rev","DWRBC","PUCRF","SECURITIZATION","Total","CARE Adj.",null,null,"% of CARE Sales",{"$f":"VLOOKUP(Summary!$D$3,$F$58:$Q$63,$Q$35,FALSE)","v":0},{"$f":"X9","v":0}]
[null,"FERC",{"$f":"INDEX('Incremental Rev Req'!$S$9:$X$22,MATCH(B10,'Incremental Rev Req'!$S$9:$S$22,0),MATCH(Summary!$D$3,'Incremental Rev Req'!$S$9:$X$9,0))","v":1344347},{"$f":"INDEX('Incremental Rev Req'!$S$69:$X$82,MATCH(B10,'Incremental Rev Req'!$S$69:$S$82,0),MATCH(Summary!$D$3,'Incremental Rev Req'!$S$69:$X$69,0))","v":1344347},null,"GS-1",{"$f":"G6*G11","v":473319.94087552663},{"$f":"H6*H11","v":717254.24125066213},{"$f":"I6*I11","v":-63.894091132225725},{"$f":"J6*J11","v":70335.568051117138},{"$f":"K6*K11","v":19928.103204657928},42359.877944281223,92848.993154647149,-193.49226833183255,-51543.977697036782,32516.021456803359,4417.1286421678878,{"$f":"R6*R11","v":8657.4763163077478},{"$f":"SUM(G10:R10)","v":1409835.9868396705},{"$f":"X14","v":81764.981452175329},null,null,"CARE Effective Discount",{"$f":"'SAR and RAR'!X10","v":0.32500000000000001},{"$f":"X10","v":0.32500000000000001}]
[null,"TOTCA",{"$f":"INDEX('Incremental Rev Req'!$S$9:$X$22,MATCH(B11,'Incremental Rev Req'!$S$9:$S$22,0),MATCH(Summary!$D$3,'Incremental Rev Req'!$S$9:$X$9,0))","v":-2752.7449999999953},{"$f":"INDEX('Incremental Rev Req'!$S$69:$X$82,MATCH(B11,'Incremental Rev Req'!$S$69:$S$82,0),MATCH(Summary!$D$3,'Incremental Rev Req'!$S$69:$X$69,0))","v":-2752.7449999999953},null,"Total System",{"$f":"C4","v":5525852.9476728207},{"$f":"C5","v":10708193.85627551},{"$f":"C6","v":-915.75073764498552},{"$f":"C7","v":992971.5889392785},{"$f":"C8","v":282858.69088729238},{"$f":"C9","v":603172.22031323682},{"$f":"C10","v":1344347},{"$f":"C11","v":-2752.7449999999953},{"$f":"C12","v":-641623.9438718505},{"$f":"C14","v":416803},{"$f":"C15","v":63307.714183956326},{"$f":"C16","v":106244.28},{"$f":"SUM(G11:R11)","v":19398458.858662598},0,null,null,"CARE Discounst",{"$f":"'SAR and RAR'!X11","v":1041718.4707299016},{"$f":"'SAR and RAR'!Y11","v":1041718.4707299016}]
[null,"GHG Revenue",{"$f":"INDEX('Incremental Rev Req'!$S$9:$X$22,MATCH(B12,'Incremental Rev Req'!$S$9:$S$22,0),MATCH(Summary!$D$3,'Incremental Rev Req'!$S$9:$X$9,0))","v":-641623.9438718505},{"$f":"INDEX('Incremental Rev Req'!$S$69:$X$82,MATCH(B12,'Incremental Rev Req'!$S$69:$S$82,0),MATCH(Summary!$D$3,'Incremental Rev Req'!$S$69:$X$69,0))","v":-641623.9438718505},null,"w/Pending",null,null,null,null,null,null,null,null,null,null,null,null,null,null,null,null,"GS-1 Sales",{"$f":"VLOOKUP(Summary!$D$3,'SAR and AR (GS1)'!$F$58:$O$63,10,FALSE)","v":5521410.7975000003},{"$f":"X12","v":5521410.7975000003}]
[null,"MCAM",{"$f":"INDEX('Incremental Rev Req'!$S$9:$X$22,MATCH(B13,'Incremental Rev Req'!$S$9:$S$22,0),MATCH(Summary!$D$3,'Incremental Rev Req'!$S$9:$X$9,0))","v":4710.7322490276256},{"$f":"INDEX('Incremental Rev Req'!$S$69:$X$82,MATCH(B13,'Incremental Rev Req'!$S$69:$S$82,0),MATCH(Summary!$D$3,'Incremental Rev Req'!$S$69:$X$69,0))","v":4710.7322490276256},null,"GS-1",{"$f":"G6*G14","v":473319.94087552663},{"$f":"H6*H14","v":717254.24125066213},{"$f":"I6*I14","v":-63.894091132225725},{"$f":"J6*J14","v":70335.568051117138},{"$f":"K6*K14","v":19928.103204657928},42359.877944281223,92848.993154647149,-193.49226833183255,-51543.977697036782,32516.021456803359,4417.1286421678878,{"$f":"R6*R14","v":8657.4763163077478},{"$f":"SUM(G13:R13)","v":1409835.9868396705},{"$f":"Y14","v":81764.981452175329},null,null,"Total Sales (excl. CARE&SL)",{"$f":"VLOOKUP(Summary!$D$3,'SAR and AR (GS1)'!$F$64:$O$69,2,FALSE)","v":70344975.441687003},{"$f":"X13","v":70344975.441687003}]
[null,"DWR",{"$f":"INDEX('Incremental Rev Req'!$S$9:$X$22,MATCH(B14,'Incremental Rev Req'!$S$9:$S$22,0),MATCH(Summary!$D$3,'Incremental Rev Req'!$S$9:$X$9,0))","v":416803},{"$f":"INDEX('Incremental Rev Req'!$S$69:$X$82,MATCH(B14,'Incremental Rev Req'!$S$69:$S$82,0),MATCH(Summary!$D$3,'Incremental Rev Req'!$S$69:$X$69,0))","v":416803},null,"Total System",{"$f":"D4","v":5525852.9476728207},{"$f":"D5","v":10708193.85627551},{"$f":"D6","v":-915.75073764498552},{"$f":"D7","v":992971.5889392785},{"$f":"D8","v":282858.69088729238},{"$f":"D9","v":603172.22031323682},{"$f":"D10","v":1344347},{"$f":"D11","v":-2752.7449999999953},{"$f":"D12","v":-641623.9438718505},{"$f":"D14","v":416803},{"$f":"D15","v":63307.714183956326},{"$f":"D16","v":106244.28},{"$f":"SUM(G14:R14)","v":19398458.858662598},0,null,null,"GS-1 CARE Surcharge",{"$f":"X11*X12/X13","v":81764.981452175329},{"$f":"Y11*Y12/Y13","v":81764.981452175329}]
[null,"PUCRF",{"$f":"INDEX('Incremental Rev Req'!$S$9:$X$22,MATCH(B15,'Incremental Rev Req'!$S$9:$S$22,0),MATCH(Summary!$D$3,'Incremental Rev Req'!$S$9:$X$9,0))","v":63307.714183956326},{"$f":"INDEX('Incremental Rev Req'!$S$69:$X$82,MATCH(B15,'Incremental Rev Req'!$S$69:$S$82,0),MATCH(Summary!$D$3,'Incremental Rev Req'!$S$69:$X$69,0))","v":63307.714183956326},null,null,null,null,null,null,null,null,null,null,null,null,null,null,null,null,null,null,"RES CARE Discount Specific Split",{"$f":"'SAR and RAR'!X15","v":0.76843173629643258},{"$f":"'SAR and RAR'!Y15","v":0.76843173629643258}]
[null,"SECURITIZATION",{"$f":"INDEX('Incremental Rev Req'!$S$9:$X$22,MATCH(B16,'Incremental Rev Req'!$S$9:$S$22,0),MATCH(Summary!$D$3,'Incremental Rev Req'!$S$9:$X$9,0))","v":106244.28},{"$f":"INDEX('Incremental Rev Req'!$S$69:$X$82,MATCH(B16,'Incremental Rev Req'!$S$69:$S$82,0),MATCH(Summary!$D$3,'Incremental Rev Req'!$S$69:$X$69,0))","v":106244.28},null,null,null,null,null,null,null,null,null,null,null,null,null,null,"Authorized","w/Pending",null,null,"CARE Surcharge Allocator",{"$f":"'SAR and RAR'!X16","v":0.6109826201027182},{"$f":"'SAR and RAR'!Y16","v":0.6109826201027182}]
[null,"Total",{"$f":"SUM(C4:C16)","v":19403169.590911627},{"$f":"SUM(D4:D16)","v":19403169.590911627},null,null,"Revenue Split - Bundled",null,null,null,null,null,null,null,null,null,null,null,"Bundled Revenue",null,null,null,"System CARE Discount",{"$f":"SUM(-X11*X15)+SUM(X11*X16)","v":-164017.65253909072},{"$f":"SUM(-Y11*Y15)+SUM(Y11*Y16)","v":-164017.65253909072}]
[null,null,null,null,null,null,"Generation","Distribution","NDC","PPPC","DCPP","NSGC","Transmission","TOTCA","GHG Rev","DWRBC","PUCRF","SECURITIZATION","Total","Total"]
[null,null,null,null,null,"GS-1",{"$f":"VLOOKUP(Summary!$D$3,'SAR and AR (GS1)'!$F$44:$R$49,'SAR and AR (GS1)'!G$35,FALSE)","v":1.0232959419553733},{"$f":"VLOOKUP(Summary!$D$3,'SAR and AR (GS1)'!$F$44:$R$49,'SAR and AR (GS1)'!H$35,FALSE)","v":0.70052317223058247},{"$f":"VLOOKUP(Summary!$D$3,'SAR and AR (GS1)'!$F$44:$R$49,'SAR and AR (GS1)'!I$35,FALSE)","v":0.70219550240200623},{"$f":"VLOOKUP(Summary!$D$3,'SAR and AR (GS1)'!$F$44:$R$49,'SAR and AR (GS1)'!J$35,FALSE)","v":0.70219551589012696},{"$f":"VLOOKUP(Summary!$D$3,'SAR and AR (GS1)'!$F$44:$R$49,'SAR and AR (GS1)'!K$35,FALSE)","v":0.7021955158065214},{"$f":"VLOOKUP(Summary!$D$3,'SAR and AR (GS1)'!$F$44:$R$49,'SAR and AR (GS1)'!L$35,FALSE)","v":0.70219551584666895},{"$f":"VLOOKUP(Summary!$D$3,'SAR and AR (GS1)'!$F$44:$R$49,'SAR and AR (GS1)'!M$35,FALSE)","v":0.70219551583162065},{"$f":"VLOOKUP(Summary!$D$3,'SAR and AR (GS1)'!$F$44:$R$49,'SAR and AR (GS1)'!N$35,FALSE)","v":0.70219552360713355},{"$f":"VLOOKUP(Summary!$D$3,'SAR and AR (GS1)'!$F$44:$R$49,'SAR and AR (GS1)'!O$35,FALSE)","v":0.69314593999279384},{"$f":"VLOOKUP(Summary!$D$3,'SAR and AR (GS1)'!$F$44:$R$49,'SAR and AR (GS1)'!P$35,FALSE)","v":0.70219551587821261},{"$f":"VLOOKUP(Summary!$D$3,'SAR and AR (GS1)'!$F$44:$R$49,'SAR and AR (GS1)'!Q$35,FALSE)","v":0.70219551513317291},{"$f":"VLOOKUP(Summary!$D$3,'SAR and AR (GS1)'!$F$44:$R$49,'SAR and AR (GS1)'!R$35,FALSE)","v":0.7021955154799403},{"$f":"SUMPRODUCT(G10:R10,G19:R19)+T10*H19","v":1198508.9625026397},{"$f":"SUMPRODUCT(G13:R13,G19:R19)+T13*H19","v":1198508.9625026397}]
[null,null,null,null,null,"Total System",{"$f":"VLOOKUP(Summary!$D$3,'SAR and AR (GS1)'!$F$50:$R$55,'SAR and AR (GS1)'!G$35,FALSE)","v":1.0300079979939982},{"$f":"VLOOKUP(Summary!$D$3,'SAR and AR (GS1)'!$F$50:$R$55,'SAR and AR (GS1)'!H$35,FALSE)","v":0.64971955806985959},{"$f":"VLOOKUP(Summary!$D$3,'SAR and AR (GS1)'!$F$50:$R$55,'SAR and AR (GS1)'!I$35,FALSE)","v":0.62830287983182231},{"$f":"VLOOKUP(Summary!$D$3,'SAR and AR (GS1)'!$F$50:$R$55,'SAR and AR (GS1)'!J$35,FALSE)","v":0.64289120974341818},{"$f":"VLOOKUP(Summary!$D$3,'SAR and AR (GS1)'!$F$50:$R$55,'SAR and AR (GS1)'!K$35,FALSE)","v":0.64095261765727696},{"$f":"VLOOKUP(Summary!$D$3,'SAR and AR (GS1)'!$F$50:$R$55,'SAR and AR (GS1)'!L$35,FALSE)","v":0.63866644750913237},{"$f":"VLOOKUP(Summary!$D$3,'SAR and AR (GS1)'!$F$50:$R$55,'SAR and AR (GS1)'!M$35,FALSE)","v":0.66417763828823584},{"$f":"VLOOKUP(Summary!$D$3,'SAR and AR (GS1)'!$F$50:$R$55,'SAR and AR (GS1)'!N$35,FALSE)","v":0.65322305642427669},{"$f":"VLOOKUP(Summary!$D$3,'SAR and AR (GS1)'!$F$50:$R$55,'SAR and AR (GS1)'!O$35,FALSE)","v":0.6916053708131884},{"$f":"VLOOKUP(Summary!$D$3,'SAR and AR (GS1)'!$F$50:$R$55,'SAR and AR (GS1)'!P$35,FALSE)","v":0.6118326262408581},{"$f":"VLOOKUP(Summary!$D$3,'SAR and AR (GS1)'!$F$50:$R$55,'SAR and AR (GS1)'!Q$35,FALSE)","v":0.6283028839215079},{"$f":"VLOOKUP(Summary!$D$3,'SAR and AR (GS1)'!$F$50:$R$55,'SAR and AR (GS1)'!R$35,FALSE)","v":0.62262350370857455},{"$f":"SUMPRODUCT(G11:R11,G20:R20)+X17","v":14497577.04683888},{"$f":"SUMPRODUCT(G14:R14,G20:R20)+Y17","v":14497577.04683888}]
[]
[null,null,null,null,null,null,null,null,null,null,null,null,null,null,null,null,null,"GS-1 GHG",{"$f":"O10*O19","v":-35727.498871780161},{"$f":"O13*O19","v":-35727.498871780161}]
[null,null,null,null,null,null,null,null,null,null,null,null,null,null,null,null,null,"GS-1 GHG System",{"$f":"O11*O20","v":-443750.56562411156},{"$f":"O14*O20","v":-443750.56562411156}]
[]
[]
[null,null,null,null,null,"Bundled",null,null,null,null,null,null,null,"System (Bundled and Unbundled)"]
[null,null,null,null,null,{"$f":"Summary!N4&\" Sales\"","v":"2025 Sales"},{"$f":"MONTH(Summary!$N$3)&\"/\"&DAY(Summary!$N$3)&\"/\"&YEAR(Summary!$N$3)&\" Avg Rates\"","v":"11/15/2025 Avg Rates"},"Proposed Avg Rates (Authorized)","Proposed Avg Rates (w/Pending)","% Change (Authorized)","% Change (w/Pending)",null,null,{"$f":"Summary!N4&\" Sales\"","v":"2025 Sales"},{"$f":"G27","v":"11/15/2025 Avg Rates"},"Proposed Avg Rates (Authorized)","Proposed Avg Rates (w/Pending)","% Change (Authorized)","% Change (w/Pending)",null,null,null,"1/1/25 Bundled\nw/Credit","1/1/25 Bundled\nw/out Credit",null,"1/1/25 System\nw/Credit","1/1/25 System\nw/out Credit"]
[null,null,null,null,"GS-1",{"$f":"VLOOKUP(Summary!$D$3,'SAR and AR (GS1)'!$J$58:$K$63,2,FALSE)","v":3877109.9032000001},{"$f":"IF(Summary!$J$3=\"Y\",W31,X31)","v":31.983408553249816},{"$f":"IF(Summary!$J$3=\"Y\",S19/$F$28*100,SUM(S19-S22)/$F$28*100)","v":31.833930226113377},{"$f":"IF(Summary!$J$3=\"Y\",T19/$F$28*100,SUM(T19-T22)/$F$28*100)","v":31.833930226113377},{"$f":"H28/G28-1","v":-4.6736209146555074E-3},{"$f":"I28/G28-1","v":-4.6736209146555074E-3},null,"GS-1",{"$f":"VLOOKUP(Summary!$D$3,'SAR and AR (GS1)'!$N$58:$O$63,2,FALSE)","v":5521410.7975000003},{"$f":"IF(Summary!$J$3=\"Y\",Z31,AA31)","v":28.072807513619431},{"$f":"IF(Summary!$J$3=\"Y\",SUM(S10:T10)/N28*100,SUM(S10:T10,-O10)/N28*100)","v":27.948381357308026},{"$f":"IF(Summary!$J$3=\"Y\",SUM(S13:T13)/N28*100,SUM(S13:T13,-O13)/N28*100)","v":27.948381357308026},{"$f":"P28/O28-1","v":-4.4322662153060133E-3},{"$f":"Q28/O28-1","v":-4.4322662153060133E-3},null,null,"GS-1 Bundled",28.249775607237996,29.174067662266477,"GS-1 System",24.843141535555993,25.779500964262311]
[null,null,null,null,"Total Bundled",{"$f":"VLOOKUP(Summary!$D$3,'SAR and AR (GS1)'!$J$64:$K$69,2,FALSE)","v":49720524.250294097},{"$f":"'SAR and RAR'!G29","v":30.163203046939159},{"$f":"IF(Summary!$J$3=\"Y\",S20/$F$29*100,SUM(S20-S23)/$F$29*100)","v":30.050623636323813},{"$f":"IF(Summary!$J$3=\"Y\",T20/$F$29*100,SUM(T20-T23)/$F$29*100)","v":30.050623636323813},{"$f":"H29/G29-1","v":-3.7323426971649365E-3},{"$f":"I29/G29-1","v":-3.7323426971649365E-3},null,"Total System",{"$f":"VLOOKUP(Summary!$D$3,'SAR and AR (GS1)'!$N$64:$O$69,2,FALSE)","v":79134642.730374098},{"$f":"'SAR and RAR'!O29","v":25.126029785552312},{"$f":"IF(Summary!$J$3=\"Y\",SUM(S11:T11)/N29*100,SUM(S11:T11,-O11)/N29*100)","v":25.324032700589299},{"$f":"IF(Summary!$J$3=\"Y\",SUM(S14:T14)/N29*100,SUM(S14:T14,-O14)/N29*100)","v":25.324032700589299},{"$f":"P29/O29-1","v":7.8803900467729893E-3},{"$f":"Q29/O29-1","v":7.8803900467729893E-3}]
[null,null,null,null,{"$f":"M29","v":"Total System"},{"$f":"N29","v":79134642.730374098},null,null,null,null,null,null,null,null,null,null,null,null,null,null,null,null,"10/1/25 Bundled\nw/Credit","10/1/25 Bundled\nw/out Credit",null,"10/1/25 System\nw/Credit","10/1/25 System\nw/out Credit"]
[null,null,null,null,null,null,null,null,null,null,null,null,null,null,null,null,null,null,null,null,null,"GS-1 Bundled",31.059116498221336,31.983408553249816,"GS-1 System",27.136448084913113,28.072807513619431]
[]
[]
[]
[null,null,null,null,null,null,2,{"$f":"G35+1","v":3},{"$f":"H35+1","v":4},5,6,7,8,9,10,11,12,13]
[null,null,null,null,null,"GS-1 Allocator","Generation","Distribution","NDC","PPPC","DCPP","NSGC","Transmission","TOTCA","GHG Rev","DWRBC","PUCRF","SECURITIZATION"]
[null,null,null,null,null,2025,8.56555441047092E-2,6.6981813261656364E-2,6.9772361086533924E-2,7.0833414404385592E-2,7.0452504542625E-2,7.0228496137111671E-2,6.906624045328115E-2,7.0290661987155681E-2,8.0333625621882176E-2,7.8012925667049801E-2,6.9772360274023171E-2,8.1486516886440832E-2]
[null,null,null,null,null,2026,8.2724908811090431E-2,6.9486545674190603E-2,7.266340837155072E-2,7.3669535878252368E-2,7.3298276308614269E-2,7.3132245429964507E-2,7.2609780079965477E-2,7.3028526459584867E-2,7.5243862036360687E-2,8.1023901393686898E-2,7.2663413312761521E-2,8.4519247078519724E-2]
[null,null,null,null,null,2027,8.4543732620251916E-2,7.158854932546467E-2,7.4805272429859029E-2,7.5870085208133167E-2,7.5486333213146475E-2,7.5309645868149172E-2,7.4819013353595185E-2,7.302186918214118E-2,7.7586171365491188E-2,8.3378361501850198E-2,7.4805277491816966E-2,8.7001145793753912E-2]
[null,null,null,null,null,2028,8.4924667247112687E-2,7.2039580651905105E-2,7.4411919694419751E-2,7.5428025294394907E-2,7.5007203338458783E-2,7.3137601926319379E-2,7.4186118933198361E-2,7.3020095166826754E-2,7.6409495782557527E-2,8.3060360904721728E-2,7.4411924709994193E-2,8.6691847021505564E-2]
[null,null,null,null,null,2029,{"$f":"G40","v":8.4924667247112687E-2},{"$f":"H40","v":7.2039580651905105E-2},7.4411919694419751E-2,7.5428025294394907E-2,7.5007203338458783E-2,7.3137601926319379E-2,7.4186118933198361E-2,7.3020095166826754E-2,7.6409495782557527E-2,8.3060360904721728E-2,7.4411924709994193E-2,8.6691847021505564E-2]
[]
[null,null,null,null,null,"Revenue Split - Bundled"]
[null,null,null,null,"GS-1",2025,1.0232959419553733,0.70052317223058247,0.70219550240200623,0.70219551589012696,0.7021955158065214,0.70219551584666895,0.70219551583162065,0.70219552360713355,0.69314593999279384,0.70219551587821261,0.70219551513317291,0.7021955154799403,null,null,{"$f":"G44","v":1.0232959419553733}]
[null,null,null,null,"GS-1",2026,0.93008083457068591,0.65944506035828843,0.65714074357011376,0.65714070766805233,0.65714070773309374,0.65714070759087728,0.6571407076981669,0.65714070607737762,0.68047085092875892,0.65714070764777366,0.65714070701176319,0.65714070735936658,null,{"$f":"K59/K58-1","v":-9.2438111105439535E-3},{"$f":"G45","v":0.93008083457068591}]
[null,null,null,null,"GS-1",2027,0.9310873271927852,0.66293551835566678,0.66064266534681837,0.66064262962208709,0.66064262968680731,0.66064262954529329,0.66064262965205289,0.66064262803926921,0.68384912377095264,0.66064262960190867,0.66064262896903958,0.66064262931492612,null,{"$f":"K60/K59-1","v":4.0335495671836696E-2},0.9310873271927852]
[null,null,null,null,"GS-1",2028,0.93135413238577758,0.66386571242751735,0.66157595680630787,0.66157592112949615,0.66157592119412967,0.66157592105280538,0.66157592115942176,0.66157591954880146,0.6847490484567953,0.66157592110934471,0.66157592047732472,0.66157592082274719,null,{"$f":"K61/K60-1","v":2.0741648059855011E-2},0.93135413238577758]
[null,null,null,null,"GS-1",2029,{"$f":"G47","v":0.93135413238577758},{"$f":"H47","v":0.66386571242751735},{"$f":"I47","v":0.66157595680630787},{"$f":"J47","v":0.66157592112949615},{"$f":"K47","v":0.66157592119412967},{"$f":"L47","v":0.66157592105280538},{"$f":"M47","v":0.66157592115942176},{"$f":"N47","v":0.66157591954880146},{"$f":"O47","v":0.6847490484567953},{"$f":"P47","v":0.66157592110934471},{"$f":"Q47","v":0.66157592047732472},{"$f":"R47","v":0.66157592082274719},null,{"$f":"K62/K61-1","v":0},0.93135413238577758]
[null,null,null,null,"GS-1",null,null,null,null,null,null,null,null,null,null,null,null,null,null,{"$f":"K63/K62-1","v":-1},0]
[null,null,null,null,"Total System",2025,1.0300079979939982,0.64971955806985959,0.62830287983182231,0.64289120974341818,0.64095261765727696,0.63866644750913237,0.66417763828823584,0.65322305642427669,0.6916053708131884,0.6118326262408581,0.6283028839215079,0.62262350370857455,null,null,1.0300079979939982]
[null,null,null,null,"Total System",2026,0.9222853146405231,0.6578191834475825,0.63884780968484989,0.65173838695408171,0.65111256170242737,0.64856335375079699,0.66965473043876134,0.66300629392668609,0.68066315353080553,0.62517281715060091,0.63884781761334009,0.63519439663661459,null,{"$f":"K65/K64-1","v":3.3623695592948533E-2},0.9222853146405231]
[null,null,null,null,"Total System",2027,0.92184214724779656,0.65380885267517963,0.63906933072081085,0.65209879934826842,0.65165990013348174,0.65711747239640561,0.67081018193623743,0.66647871206627263,0.68392955712034265,0.62491602060211271,0.63906933865194404,0.63480563927490063,null,{"$f":"K66/K65-1","v":4.0335495671836696E-2},0.92184214724779656]
[null,null,null,null,"Total System",2028,0.92181836898354985,0.65358022934019555,0.63892586925707118,0.65198928071182383,0.65163584153261278,0.65690665061825537,0.67074750375349257,0.66740403371763779,0.68480819131870874,0.6246106434169969,0.63892587718945382,0.63449517890078844,null,2.0741648059855011E-2,0.92181836898354985]
[null,null,null,null,"Total System",2029,{"$f":"G53","v":0.92181836898354985},{"$f":"H53","v":0.65358022934019555},{"$f":"I53","v":0.63892586925707118},{"$f":"J53","v":0.65198928071182383},{"$f":"K53","v":0.65163584153261278},{"$f":"L53","v":0.65690665061825537},{"$f":"M53","v":0.67074750375349257},{"$f":"N53","v":0.66740403371763779},{"$f":"O53","v":0.68480819131870874},{"$f":"P53","v":0.6246106434169969},{"$f":"Q53","v":0.63892587718945382},{"$f":"R53","v":0.63449517890078844},null,0,0.92181836898354985]
[null,null,null,null,"Total System",null,null,null,null,null,null,null,null,null,null,null,null,null,null,-1,0]
[]
[null,null,null,null,null,"System Sales",null,null,null,"Bundled Sales",null,"% of Bdl",null,"System Sales"]
[null,null,null,null,"GS-1",{"$f":"$F$37","v":2025},null,null,"GS-1",{"$f":"$F$37","v":2025},3877109.9032000001,{"$f":"K58/O58","v":0.70219551585538398},"GS-1",{"$f":"$F$37","v":2025},5521410.7975000003]
[null,null,null,null,"GS-1",{"$f":"$F$38","v":2026},null,null,"GS-1",{"$f":"$F$38","v":2026},3841270.6316,0.65714070766345445,"GS-1",{"$f":"$F$38","v":2026},5845430.9507900001]
[null,null,null,null,"GS-1",{"$f":"$F$39","v":2027},null,null,"GS-1",{"$f":"$F$39","v":2027},{"$f":"($K$59/$O$59)*O60","v":3996210.1865352555},0.65714070766345445,"GS-1",{"$f":"$F$39","v":2027},{"$f":"($O$59/$O$65)*O66","v":6081209.3056056108}]
[null,null,null,null,"GS-1",{"$f":"$F$40","v":2028},null,null,"GS-1",{"$f":"$F$40","v":2028},{"$f":"($K$59/$O$59)*O61","v":4079098.1717975773},0.65714070766345445,"GS-1",{"$f":"$F$40","v":2028},{"$f":"($O$59/$O$65)*O67","v":6207343.6088007977}]
[null,null,null,null,"GS-1",{"$f":"$F$41","v":2029},null,null,"GS-1",{"$f":"$F$41","v":2029},{"$f":"K61","v":4079098.1717975773},0.65714070766345445,"GS-1",{"$f":"$F$41","v":2029},{"$f":"O61","v":6207343.6088007977}]
[null,null,null,null,"GS-1",null,null,null,"GS-1",null,null,null,"GS-1"]
[null,null,null,null,"Non-Exempt Sales",{"$f":"$F$37","v":2025},{"$f":"'SAR and RAR'!G64","v":70344975.441687003},null,"Total System",{"$f":"$F$37","v":2025},{"$f":"'SAR and RAR'!K64","v":49720524.250294097},0.62830288398092382,"Total System",{"$f":"$F$37","v":2025},{"$f":"'SAR and RAR'!O64","v":79134642.730374098}]
[null,null,null,null,"Non-Exempt Sales",{"$f":"$F$38","v":2026},{"$f":"'SAR and RAR'!G65","v":71720228.921294004},null,"Total System",{"$f":"$F$38","v":2026},{"$f":"'SAR and RAR'!K65","v":51392312.0224078},0.63884781760897957,"Total System",{"$f":"$F$38","v":2026},{"$f":"'SAR and RAR'!O65","v":80445312.022437811}]
[null,null,null,null,"Non-Exempt Sales",{"$f":"$F$39","v":2027},{"$f":"'SAR and RAR'!G66","v":74613099.904532},null,"Total System",{"$f":"$F$39","v":2027},{"$f":"'SAR and RAR'!K66","v":53465246.40155331},0.63884781760897957,"Total System",{"$f":"$F$39","v":2027},{"$f":"'SAR and RAR'!O66","v":83690113.557338402}]
[null,null,null,null,"Non-Exempt Sales",{"$f":"$F$40","v":2028},{"$f":"'SAR and RAR'!G67","v":76160698.563406602},null,"Total System",{"$f":"$F$40","v":2028},{"$f":"'SAR and RAR'!K67","v":54574203.725847758},0.63884781760897957,"Total System",{"$f":"$F$40","v":2028},{"$f":"'SAR and RAR'!O67","v":85425984.438834012}]
[null,null,null,null,"Non-Exempt Sales",{"$f":"$F$41","v":2029},{"$f":"'SAR and RAR'!G68","v":76160698.563406602},null,"Total System",{"$f":"$F$41","v":2029},{"$f":"'SAR and RAR'!K68","v":54574203.725847758},0.63884781760897957,"Total System",{"$f":"$F$41","v":2029},{"$f":"'SAR and RAR'!O68","v":85425984.438834012}]
[null,null,null,null,"Non-Exempt Sales",null,null,null,"Total System",null,null,null,"Total System"]
[]
[null,null,null,null,null,null,null,null,null,{"$f":"Summary!D3","v":2025},{"$f":"VLOOKUP(Summary!D3,'SAR and AR (GS1)'!J58:K63,2,FALSE)","v":3877109.9032000001},null,null,{"$f":"Summary!D3","v":2025},{"$f":"VLOOKUP(Summary!D3,'SAR and AR (GS1)'!N58:O63,2,FALSE)","v":5521410.7975000003}]
[null,null,null,null,null,null,null,null,null,"% of GS-1 Sales (Bdl)",null,null,null,"% of GS-1 Sales (Sys)"]
[null,null,null,null,null,null,null,null,null,{"$f":"$F$37","v":2025},{"$f":"K58/K64","v":7.7978057586089652E-2},null,null,{"$f":"$F$37","v":2025},{"$f":"O58/O64","v":6.9772360207809817E-2}]
[null,null,null,null,null,null,null,null,null,{"$f":"$F$38","v":2026},7.4744071251846969E-2,null,null,{"$f":"$F$38","v":2026},7.2663413241030039E-2]
[null,null,null,null,null,null,null,null,null,{"$f":"$F$39","v":2027},7.4744071251846969E-2,null,null,{"$f":"$F$39","v":2027},7.2663413241030039E-2]
[null,null,null,null,null,null,null,null,null,{"$f":"$F$40","v":2028},7.4744071251846969E-2,null,null,{"$f":"$F$40","v":2028},7.2663413241030039E-2]
[null,null,null,null,null,null,null,null,null,{"$f":"$F$41","v":2029},7.4744071251846969E-2,null,null,{"$f":"$F$41","v":2029},7.2663413241030039E-2]

{"sheet":"Bill Impact (GS1)","index":5,"n_rows":55,"n_cols":21,"rows_kept":55,"cut":false,"hidden":true,"merged":[[19,10,19,11],[33,2,33,9],[0,1,0,21],[34,2,34,3],[34,4,34,5],[34,6,34,7],[34,8,34,9],[1,1,1,3],[2,4,2,9],[19,8,19,9]]}
[null,"CONFIDENTIAL\nThis Excel Sheet Is Marked Confidential In Accordance With Applicable Law and Regulation.\nBasis for Confidentiality In Accompanying Confidentiality Declaration.\nPublic Disclosure Restricted."]
[]
[null,null,null,null,"Schedule TOU-GS-1-E"]
[null,null,null,null,{"$f":"Summary!N4","v":2025},{"$f":"Summary!N3","v":"2025-11-15"},"Proposed","Proposed","Proposed","Proposed"]
[null,null,null,null,"Sales Forecast","Rates","Authorized Rates","Authorized Revenue","w/Pending Rates","w/Pending Revenue"]
[]
[null,null,null,"On Peak",{"$f":"HLOOKUP(E$4,$F$42:$K$52,$A44,FALSE)","v":242.75892288899999},0.69964000000000004,{"$f":"F7/$F$12*$G$12","v":0.69684738268815072},{"$f":"E7*G7","v":169.16592003939425},{"$f":"F7/$F$12*$I$12","v":0.69684738268815072},{"$f":"E7*I7","v":169.16592003939425},null,null,null,"Bundled GS-1 Rev Req "]
[null,null,null,"Mid Peak",86.270995113999987,0.35092999999999996,{"$f":"F8/$F$12*$G$12","v":0.3495292607723296},30.154237148289674,{"$f":"F8/$F$12*$I$12","v":0.3495292607723296},30.154237148289674,null,null,null,"Proposed (Authorized)",{"$f":"'SAR and AR (GS1)'!S19/1000-'SAR and AR (GS1)'!S22/1000","v":1234.2364613744198}]
[null,null,null,"Off Peak",1077.8460354399999,0.26244999999999996,0.26140242923003987,281.75157199998364,0.26140242923003987,281.75157199998364,null,null,null,"Proposed (w/Pending)",{"$f":"'SAR and AR (GS1)'!T19/1000-'SAR and AR (GS1)'!T22/1000","v":1234.2364613744198}]
[null,null,null,"Mid Peak",566.12601805400004,0.41642999999999997,0.4147678171242733,234.81085272551454,0.4147678171242733,234.81085272551454]
[null,null,null,"Off Peak",955.88494204999995,0.27866999999999997,{"$f":"F11/$F$12*$G$12","v":0.27755768700146782},265.31321355493009,0.27755768700146782,265.31321355493009]
[null,null,null,"SuperOff Peak",948.22298967000017,0.20346999999999998,{"$f":"(O8-G14*E14*365/12/10^6)/SUM(E12,F11/F12*E11,F10/F12*E10,F9/F12*E9,F8/F12*E8,F7/F12*E7)","v":0.20265784825847294},192.16483075573845,{"$f":"(O9-I14*E14*365/12/10^6)/SUM(E12,F11/F12*E11,F10/F12*E10,F9/F12*E9,F8/F12*E8,F7/F12*E7)","v":0.20265784825847294},192.16483075573845]
[]
[null,null,null,"Customers",{"$f":"HLOOKUP(E$4,$F$42:$K$53,$A51,FALSE)","v":4276490.0000400003},0.46800000000000003,{"$f":"F14","v":0.46800000000000003},{"$f":"G14*E14*365/12/10^6","v":60.875835150569408},{"$f":"G14","v":0.46800000000000003},{"$f":"I14*E14*365/12/10^6","v":60.875835150569408}]
[]
[]
[]
[]
[null,null,null,null,null,null,null,null,null,null,null,null,null,"2024 Recorded Data"]
[null,"SCHEDULE TOU-GS-1-E ($/kWh)",null,null,"Proposed","Proposed",null,null,null,null,null,null,null,"NAICS","Summer",null,null,"Winter"]
[null,"Rates","Jan 2025",{"$f":"Summary!N3","v":"2025-11-15"},"Authorized","w/Pending",null,null,null,null,null,null,null,null,"On Peak kWh","Mid Peak kWh","Off Peak kWh","Mid Peak kWh","Off Peak kWh","Super Off Peak kWh","Total kWh"]
[null,"On Peak",0.61368,{"$f":"F7","v":0.69964000000000004},{"$f":"G7","v":0.69684738268815072},{"$f":"I7","v":0.69684738268815072},null,null,null,null,null,null,null,"NAICS 531",424.40005556824076,171.04185413123349,2142.0437492858159,1242.2937320811102,2623.0984880161704,1422.3051850127858,{"$f":"SUM(O22:T22)","v":8025.1830640953567}]
[null,"Mid Peak",0.31883,{"$f":"F8","v":0.35092999999999996},0.3495292607723296,{"$f":"I8","v":0.3495292607723296},null,null,null,null,null,null,null,"NAICS 621",797.571595913279,197.86533053051838,3613.515045296092,1413.2746415812949,2031.5831616473401,3587.6907218169667,{"$f":"SUM(O23:T23)","v":11641.500496785491}]
[null,"Off Peak",0.24032000000000003,0.26244999999999996,0.26140242923003987,0.26140242923003987,null,null,null,null,null,null,null,"NAICS 722",2427.2089735988638,1047.857092196117,9631.2947946842687,5240.8289450835409,6947.0905233018239,8200.9311622140394,33495.211491078655]
[null,"Mid Peak",0.37421000000000004,0.41642999999999997,0.4147678171242733,0.4147678171242733]
[null,"Off Peak",0.25403000000000003,0.27866999999999997,0.27755768700146782,0.27755768700146782]
[null,"Super Off Peak",0.18872999999999998,0.20346999999999998,0.20265784825847294,0.20265784825847294]
[]
[]
[]
[null,null,null,null,null,null,null,null,null,null,"*"]
[null,null,"Daily to Monthly Conversion Factor",30.417000000000002]
[]
[null,null,"TOU-GS-1-E"]
[null,null,{"$f":"C21","v":"Jan 2025"},null,{"$f":"D21","v":"2025-11-15"},null,{"$f":"E21","v":"Authorized"},null,{"$f":"F21","v":"w/Pending"}]
[null,null,"Summer","Winter","Summer","Winter","Summer","Winter","Summer","Winter"]
[null,"NAICS 531",{"$f":"SUM(SUM($O$22*$C$22,$P$22*$C$23,$Q$22*$C$24)+SUM($F$14*365/12*4))/4","v":221.67376357053666},{"$f":"SUM(SUM($R$22*$C$25,$S$22*$C$26,$T$22*$C$27)+SUM($F$14*365/12*8))/8","v":189.19201299503538},{"$f":"SUM(SUM($O$22*$D$22,$P$22*$D$23,$Q$22*$D$24)+SUM($F$14*365/12*4))/4","v":244.01758868702501},{"$f":"SUM(SUM($R$22*$D$25,$S$22*$D$26,$T$22*$D$27)+SUM($F$14*365/12*8))/8","v":206.44795881256928},{"$f":"SUM(SUM($O$22*$E$22,$P$22*$E$23,$Q$22*$E$24)+SUM($G$14*365/12*4))/4","v":243.10041008784697},{"$f":"SUM(SUM($R$22*$E$25,$S$22*$E$26,$T$22*$E$27)+SUM($G$14*365/12*8))/8","v":205.68073961935315},{"$f":"SUM(SUM($O$22*$F$22,$P$22*$F$23,$Q$22*$F$24)+SUM($I$14*365/12*4))/4","v":243.10041008784697},{"$f":"SUM(SUM($R$22*$F$25,$S$22*$F$26,$T$22*$F$27)+SUM($G$14*365/12*8))/8","v":205.68073961935315}]
[null,"NAICS 621",{"$f":"SUM(SUM($O$23*$C$22,$P$23*$C$23,$Q$23*$C$24)+SUM($F$14*365/12*4))/4","v":369.4697689996658},{"$f":"SUM(SUM($R$23*$C$25,$S$23*$C$26,$T$23*$C$27)+SUM($F$14*365/12*8))/8","v":229.4911805134908},{"$f":"SUM(SUM($O$23*$D$22,$P$23*$D$23,$Q$23*$D$24)+SUM($F$14*365/12*4))/4","v":408.18922386145016},{"$f":"SUM(SUM($R$23*$D$25,$S$23*$D$26,$T$23*$D$27)+SUM($F$14*365/12*8))/8","v":249.81733372725762},{"$f":"SUM(SUM($O$23*$E$22,$P$23*$E$23,$Q$23*$E$24)+SUM($F$14*365/12*4))/4","v":406.61675318277014},{"$f":"SUM(SUM($R$23*$E$25,$S$23*$E$26,$T$23*$E$27)+SUM($F$14*365/12*8))/8","v":248.87700541050532},{"$f":"SUM(SUM($O$23*$F$22,$P$23*$F$23,$Q$23*$F$24)+SUM($I$14*365/12*4))/4","v":406.61675318277014},{"$f":"SUM(SUM($R$23*$F$25,$S$23*$F$26,$T$23*$F$27)+SUM($G$14*365/12*8))/8","v":248.87700541050532}]
[null,"NAICS 722",{"$f":"SUM(SUM($O$24*$C$22,$P$24*$C$23,$Q$24*$C$24)+SUM($F$14*365/12*4))/4","v":1048.7876611703905},{"$f":"SUM(SUM($R$24*$C$25,$S$24*$C$26,$T$24*$C$27)+SUM($F$14*365/12*8))/8","v":673.44771792734139},{"$f":"SUM(SUM($O$24*$D$22,$P$24*$D$23,$Q$24*$D$24)+SUM($F$14*365/12*4))/4","v":1162.6425736294943},{"$f":"SUM(SUM($R$24*$D$25,$S$24*$D$26,$T$24*$D$27)+SUM($F$14*365/12*8))/8","v":737.61344716316853},{"$f":"SUM(SUM($O$24*$E$22,$P$24*$E$23,$Q$24*$E$24)+SUM($F$14*365/12*4))/4","v":1158.0586978202546},{"$f":"SUM(SUM($R$24*$E$25,$S$24*$E$26,$T$24*$E$27)+SUM($F$14*365/12*8))/8","v":734.72607769520425},{"$f":"SUM(SUM($O$24*$F$22,$P$24*$F$23,$Q$24*$F$24)+SUM($I$14*365/12*4))/4","v":1158.0586978202546},{"$f":"SUM(SUM($R$24*$F$25,$S$24*$F$26,$T$24*$F$27)+SUM($G$14*365/12*8))/8","v":734.72607769520425}]
[]
[]
[null,null,null,null,null,2025,{"$f":"F42+1","v":2026},{"$f":"G42+1","v":2027},2028,2029]
[null,null,null,null,null,"Non-CARE","Non-CARE","Non-CARE","Non-CARE","Non-CARE"]
[3,null,null,"On Peak",null,242.75892288899999,247.53491120999999,{"$f":"G44/G$54*H$54","v":257.51935454973949},{"$f":"H44/H$54*I$54","v":262.8607303704112},{"$f":"I44","v":262.8607303704112}]
[{"$f":"A44+1","v":4},null,null,"Mid Peak",null,86.270995113999987,87.887735480000003,{"$f":"G45/G$54*H$54","v":91.432730854061091},93.329196378587469,93.329196378587469]
[{"$f":"A45+1","v":5},null,null,"Off Peak",null,1077.8460354399999,1098.8771247,1143.2008782072173,1166.9127484847086,1166.9127484847086]
[6,null,null,"Mid Peak",null,566.12601805400004,551.54616942999996,573.79305755986195,585.69447121895678,585.69447121895678]
[7,null,null,"Off Peak",null,955.88494204999995,931.66951489999997,969.24886658583125,989.35268545896793,989.35268545896793]
[8,null,null,"SuperOff Peak",null,948.22298967000017,923.75517590000004,961.01529879935129,980.94833990718382,980.94833990718382]
[9]
[10,null,null,"Customers",null,4276490.0000400003,4154721.9999599997,4177916.8468642635,4201220.4227594845,{"$f":"I51","v":4201220.4227594845}]
[11]
[]
[null,null,null,"Total Sales",null,{"$f":"SUM(F44:F49)","v":3877.109903217},{"$f":"'SAR and AR (GS1)'!K59/1000","v":3841.2706315999999},{"$f":"'SAR and AR (GS1)'!K60/1000","v":3996.2101865352556},{"$f":"'SAR and AR (GS1)'!K61/1000","v":4079.0981717975774},{"$f":"I54","v":4079.0981717975774}]
[null,null,null,null,"Customers",{"$f":"F51/SUM(F$51:F$52)","v":1},{"$f":"G51","v":4154721.9999599997},{"$f":"H51","v":4177916.8468642635},4201220.4227594845,{"$f":"I55","v":4201220.4227594845}]

{"sheet":"SAR and RAR","index":6,"n_rows":77,"n_cols":27,"rows_kept":77,"cut":false,"hidden":true,"merged":[[63,18,63,19],[25,5,25,10],[25,13,25,18],[0,1,0,21],[7,6,7,15],[1,2,1,3],[16,6,16,15],[3,6,3,15],[16,18,16,19]]}
[null,"CONFIDENTIAL\nThis Excel Sheet Is Marked Confidential In Accordance With Applicable Law and Regulation.\nBasis for Confidentiality In Accompanying Confidentiality Declaration.\nPublic Disclosure Restricted."]
[null,null,"Total Revenue ($000)"]
[null,null,"Authorized","w/ Pending"]
[null,"Generation",{"$f":"INDEX('Incremental Rev Req'!$S$9:$X$22,MATCH(B4,'Incremental Rev Req'!$S$9:$S$22,0),MATCH(Summary!$D$3,'Incremental Rev Req'!$S$9:$X$9,0))","v":5525852.9476728207},{"$f":"INDEX('Incremental Rev Req'!$S$69:$X$82,MATCH(B4,'Incremental Rev Req'!$S$69:$S$82,0),MATCH(Summary!$D$3,'Incremental Rev Req'!$S$69:$X$69,0))","v":5525852.9476728207},null,null,"Allocation"]
[null,"Distribution",{"$f":"INDEX('Incremental Rev Req'!$S$9:$X$22,MATCH(B5,'Incremental Rev Req'!$S$9:$S$22,0),MATCH(Summary!$D$3,'Incremental Rev Req'!$S$9:$X$9,0))","v":10708193.85627551},{"$f":"INDEX('Incremental Rev Req'!$S$69:$X$82,MATCH(B5,'Incremental Rev Req'!$S$69:$S$82,0),MATCH(Summary!$D$3,'Incremental Rev Req'!$S$69:$X$69,0))","v":10708193.85627551},null,null,"Generation","Distribution","NDC","PPPC","DCPP","NSGC","Transmission","TOTCA","GHG Rev","DWRBC","PUCRF","SECURITIZATION"]
[null,"Nuclear",{"$f":"INDEX('Incremental Rev Req'!$S$9:$X$22,MATCH(B6,'Incremental Rev Req'!$S$9:$S$22,0),MATCH(Summary!$D$3,'Incremental Rev Req'!$S$9:$X$9,0))","v":-915.75073764498552},{"$f":"INDEX('Incremental Rev Req'!$S$69:$X$82,MATCH(B6,'Incremental Rev Req'!$S$69:$S$82,0),MATCH(Summary!$D$3,'Incremental Rev Req'!$S$69:$X$69,0))","v":-915.75073764498552},null,"Residential",{"$f":"VLOOKUP(Summary!$D$3,'SAR and RAR'!$F$37:$R$42,'SAR and RAR'!G$35,FALSE)","v":0.43353664097137312},{"$f":"VLOOKUP(Summary!$D$3,'SAR and RAR'!$F$37:$R$42,'SAR and RAR'!H$35,FALSE)","v":0.489526966969619},{"$f":"VLOOKUP(Summary!$D$3,'SAR and RAR'!$F$37:$R$42,'SAR and RAR'!I$35,FALSE)","v":0.3376537252060986},{"$f":"VLOOKUP(Summary!$D$3,'SAR and RAR'!$F$37:$R$42,'SAR and RAR'!J$35,FALSE)","v":0.43749935944966239},{"$f":"VLOOKUP(Summary!$D$3,'SAR and RAR'!$F$37:$R$42,'SAR and RAR'!K$35,FALSE)","v":0.4505009853364747},{"$f":"VLOOKUP(Summary!$D$3,'SAR and RAR'!$F$37:$R$42,'SAR and RAR'!L$35,FALSE)","v":0.43823032581794397},{"$f":"VLOOKUP(Summary!$D$3,'SAR and RAR'!$F$37:$R$42,'SAR and RAR'!M$35,FALSE)","v":0.46381018246062999},{"$f":"VLOOKUP(Summary!$D$3,'SAR and RAR'!$F$37:$R$42,'SAR and RAR'!N$35,FALSE)","v":0.5669366333554875},{"$f":"VLOOKUP(Summary!$D$3,'SAR and RAR'!$F$37:$R$42,'SAR and RAR'!O$35,FALSE)","v":0.82642497364889311},{"$f":"VLOOKUP(Summary!$D$3,'SAR and RAR'!$F$37:$R$42,'SAR and RAR'!P$35,FALSE)","v":0.2594263611204975},{"$f":"VLOOKUP(Summary!$D$3,'SAR and RAR'!$F$37:$R$42,'SAR and RAR'!Q$35,FALSE)","v":0.33765372536611121},{"$f":"VLOOKUP(Summary!$D$3,'SAR and RAR'!$F$37:$R$42,'SAR and RAR'!R$35,FALSE)","v":0.36749008607402561}]
[null,"Public Purpose",{"$f":"INDEX('Incremental Rev Req'!$S$9:$X$22,MATCH(B7,'Incremental Rev Req'!$S$9:$S$22,0),MATCH(Summary!$D$3,'Incremental Rev Req'!$S$9:$X$9,0))","v":992971.5889392785},{"$f":"INDEX('Incremental Rev Req'!$S$69:$X$82,MATCH(B7,'Incremental Rev Req'!$S$69:$S$82,0),MATCH(Summary!$D$3,'Incremental Rev Req'!$S$69:$X$69,0))","v":992971.5889392785}]
[null,"DCPP",{"$f":"INDEX('Incremental Rev Req'!$S$9:$X$22,MATCH(B8,'Incremental Rev Req'!$S$9:$S$22,0),MATCH(Summary!$D$3,'Incremental Rev Req'!$S$9:$X$9,0))","v":282858.69088729238},{"$f":"INDEX('Incremental Rev Req'!$S$69:$X$82,MATCH(B8,'Incremental Rev Req'!$S$69:$S$82,0),MATCH(Summary!$D$3,'Incremental Rev Req'!$S$69:$X$69,0))","v":282858.69088729238},null,null,"Revenue ($000) - System",null,null,null,null,null,null,null,null,null,null,null,null,null,null,null,null,"Authorized","w/Pending"]
[null,"New System Gen",{"$f":"INDEX('Incremental Rev Req'!$S$9:$X$22,MATCH(B9,'Incremental Rev Req'!$S$9:$S$22,0),MATCH(Summary!$D$3,'Incremental Rev Req'!$S$9:$X$9,0))","v":603172.22031323682},{"$f":"INDEX('Incremental Rev Req'!$S$69:$X$82,MATCH(B9,'Incremental Rev Req'!$S$69:$S$82,0),MATCH(Summary!$D$3,'Incremental Rev Req'!$S$69:$X$69,0))","v":603172.22031323682},null,"Authorized","Generation","Distribution","NDC","PPPC","DCPP","NSGC","Transmission","TOTCA","GHG Rev","DWRBC","PUCRF","SECURITIZATION","Total","CARE Adj.",null,null,"% of CARE Sales",{"$f":"VLOOKUP(Summary!$D$3,$F$58:$Q$63,$Q$35,FALSE)","v":0.31283756928391171},{"$f":"X9","v":0.31283756928391171}]
[null,"FERC",{"$f":"INDEX('Incremental Rev Req'!$S$9:$X$22,MATCH(B10,'Incremental Rev Req'!$S$9:$S$22,0),MATCH(Summary!$D$3,'Incremental Rev Req'!$S$9:$X$9,0))","v":1344347},{"$f":"INDEX('Incremental Rev Req'!$S$69:$X$82,MATCH(B10,'Incremental Rev Req'!$S$69:$S$82,0),MATCH(Summary!$D$3,'Incremental Rev Req'!$S$69:$X$69,0))","v":1344347},null,"Residential",{"$f":"G6*G11","v":2395659.7254358353},{"$f":"H6*H11","v":5241949.6601852588},{"$f":"I6*I11","v":-309.20664792606203},{"$f":"J6*J11","v":434424.43411264784},{"$f":"K6*K11","v":127428.11895571054},264328.35863220243,623521.82736040058,-1560.6319827861487,-530254.05090679287,108129.68559410672,21376.085538625852,{"$f":"R6*R11","v":39043.719602072881},{"$f":"SUM(G10:R10)","v":8723737.7258793563},{"$f":"-X11+X14","v":-769814.91853650822},null,null,"CARE Line Item Discount %",0.32500000000000001,{"$f":"X10","v":0.32500000000000001}]
[null,"TOTCA",{"$f":"INDEX('Incremental Rev Req'!$S$9:$X$22,MATCH(B11,'Incremental Rev Req'!$S$9:$S$22,0),MATCH(Summary!$D$3,'Incremental Rev Req'!$S$9:$X$9,0))","v":-2752.7449999999953},{"$f":"INDEX('Incremental Rev Req'!$S$69:$X$82,MATCH(B11,'Incremental Rev Req'!$S$69:$S$82,0),MATCH(Summary!$D$3,'Incremental Rev Req'!$S$69:$X$69,0))","v":-2752.7449999999953},null,"Total System",{"$f":"C4","v":5525852.9476728207},{"$f":"C5","v":10708193.85627551},{"$f":"C6","v":-915.75073764498552},{"$f":"C7","v":992971.5889392785},{"$f":"C8","v":282858.69088729238},{"$f":"C9","v":603172.22031323682},{"$f":"C10","v":1344347},{"$f":"C11","v":-2752.7449999999953},{"$f":"C12","v":-641623.9438718505},{"$f":"C14","v":416803},{"$f":"C15","v":63307.714183956326},{"$f":"C16","v":106244.28},{"$f":"SUM(G11:R11)","v":19398458.858662598},0,null,null,"CARE Discounst",{"$f":"SUM(G10*G19/K71*O71,H10:N10,Q10)*X9*X10","v":1041718.4707299016},{"$f":"SUM(G13*G19/K71*O71,H13:N13,Q13)*Y9*Y10","v":1041718.4707299016}]
[null,"GHG Revenue",{"$f":"INDEX('Incremental Rev Req'!$S$9:$X$22,MATCH(B12,'Incremental Rev Req'!$S$9:$S$22,0),MATCH(Summary!$D$3,'Incremental Rev Req'!$S$9:$X$9,0))","v":-641623.9438718505},{"$f":"INDEX('Incremental Rev Req'!$S$69:$X$82,MATCH(B12,'Incremental Rev Req'!$S$69:$S$82,0),MATCH(Summary!$D$3,'Incremental Rev Req'!$S$69:$X$69,0))","v":-641623.9438718505},null,"w/Pending",null,null,null,null,null,null,null,null,null,null,null,null,null,null,null,null,"non-CARE Residential Sales",{"$f":"VLOOKUP(Summary!$D$3,'SAR and RAR'!$F$58:$G$63,2,FALSE)","v":18361053.623393998},{"$f":"X12","v":18361053.623393998}]
[null,"MCAM",{"$f":"INDEX('Incremental Rev Req'!$S$9:$X$22,MATCH(B13,'Incremental Rev Req'!$S$9:$S$22,0),MATCH(Summary!$D$3,'Incremental Rev Req'!$S$9:$X$9,0))","v":4710.7322490276256},{"$f":"INDEX('Incremental Rev Req'!$S$69:$X$82,MATCH(B13,'Incremental Rev Req'!$S$69:$S$82,0),MATCH(Summary!$D$3,'Incremental Rev Req'!$S$69:$X$69,0))","v":4710.7322490276256},null,"Residential",{"$f":"G6*G14","v":2395659.7254358353},{"$f":"H6*H14","v":5241949.6601852588},{"$f":"I6*I14","v":-309.20664792606203},{"$f":"J6*J14","v":434424.43411264784},{"$f":"K6*K14","v":127428.11895571054},264328.35863220243,623521.82736040058,-1560.6319827861487,-530254.05090679287,108129.68559410672,{"$f":"Q6*Q14","v":21376.085538625852},{"$f":"R6*R14","v":39043.719602072881},{"$f":"SUM(G13:R13)","v":8723737.7258793563},{"$f":"-Y11+Y14","v":-769814.91853650822},null,null,"Total Sales (excl. CARE&SL)",{"$f":"VLOOKUP(Summary!$D$3,'SAR and RAR'!$F$64:$G$69,2,FALSE)","v":70344975.441687003},{"$f":"X13","v":70344975.441687003}]
[null,"DWR",{"$f":"INDEX('Incremental Rev Req'!$S$9:$X$22,MATCH(B14,'Incremental Rev Req'!$S$9:$S$22,0),MATCH(Summary!$D$3,'Incremental Rev Req'!$S$9:$X$9,0))","v":416803},{"$f":"INDEX('Incremental Rev Req'!$S$69:$X$82,MATCH(B14,'Incremental Rev Req'!$S$69:$S$82,0),MATCH(Summary!$D$3,'Incremental Rev Req'!$S$69:$X$69,0))","v":416803},null,"Total System",{"$f":"D4","v":5525852.9476728207},{"$f":"D5","v":10708193.85627551},{"$f":"D6","v":-915.75073764498552},{"$f":"D7","v":992971.5889392785},{"$f":"D8","v":282858.69088729238},{"$f":"D9","v":603172.22031323682},{"$f":"D10","v":1344347},{"$f":"D11","v":-2752.7449999999953},{"$f":"D12","v":-641623.9438718505},{"$f":"D14","v":416803},{"$f":"D15","v":63307.714183956326},{"$f":"D16","v":106244.28},{"$f":"SUM(G14:R14)","v":19398458.858662598},0,null,null,"Res CARE Surcharge",{"$f":"X11*X12/X13","v":271903.55219339335},{"$f":"Y11*Y12/Y13","v":271903.55219339335}]
[null,"PUCRF",{"$f":"INDEX('Incremental Rev Req'!$S$9:$X$22,MATCH(B15,'Incremental Rev Req'!$S$9:$S$22,0),MATCH(Summary!$D$3,'Incremental Rev Req'!$S$9:$X$9,0))","v":63307.714183956326},{"$f":"INDEX('Incremental Rev Req'!$S$69:$X$82,MATCH(B15,'Incremental Rev Req'!$S$69:$S$82,0),MATCH(Summary!$D$3,'Incremental Rev Req'!$S$69:$X$69,0))","v":63307.714183956326},null,null,null,null,null,null,null,null,null,null,null,null,null,null,null,null,null,null,"RES CARE Discount Specific Split",0.76843173629643258,{"$f":"X15","v":0.76843173629643258}]
[null,"SECURITIZATION",{"$f":"INDEX('Incremental Rev Req'!$S$9:$X$22,MATCH(B16,'Incremental Rev Req'!$S$9:$S$22,0),MATCH(Summary!$D$3,'Incremental Rev Req'!$S$9:$X$9,0))","v":106244.28},{"$f":"INDEX('Incremental Rev Req'!$S$69:$X$82,MATCH(B16,'Incremental Rev Req'!$S$69:$S$82,0),MATCH(Summary!$D$3,'Incremental Rev Req'!$S$69:$X$69,0))","v":106244.28},null,null,null,null,null,null,null,null,null,null,null,null,null,null,"Authorized","w/Pending",null,null,"CARE Surcharge Allocator",0.6109826201027182,{"$f":"X16","v":0.6109826201027182}]
[null,"Total",{"$f":"SUM(C4:C16)","v":19403169.590911627},{"$f":"SUM(D4:D16)","v":19403169.590911627},null,null,"Revenue Split - Bundled",null,null,null,null,null,null,null,null,null,null,null,"Bundled Revenue",null,null,null,"System CARE Discount",{"$f":"SUM(-X11*X15)+SUM(X11*X16)","v":-164017.65253909072},{"$f":"SUM(-Y11*Y15)+SUM(Y11*Y16)","v":-164017.65253909072}]
[null,null,null,null,null,null,"Generation","Distribution","NDC","PPPC","DCPP","NSGC","Transmission","TOTCA","GHG Rev","DWRBC","PUCRF","SECURITIZATION","Total","Total"]
[null,null,null,null,null,"Residential",{"$f":"VLOOKUP(Summary!$D$3,'SAR and RAR'!$F$44:$R$49,'SAR and RAR'!G$35,FALSE)","v":1.0345794207629018},{"$f":"VLOOKUP(Summary!$D$3,'SAR and RAR'!$F$44:$R$49,'SAR and RAR'!H$35,FALSE)","v":0.68268803963356428},{"$f":"VLOOKUP(Summary!$D$3,'SAR and RAR'!$F$44:$R$49,'SAR and RAR'!I$35,FALSE)","v":0.70119232776047224},{"$f":"VLOOKUP(Summary!$D$3,'SAR and RAR'!$F$44:$R$49,'SAR and RAR'!J$35,FALSE)","v":0.70119233211283682},{"$f":"VLOOKUP(Summary!$D$3,'SAR and RAR'!$F$44:$R$49,'SAR and RAR'!K$35,FALSE)","v":0.70119233209089205},{"$f":"VLOOKUP(Summary!$D$3,'SAR and RAR'!$F$44:$R$49,'SAR and RAR'!L$35,FALSE)","v":0.70119233209421095},{"$f":"VLOOKUP(Summary!$D$3,'SAR and RAR'!$F$44:$R$49,'SAR and RAR'!M$35,FALSE)","v":0.70119233209125587},{"$f":"VLOOKUP(Summary!$D$3,'SAR and RAR'!$F$44:$R$49,'SAR and RAR'!N$35,FALSE)","v":0.70119233042688878},{"$f":"VLOOKUP(Summary!$D$3,'SAR and RAR'!$F$44:$R$49,'SAR and RAR'!O$35,FALSE)","v":0.70657569996841219},{"$f":"VLOOKUP(Summary!$D$3,'SAR and RAR'!$F$44:$R$49,'SAR and RAR'!P$35,FALSE)","v":0.67088876526870445},{"$f":"VLOOKUP(Summary!$D$3,'SAR and RAR'!$F$44:$R$49,'SAR and RAR'!Q$35,FALSE)","v":0.70119233206503373},{"$f":"VLOOKUP(Summary!$D$3,'SAR and RAR'!$F$44:$R$49,'SAR and RAR'!R$35,FALSE)","v":0.6708887652086245},{"$f":"SUMPRODUCT(G10:R10,G19:R19)+T10*X15","v":6219836.8061022051},{"$f":"SUMPRODUCT(G13:R13,G19:R19)+T13*Y15","v":6219836.8061022051}]
[null,null,null,null,null,"Total System",{"$f":"VLOOKUP(Summary!$D$3,'SAR and RAR'!$F$50:$R$55,'SAR and RAR'!G$35,FALSE)","v":1.0300079979939982},{"$f":"VLOOKUP(Summary!$D$3,'SAR and RAR'!$F$50:$R$55,'SAR and RAR'!H$35,FALSE)","v":0.64971955806985959},{"$f":"VLOOKUP(Summary!$D$3,'SAR and RAR'!$F$50:$R$55,'SAR and RAR'!I$35,FALSE)","v":0.62830287983182231},{"$f":"VLOOKUP(Summary!$D$3,'SAR and RAR'!$F$50:$R$55,'SAR and RAR'!J$35,FALSE)","v":0.64289120974341818},{"$f":"VLOOKUP(Summary!$D$3,'SAR and RAR'!$F$50:$R$55,'SAR and RAR'!K$35,FALSE)","v":0.64095261765727696},{"$f":"VLOOKUP(Summary!$D$3,'SAR and RAR'!$F$50:$R$55,'SAR and RAR'!L$35,FALSE)","v":0.63866644750913237},{"$f":"VLOOKUP(Summary!$D$3,'SAR and RAR'!$F$50:$R$55,'SAR and RAR'!M$35,FALSE)","v":0.66417763828823584},{"$f":"VLOOKUP(Summary!$D$3,'SAR and RAR'!$F$50:$R$55,'SAR and RAR'!N$35,FALSE)","v":0.65322305642427669},{"$f":"VLOOKUP(Summary!$D$3,'SAR and RAR'!$F$50:$R$55,'SAR and RAR'!O$35,FALSE)","v":0.6916053708131884},{"$f":"VLOOKUP(Summary!$D$3,'SAR and RAR'!$F$50:$R$55,'SAR and RAR'!P$35,FALSE)","v":0.6118326262408581},{"$f":"VLOOKUP(Summary!$D$3,'SAR and RAR'!$F$50:$R$55,'SAR and RAR'!Q$35,FALSE)","v":0.6283028839215079},{"$f":"VLOOKUP(Summary!$D$3,'SAR and RAR'!$F$50:$R$55,'SAR and RAR'!R$35,FALSE)","v":0.62262350370857455},{"$f":"SUMPRODUCT(G11:R11,G20:R20)+X17","v":14497577.04683888},{"$f":"SUMPRODUCT(G14:R14,G20:R20)+Y17","v":14497577.04683888}]
[]
[null,null,null,null,null,null,null,null,null,null,null,null,null,null,null,null,"Res GHG",null,{"$f":"O10*O19","v":-374664.62718055322},{"$f":"O13*O19","v":-374664.62718055322}]
[null,null,null,null,null,null,null,null,null,null,null,null,null,null,null,null,"Res GHG System",null,{"$f":"O11*O20","v":-443750.56562411156},{"$f":"O14*O20","v":-443750.56562411156}]
[]
[]
[null,null,null,null,null,"Bundled",null,null,null,null,null,null,null,"System (Bundled and Unbundled)"]
[null,null,null,null,null,{"$f":"Summary!D3&\" Sales\"","v":"2025 Sales"},{"$f":"'SAR and AR (GS1)'!$G$27","v":"11/15/2025 Avg Rates"},"Proposed Avg Rates (Authorized)","Proposed Avg Rates (w/Pending)","% Change (Authorized)","% Change (w/Pending)",null,null,{"$f":"Summary!N4&\" Sales\"","v":"2025 Sales"},{"$f":"G27","v":"11/15/2025 Avg Rates"},"Proposed Avg Rates (Authorized)","Proposed Avg Rates (w/Pending)","% Change (Authorized)","% Change (w/Pending)",null,null,null,"1/1/25 Bundled\nw/Credit","1/1/25 Bundled\nw/out Credit",null,"1/1/25 System\nw/Credit","1/1/25 System\nw/out Credit"]
[null,null,null,null,"Residential",{"$f":"VLOOKUP(Summary!$D$3,'SAR and RAR'!$J$58:$K$63,2,FALSE)","v":18735934.088574},{"$f":"IF(Summary!$J$3=\"Y\",W32,X32)","v":35.260672614547445},{"$f":"IF(Summary!$J$3=\"Y\",S19/$F$28*100,SUM(S19-'SAR and RAR'!S22)/$F$28*100)","v":35.197078523586271},{"$f":"IF(Summary!$J$3=\"Y\",T19/$F$28*100,SUM(T19-'SAR and RAR'!T22)/$F$28*100)","v":35.197078523586271},{"$f":"H28/G28-1","v":-1.8035416299726492E-3},{"$f":"I28/G28-1","v":-1.8035416299726492E-3},null,"Residential",{"$f":"VLOOKUP(Summary!$D$3,'SAR and RAR'!$N$58:$O$63,2,FALSE)","v":26720106.924734},{"$f":"IF(Summary!$J$3=\"Y\",Z32,AA32)","v":31.475217358277142},{"$f":"IF(Summary!$J$3=\"Y\",SUM(S10:T10)/N28*100,SUM(S10,T10,-O10)/N28*100)","v":31.752031839349016},{"$f":"IF(Summary!$J$3=\"Y\",SUM(S13:T13)/N28*100,SUM(S13,T13,-O13)/N28*100)","v":31.752031839349016},{"$f":"P28/O28-1","v":8.7946805234397907E-3},{"$f":"Q28/O28-1","v":8.7946805234397907E-3},null,null,"Residential",29.632165563022671,31.629738146992409,"Residential System",26.378091985507211,28.361307178419636]
[null,null,null,null,"Total Bundled",{"$f":"VLOOKUP(Summary!$D$3,'SAR and RAR'!$J$64:$K$69,2,FALSE)","v":49720524.250294097},{"$f":"IF(Summary!$J$3=\"Y\",W33,X33)","v":30.163203046939159},{"$f":"IF(Summary!$J$3=\"Y\",S20/$F$29*100,SUM(S20-S23)/$F$29*100)","v":30.050623636323813},{"$f":"IF(Summary!$J$3=\"Y\",T20/$F$29*100,SUM(T20-T23)/$F$29*100)","v":30.050623636323813},{"$f":"H29/G29-1","v":-3.7323426971649365E-3},{"$f":"I29/G29-1","v":-3.7323426971649365E-3},null,"Total System",{"$f":"VLOOKUP(Summary!$D$3,'SAR and RAR'!$N$64:$O$69,2,FALSE)","v":79134642.730374098},{"$f":"IF(Summary!$J$3=\"Y\",Z33,AA33)","v":25.126029785552312},{"$f":"IF(Summary!$J$3=\"Y\",SUM(S11:T11)/N29*100,SUM(S11,T11,-O11)/N29*100)","v":25.324032700589299},{"$f":"IF(Summary!$J$3=\"Y\",SUM(S14:T14)/N29*100,SUM(S14,T14,-O14)/N29*100)","v":25.324032700589299},{"$f":"P29/O29-1","v":7.8803900467729893E-3},{"$f":"Q29/O29-1","v":7.8803900467729893E-3},null,null,"Bundled",26.414501857962101,27.30660684898934,"Total System",22.108315671300304,22.919117042486967]
[null,null,null,null,{"$f":"M29","v":"Total System"},{"$f":"N29","v":79134642.730374098}]
[null,null,null,null,null,null,null,null,null,null,null,null,null,null,null,null,null,null,null,null,null,null,"10/1/25 Bundled\nw/Credit","10/1/25 Bundled\nw/out Credit",null,"10/1/25 System\nw/Credit","10/1/25 System\nw/out Credit"]
[null,null,null,null,null,null,null,null,null,null,null,null,null,null,null,null,null,null,null,null,null,"Residential",33.254898324227007,35.260672614547445,"Residential System",29.484724970323143,31.475217358277142]
[null,null,null,null,null,null,null,null,null,null,null,null,null,null,null,null,null,null,null,null,null,"Bundled",29.268007448318002,30.163203046939159,"Total System",24.312771242346713,25.126029785552312]
[]
[null,null,null,null,null,null,2,{"$f":"G35+1","v":3},{"$f":"H35+1","v":4},5,6,7,8,9,10,11,12,13]
[null,null,null,null,null,"Residential Allocator","Generation","Distribution","NDC","PPPC","DCPP","NSGC","Transmission","TOTCA","GHG Rev","DWRBC","PUCRF","SECURITIZATION"]
[null,null,null,null,null,2025,0.43353664097137312,0.489526966969619,0.3376537252060986,0.43749935944966239,0.4505009853364747,0.43823032581794397,0.46381018246062999,0.5669366333554875,0.82642497364889311,0.2594263611204975,0.33765372536611121,0.36749008607402561]
[null,null,null,null,null,2026,0.43921570472121541,0.49423412560038338,0.33985821527098431,0.44014046912743404,0.45298822643266234,0.44084214667978078,0.47126309154981139,0.56927650940204877,0.78974502178762973,0.26390379064667235,0.33985821311984865,0.37333648235633021]
[null,null,null,null,null,2027,0.44887248153228271,0.50961845108914139,0.3501930418642118,0.45369838864165868,0.46693322674673776,0.45437884434828918,0.48604175481770545,0.56974033707723148,0.81463176679707405,0.27174078572486654,0.35019303980292316,0.38453756953072205]
[null,null,null,null,null,2028,0.45089499776099706,0.51294546503345417,0.34843563872465105,0.45116371059490906,0.46408141774004674,0.44138032529037913,0.48204658623918289,0.56986393676283831,0.80235633476406365,0.27074905224953422,0.34843563665321425,0.38323372592281046]
[null,null,null,null,null,2029,{"$f":"G40","v":0.45089499776099706},{"$f":"H40","v":0.51294546503345417},0.34843563872465105,0.45116371059490906,0.46408141774004674,0.44138032529037913,0.48204658623918289,0.56986393676283831,0.80235633476406365,0.27074905224953422,0.34843563665321425,0.38323372592281046]
[]
[null,null,null,null,null,"Revenue Split - Bundled"]
[null,null,null,null,"Residential",2025,1.0345794207629018,0.68268803963356428,0.70119232776047224,0.70119233211283682,0.70119233209089205,0.70119233209421095,0.70119233209125587,0.70119233042688878,0.70657569996841219,0.67088876526870445,0.70119233206503373,0.6708887652086245,null,null,{"$f":"G44","v":1.0345794207629018}]
[null,null,null,null,"Residential",2026,0.92594278685705311,0.7043173976139534,0.71543157080098885,0.71543158411443208,0.71543158416693953,0.71543158408543894,0.71543158414155517,0.71543158124525696,0.70436497420435196,0.69700272684902431,0.71543158419765707,0.69700272672899433,null,{"$f":"K59/K58-1","v":4.3977813827146717E-2},{"$f":"G45","v":0.92594278685705311}]
[null,null,null,null,"Residential",2027,0.92700417198494722,0.70755190405421864,0.71859307445578047,0.71859308767949248,0.7185930877316461,0.71859308765069485,0.71859308770643282,0.71859308482965545,0.70759917626440649,0.7002831991222257,0.71859308776215658,0.70028319900293656,null,{"$f":"K60/K59-1","v":4.0335495671836696E-2},0.92700417198494722]
[null,null,null,null,"Residential",2028,0.92728555110674293,0.70841312728553263,0.71943467592651544,0.71943468912612052,0.71943468917817899,0.71943468909737507,0.71943468915301156,0.71943468628147855,0.70846031764535344,0.7011567869385944,0.71943468920863374,0.70115678681950455,null,2.0741648059855011E-2,0.92728555110674293]
[null,null,null,null,"Residential",2029,{"$f":"G47","v":0.92728555110674293},{"$f":"H47","v":0.70841312728553263},0.71943467592651544,0.71943468912612052,0.71943468917817899,0.71943468909737507,0.71943468915301156,0.71943468628147855,0.70846031764535344,0.7011567869385944,0.71943468920863374,0.70115678681950455,null,0,0.92728555110674293]
[null,null,null,null,"Residential",null,null,null,null,null,null,null,null,null,null,null,null,null,null,-1,0]
[null,null,null,null,"Total System",2025,1.0300079979939982,0.64971955806985959,0.62830287983182231,0.64289120974341818,0.64095261765727696,0.63866644750913237,0.66417763828823584,0.65322305642427669,0.6916053708131884,0.6118326262408581,0.6283028839215079,0.62262350370857455,null,null,1.0300079979939982]
[null,null,null,null,"Total System",2026,0.9222853146405231,0.6578191834475825,0.63884780968484989,0.65173838695408171,0.65111256170242737,0.64856335375079699,0.66965473043876134,0.66300629392668609,0.68066315353080553,0.62517281715060091,0.63884781761334009,0.63519439663661459,null,{"$f":"K65/K64-1","v":3.3623695592948533E-2},0.9222853146405231]
[null,null,null,null,"Total System",2027,0.92184214724779656,0.65380885267517963,0.63906933072081085,0.65209879934826842,0.65165990013348174,0.65711747239640561,0.67081018193623743,0.66647871206627263,0.68392955712034265,0.62491602060211271,0.63906933865194404,0.63480563927490063,null,{"$f":"K66/K65-1","v":4.0335495671836696E-2},0.92184214724779656]
[null,null,null,null,"Total System",2028,0.92181836898354985,0.65358022934019555,0.63892586925707118,0.65198928071182383,0.65163584153261278,0.65690665061825537,0.67074750375349257,0.66740403371763779,0.68480819131870874,0.6246106434169969,0.63892587718945382,0.63449517890078844,null,2.0741648059855011E-2,0.92181836898354985]
[null,null,null,null,"Total System",2029,{"$f":"G53","v":0.92181836898354985},{"$f":"H53","v":0.65358022934019555},0.63892586925707118,0.65198928071182383,0.65163584153261278,0.65690665061825537,0.67074750375349257,0.66740403371763779,0.68480819131870874,0.6246106434169969,0.63892587718945382,0.63449517890078844,null,0,0.92181836898354985]
[null,null,null,null,"Total System",null,null,null,null,null,null,null,null,null,null,null,null,null,null,-1,0]
[]
[null,null,null,null,null,"System Sales",null,null,null,"Bundled Sales",null,"% of Bdl",null,"System Sales",null,null,"CARE%"]
[null,null,null,null,"Non-CARE Residential",{"$f":"$F$37","v":2025},18361053.623393998,null,"Residential",{"$f":"$F$37","v":2025},18735934.088574,{"$f":"K58/O58","v":0.7011923321021859},"Residential",{"$f":"$F$37","v":2025},26720106.924734,null,{"$f":"1-G58/O58","v":0.31283756928391171}]
[null,null,null,null,"Non-CARE Residential",{"$f":"$F$38","v":2026},19039213.856099002,null,"Residential",{"$f":"$F$38","v":2026},19559899.509799,0.7154315841245158,"Residential",{"$f":"$F$38","v":2026},27339999.999769002,null,{"$f":"1-G59/O59","v":0.30361324593050965}]
[null,null,null,null,"Non-CARE Residential",{"$f":"$F$39","v":2027},{"$f":"($G$59/$O$59)*O60","v":19807169.984186858},null,"Residential",{"$f":"$F$39","v":2027},{"$f":"($K$59/$O$59)*O60","v":20348857.751818057},0.7154315841245158,"Residential",{"$f":"$F$39","v":2027},{"$f":"($O$59/$O$65)*O66","v":28442772.451427702},null,{"$f":"1-G60/O60","v":0.30361324593050965}]
[null,null,null,null,"Non-CARE Residential",{"$f":"$F$40","v":2028},{"$f":"($G$59/$O$59)*O61","v":20218003.333060585},null,"Residential",{"$f":"$F$40","v":2028},{"$f":"($K$59/$O$59)*O61","v":20770926.597726319},0.71543158412451568,"Residential",{"$f":"$F$40","v":2028},{"$f":"($O$59/$O$65)*O67","v":29032722.427461755},null,{"$f":"1-G61/O61","v":0.30361324593050965}]
[null,null,null,null,"Non-CARE Residential",{"$f":"$F$41","v":2029},{"$f":"G61","v":20218003.333060585},null,"Residential",{"$f":"$F$41","v":2029},{"$f":"K61","v":20770926.597726319},{"$f":"K62/O62","v":0.71543158412451568},"Residential",{"$f":"$F$41","v":2029},{"$f":"O61","v":29032722.427461755},null,{"$f":"1-G62/O62","v":0.30361324593050965}]
[null,null,null,null,"Non-CARE Residential"]
[null,null,null,null,"Non-Exempt Sales",{"$f":"$F$37","v":2025},70344975.441687003,null,"Total System",2025,49720524.250294097,0.62830288397990508,"Total System",2025,79134642.730374098]
[null,null,null,null,"Non-Exempt Sales",{"$f":"$F$38","v":2026},71720228.921294004,null,"Total System",{"$f":"$F$38","v":2026},51392312.0224078,0.63884781760897957,"Total System",{"$f":"$F$38","v":2026},80445312.022437811,{"$f":"O65/O64-1","v":1.6562522390217937E-2}]
[null,null,null,null,"Non-Exempt Sales",{"$f":"$F$39","v":2027},{"$f":"($G$65/$O$65)*O66","v":74613099.904532},null,"Total System",{"$f":"$F$39","v":2027},{"$f":"($K$65/$O$65)*O66","v":53465246.40155331},0.63884781760897957,"Total System",{"$f":"$F$39","v":2027},83690113.557338402,{"$f":"O66/O65-1","v":4.0335495671836696E-2}]
[null,null,null,null,"Non-Exempt Sales",{"$f":"$F$40","v":2028},{"$f":"($G$65/$O$65)*O67","v":76160698.563406602},null,"Total System",{"$f":"$F$40","v":2028},{"$f":"($K$65/$O$65)*O67","v":54574203.725847758},0.63884781760897957,"Total System",{"$f":"$F$40","v":2028},85425984.438834012,{"$f":"O67/O66-1","v":2.0741648059855011E-2}]
[null,null,null,null,"Non-Exempt Sales",{"$f":"$F$41","v":2029},{"$f":"G67","v":76160698.563406602},null,"Total System",{"$f":"$F$41","v":2029},{"$f":"K67","v":54574203.725847758},{"$f":"K68/O68","v":0.63884781760897957},"Total System",{"$f":"$F$41","v":2029},{"$f":"O67","v":85425984.438834012},{"$f":"O68/O67-1","v":0}]
[]
[]
[null,null,null,null,null,null,null,null,null,{"$f":"Summary!D3","v":2025},{"$f":"VLOOKUP(Summary!D3,'SAR and RAR'!J58:K63,2,FALSE)","v":18735934.088574},null,null,{"$f":"Summary!D3","v":2025},{"$f":"VLOOKUP(Summary!D3,'SAR and RAR'!N58:O63,2,FALSE)","v":26720106.924734}]
[null,null,null,null,null,null,null,null,null,"% of Resl Sales (Bdl)",null,null,null,"% of Resl Sales (Sys)"]
[null,null,null,null,null,null,null,null,null,{"$f":"$F$37","v":2025},{"$f":"K58/K64","v":0.37682495048235892},null,null,{"$f":"$F$37","v":2025},{"$f":"O58/O64","v":0.33765372538262656}]
[null,null,null,null,null,null,null,null,null,{"$f":"$F$38","v":2026},0.38059971890874644,null,null,{"$f":"$F$38","v":2026},0.33985821314414605]
[null,null,null,null,null,null,null,null,null,{"$f":"$F$39","v":2027},0.38059971890874644,null,null,{"$f":"$F$39","v":2027},0.33985821314414605]
[null,null,null,null,null,null,null,null,null,{"$f":"$F$40","v":2028},0.38059971890874644,null,null,{"$f":"$F$40","v":2028},0.33985821314414605]
[null,null,null,null,null,null,null,null,null,{"$f":"$F$41","v":2029},0.38059971890874644,null,null,{"$f":"$F$41","v":2029},0.33985821314414605]

{"sheet":"Res Bill Impact","index":7,"n_rows":108,"n_cols":30,"rows_kept":108,"cut":false,"hidden":true,"merged":[[63,12,63,19],[63,22,63,29],[64,2,64,3],[64,4,64,5],[64,6,64,7],[64,8,64,9],[64,22,64,23],[63,2,63,9],[79,2,79,3],[79,4,79,5],[79,6,79,7],[79,8,79,9],[64,18,64,19],[64,12,64,13],[64,14,64,15],[64,16,64,17],[78,2,78,9],[19,27,19,28],[20,23,20,24],[20,25,20,26],[64,24,64,25],[64,26,64,27],[64,28,64,29],[48,22,48,29],[49,22,49,23],[49,24,49,25],[49,26,49,27],[49,28,49,29],[33,22,33,29],[34,22,34,23],[34,24,34,25],[34,26,34,27],[34,28,34,29],[48,12,48,19],[49,12,49,13],[49,14,49,15],[49,16,49,17],[49,18,49,19],[49,2,49,3],[49,4,49,5],[34,6,34,7],[34,8,34,9],[33,2,33,9],[49,6,49,7],[49,8,49,9],[48,2,48,9],[1,1,1,3],[34,2,34,3],[34,4,34,5],[2,4,2,9],[2,14,2,19],[20,15,20,16],[20,17,20,18],[19,19,19,20],[19,8,19,9],[19,10,19,11],[33,12,33,19],[34,12,34,13],[34,14,34,15],[34,16,34,17],[34,18,34,19]]}
["CONFIDENTIAL\nThe Attachment(s) Are Marked Confidential In Accordance With D. 16-08-024 and D. 17-09-023. Basis for Confidentiality In Accompanying Confidentiality Declaration.\n"]
[]
[null,null,null,null,"Schedule D",null,null,null,null,null,null,null,null,null,"Schedule D-CARE"]
[null,null,null,null,{"$f":"Summary!N4","v":2025},{"$f":"Summary!N3","v":"2025-11-15"},"Proposed","Proposed","Proposed","Proposed",null,null,null,null,{"$f":"Summary!N4","v":2025},{"$f":"Summary!N3","v":"2025-11-15"},"Proposed","Proposed","Proposed","Proposed"]
[null,null,null,null,"Sales Forecast","Rates","Authorized Rates","Authorized Revenue","w/Pending Rates","w/Pending Revenue",null,null,null,null,"Sales Forecast","Rates","Authorized Rates","Authorized Revenue","w/Pending Rates","w/Pending Revenue"]
[null,null,null,null,null,"w/ BSC",null,null,null,null,null,null,null,null,null,"w/ BSC"]
[null,null,null,"Baseline - Summer",{"$f":"HLOOKUP(E$4,$F$95:$K$105,$A97,FALSE)","v":3085.6709369045998},0.31901999999999997,{"$f":"(W8-SUM(R14:R15,H14:H15))/SUM(SUM(E7:E8),F9/F7*SUM(E9:E10),F11/F7*SUM(E11:E12),SUM(O7:O8)*(1+(P7/F7-1)),SUM(O9:O10)*(1+(P9/F9-1))*F9/F7,SUM(O11:O12)*(1+(P11/F11-1))*F11/F7)","v":0.31533972231625612},{"$f":"E7*G7","v":973.03461640283831},{"$f":"(W9-SUM(T14:T15,J14:J15))/SUM(SUM(E7:E8),F9/F7*SUM(E9:E10),F11/F7*SUM(E11:E12),SUM(O7:O8)*(1+(P7/F7-1)),SUM(O9:O10)*(1+(P9/F9-1))*F9/F7,SUM(O11:O12)*(1+(P11/F11-1))*F11/F7)","v":0.31533972231625612},{"$f":"E7*I7","v":973.03461640283831},null,null,null,"Baseline - Summer",{"$f":"HLOOKUP(O$4,$M$95:$R$105,$A97,FALSE)","v":1783.36012901},0.21024999999999999,{"$f":"G7*(1+(P7/F7-1))","v":0.20782451450377049},{"$f":"O7*Q7","v":370.62595299688473},{"$f":"I7*(1+(P7/F7-1))","v":0.20782451450377049},{"$f":"O7*S7","v":370.62595299688473},null,"Bundled Residential Rev Req "]
[null,null,null,"- Winter",4290.2912726942004,0.31901999999999997,{"$f":"G7","v":0.31533972231625612},1352.8992585872463,{"$f":"I7","v":0.31533972231625612},1352.8992585872463,null,null,null,"- Winter",2747.2776541200001,0.21024999999999999,{"$f":"G8*(1+(P8/F8-1))","v":0.20782451450377049},570.95164467454651,0.20782451450377049,570.95164467454651,null,"Proposed (Authorized)",{"$f":"'SAR and RAR'!S19/1000-'SAR and RAR'!S22/1000+$W$6","v":6594.5014332827577}]
[null,null,null,"101% - 400% of Baseline - Summer",1911.9288203185401,0.42351000000000005,{"$f":"F9/F$7*G$7","v":0.41862430505346893},800.37987371754753,{"$f":"F9/F$7*I$7","v":0.41862430505346893},800.37987371754753,null,null,null,"101% - 400% of Baseline - Summer",745.49075508300007,0.28078000000000003,0.2775408665035371,206.90415013611198,0.2775408665035371,206.90415013611198,null,"Proposed (w/Pending)",{"$f":"'SAR and RAR'!T19/1000-'SAR and RAR'!T22/1000+$W$6","v":6594.5014332827577}]
[null,null,null,"- Winter",2615.8042580374204,0.42351000000000005,{"$f":"G9","v":0.41862430505346893},1095.03923967682,{"$f":"I9","v":0.41862430505346893},1095.03923967682,null,null,null,"- Winter",1112.0237662050001,0.28078000000000003,0.2775408665035371,308.63203964506249,0.2775408665035371,308.63203964506249]
[null,null,null,"401% of Baseline - Summer",151.63255821328497,{"$f":"F9","v":0.42351000000000005},{"$f":"F11/F$7*G$7","v":0.41862430505346893},63.477074305516091,{"$f":"F11/F$7*I$7","v":0.41862430505346893},63.477074305516091,null,null,null,"401% of Baseline - Summer",8.4770059659299992,{"$f":"P9","v":0.28078000000000003},0.2775408665035371,2.3527155811398655,0.2775408665035371,2.3527155811398655]
[null,null,null,"- Winter",262.89674742179903,{"$f":"F10","v":0.42351000000000005},{"$f":"G11","v":0.41862430505346893},110.05496819026797,{"$f":"I11","v":0.41862430505346893},110.05496819026797,null,null,null,"- Winter",21.080184433099998,{"$f":"P10","v":0.28078000000000003},0.2775408665035371,5.8506126536169472,0.2775408665035371,5.8506126536169472]
[]
[null,null,null,"Basic Charge - Single-Family Residence",{"$f":"HLOOKUP(E$4,$F$95:$K$106,$A104,FALSE)","v":18879671.950581908},0.79400000000000004,{"$f":"F14","v":0.79400000000000004},{"$f":"G14*E14*365/12/10^6","v":455.95981066651194},{"$f":"G14","v":0.79400000000000004},{"$f":"I14*E14*365/12/10^6","v":455.95981066651194},null,null,null,"Basic Charge - Single-Family Residence",{"$f":"HLOOKUP(O$4,$M$95:$R$105,$A104,FALSE)","v":6433922.1264425237},0.19699999999999998,{"$f":"P14","v":0.19699999999999998},{"$f":"Q14*O14*365/12/10^6","v":38.552597541820802},{"$f":"Q14","v":0.19699999999999998},{"$f":"S14*O14*365/12/10^6","v":38.552597541820802}]
[null,null,null,"Basic Charge - Multi-Family Residence",{"$f":"HLOOKUP(E$4,$F$95:$K$106,$A105,FALSE)","v":8588406.5244109407},{"$f":"F14","v":0.79400000000000004},{"$f":"F15","v":0.79400000000000004},{"$f":"G15*E15*365/12/10^6","v":207.41717456996128},{"$f":"G15","v":0.79400000000000004},{"$f":"I15*E15*365/12/10^6","v":207.41717456996128},null,null,null,"Basic Charge - Multi-Family Residence",{"$f":"HLOOKUP(O$4,$M$95:$R$105,$A105,FALSE)","v":5402078.3984754756},{"$f":"P14","v":0.19699999999999998},{"$f":"P15","v":0.19699999999999998},{"$f":"Q15*O15*365/12/10^6","v":32.369703936864923},{"$f":"Q15","v":0.19699999999999998},{"$f":"S15*O15*365/12/10^6","v":32.369703936864923}]
[]
[]
[]
[null,null,null,null,null,null,null,null,null,null,null,null,null,null,"2024 Recorded Data - Average Monthly Usage - kWh (Bundled / Basic Service Only)",null,null,null,null,null,null,null,"2024 Recorded Data - Average Monthly Usage - kWh (Bundled / All Electric Only)"]
[null,"SCHEDULE D RATES ($/kWh)",null,null,"Proposed","Proposed",null,"MONTHLY BASELINE QUANTITIES ","BASIC",null,"ALL-ELECTRIC",null,null,null,"Climate Zone","Summer","Winter","Summer","Winter","Sample Population Weight",null,null,"Climate Zone","Summer","Winter","Summer","Winter","Sample Population Weight"]
[null,"Rates","Jan 2025",{"$f":"Summary!N3","v":"2025-11-15"},"Authorized","w/Pending",null,"Climate Zone","Summer","Winter","Summer","Winter",null,null,null,"Non-CARE",null,"CARE",null,"Non-CARE","CARE",null,null,"Non-CARE",null,"CARE",null,"Non-CARE","CARE"]
[null,"Tier 1",0.33307999999999999,{"$f":"F7","v":0.31901999999999997},{"$f":"G7","v":0.31533972231625612},{"$f":"I7","v":0.31533972231625612},null,"5 warm",{"$f":"17*$O$32","v":517.08900000000006},{"$f":"18.4*$O$32","v":559.67279999999994},{"$f":"16.8*$O$32","v":511.00560000000007},{"$f":"27*$O$32","v":821.25900000000001},null,null,"5 warm",395.55529958042644,410.42554945678205,370.53825168728912,352.8129704971235,3.9155928697053841E-4,5.7807564213015281E-5,null,"5 warm",395.0513658458587,472.35325238958472,354.0301734758014,430.04559863713803,3.215327131817325E-4,1.643349365119362E-4]
[null,"Tier 2",0.42821000000000004,{"$f":"F9","v":0.42351000000000005},{"$f":"G9","v":0.41862430505346893},{"$f":"I9","v":0.41862430505346893},null,"6 cool",{"$f":"11.4*$O$32","v":346.75380000000001},{"$f":"11*$O$32","v":334.58699999999999},{"$f":"8.7*$O$32","v":264.62790000000001},{"$f":"12.6*$O$32","v":383.25420000000003},null,null,"6 cool",441.3631683257405,378.59674258373866,403.43369325682596,346.7408462315413,0.17572854499831955,6.2419116029105173E-2,null,"6 cool",333.66647323508539,330.28035093286309,364.47932752853114,373.63178411023063,0.2756588648786491,0.13365908169637478]
[null,"Tier 2",0.42821000000000004,{"$f":"F11","v":0.42351000000000005},{"$f":"G11","v":0.41862430505346893},{"$f":"I11","v":0.41862430505346893},null,"8 cool",{"$f":"12.8*$O$32","v":389.33760000000007},{"$f":"10.3*$O$32","v":313.29510000000005},{"$f":"9.9*$O$32","v":301.12830000000002},{"$f":"12.3*$O$32","v":374.12910000000005},null,null,"8 cool",568.49757666034611,397.6071314648305,503.08425275756883,372.82836323176218,0.22131365965449243,0.15534197836132338,null,"8 cool",395.58477080411035,347.08625083905127,414.41449435454166,370.25346049642252,0.23198030889315135,0.1999079724355533]
[null,"cust $ / Day",3.1E-2,null,null,null,null,"9 warm",{"$f":"16.9*$O$32","v":514.04729999999995},{"$f":"12*$O$32","v":365.00400000000002},{"$f":"12.5*$O$32","v":380.21250000000003},{"$f":"13.9*$O$32","v":422.79630000000003},null,null,"9 warm",736.18963415586904,454.05427078978795,685.49662095013514,424.24463521296872,0.12758089234186171,9.4636576897113731E-2,null,"9 warm",530.82752326668151,380.17639473286698,510.01019392990275,375.66630062664376,8.053285731708669E-2,8.2923408963923001E-2]
[null,"SCHEDULE D-CARE RATES ($/kWh)",null,null,"Proposed","Proposed",null,"10 hot (Sec 745)",{"$f":"19.3*$O$32","v":587.04810000000009},{"$f":"12.1*$O$32","v":368.04570000000001},{"$f":"15.9*$O$32","v":483.63030000000003},{"$f":"16.4*$O$32","v":498.83879999999999},null,null,"10 hot (Sec 745)",857.95266508501231,482.03064366841272,918.40838713244773,499.65634147444479,0.3013940598280837,0.40756384006325269,null,"10 hot (Sec 745)",627.49530737764235,427.10165059444233,660.32599270553249,426.1138274226762,0.2614116394842172,0.36724476045444088]
[null,"Rates",{"$f":"C21","v":"Jan 2025"},{"$f":"D21","v":"2025-11-15"},"Authorized","w/Pending",null,"13 hot",{"$f":"22.2*$O$32","v":675.25739999999996},{"$f":"12.2*$O$32","v":371.0874},{"$f":"24.2*$O$32","v":736.09140000000002},{"$f":"23*$O$32","v":699.59100000000001},null,null,"13 hot",995.74128264417641,488.35743854290962,1027.5349099558041,485.94231796326983,4.9594246688876777E-2,0.11295038619182414,null,"13 hot",965.98465049839115,574.71502553014284,962.90318583348392,549.71683721023408,3.1061168826849089E-2,6.3783866691499505E-2]
[null,"Tier 1",0.20878000000000002,{"$f":"P7","v":0.21024999999999999},{"$f":"Q7","v":0.20782451450377049},{"$f":"S7","v":0.20782451450377049},null,"14 hot",{"$f":"19.2*$O$32","v":584.00639999999999},{"$f":"11.9*$O$32","v":361.96230000000003},{"$f":"18.5*$O$32","v":562.71450000000004},{"$f":"21.1*$O$32","v":641.79870000000005},null,null,"14 hot",835.92203960332859,473.45592997528871,933.15043284851527,527.57646017003469,6.2328624832907513E-2,0.1067631120608956,null,"14 hot",756.02111470919556,556.70044270579149,880.83999742829826,657.7029793462965,4.4371514419079085E-2,7.0981736910722307E-2]
[null,"Tier 2",0.27299000000000001,{"$f":"P9","v":0.28078000000000003},{"$f":"Q9","v":0.2775408665035371},{"$f":"S9","v":0.2775408665035371},null,"15 hot",{"$f":"45*$O$32","v":1368.7650000000001},{"$f":"9.7*$O$32","v":295.04489999999998},{"$f":"24*$O$32","v":730.00800000000004},{"$f":"17.4*$O$32","v":529.25580000000002},null,null,"15 hot",1219.3970032974962,540.76602898777344,1360.5921700522649,535.57432934570591,3.2190524047722373E-2,3.5156322842192805E-2,null,"15 hot",924.96865072952824,451.63651160207712,1114.1968216909249,520.30200944411388,3.5080327741620745E-2,5.0845229356793059E-2]
[null,"Tier 2",0.27299000000000001,{"$f":"P11","v":0.28078000000000003},{"$f":"Q12","v":0.2775408665035371},{"$f":"S12","v":0.2775408665035371},null,"16 cool",{"$f":"14.7*$O$32","v":447.12990000000002},{"$f":"12.4*$O$32","v":377.17080000000004},{"$f":"13.5*$O$32","v":410.62950000000001},{"$f":"23.2*$O$32","v":705.67439999999999},null,null,"16 cool",565.1396541876444,416.65972304105037,776.78834707242015,493.60376798148923,2.9477888320765366E-2,2.5110859990079476E-2,null,"16 cool",449.84711975668597,538.66300522095594,698.91873102585498,570.11082737142226,3.9581785726165004E-2,3.048960855418123E-2]
[null,"cust $ / Day",2.0999999999999998E-2]
[null,null,null,null,null,null,null,null,null,null,null,null,null,"Daily to Monthly Conversion Factor",30.417000000000002]
[]
[null,null,"NON-CARE",null,null,null,null,null,null,null,null,null,"Essential Use (Basic) - Non-CARE",null,null,null,null,null,null,null,null,null,"Essential Use (Basic) - CARE"]
[null,null,{"$f":"C27","v":"Jan 2025"},null,{"$f":"D27","v":"2025-11-15"},null,{"$f":"E21","v":"Authorized"},null,{"$f":"F21","v":"w/Pending"},null,null,null,{"$f":"C35","v":"Jan 2025"},null,{"$f":"E35","v":"2025-11-15"},null,{"$f":"G35","v":"Authorized"},null,{"$f":"I35","v":"w/Pending"},null,null,null,{"$f":"M35","v":"Jan 2025"},null,{"$f":"O35","v":"2025-11-15"},null,{"$f":"Q35","v":"Authorized"},null,{"$f":"S35","v":"w/Pending"}]
[null,null,"Summer","Winter","Summer","Winter","Summer","Winter","Summer","Winter",null,null,"Summer","Winter","Summer","Winter","Summer","Winter","Summer","Winter",null,null,"Summer","Winter","Summer","Winter","Summer","Winter","Summer","Winter"]
[null,"5 warm",{"$f":"C$22*MIN(I22,P22)+IF(P22-I22>0,C$23*(P22-I22))+ROUND($C$25*365/12,2)+(Summary!N19/12)*2","v":123.3582258509151},{"$f":"C$22*MIN(J22,Q22)+IF(Q22-J22>0,C$23*(Q22-J22))+ROUND($C$25*365/12,2)+(Summary!N19/12)*2","v":128.31120867973161},{"$f":"D$22*MIN(I22,P22)+IF(P22-I22>0,D$23*(P22-I22))+ROUND($F$14*365/12,2)+(Summary!N19/12)*2","v":141.0067183388143},{"$f":"D$22*MIN(J22,Q22)+IF(Q22-J22>0,D$23*(Q22-J22))+ROUND($F$14*365/12,2)+(Summary!N19/12)*2","v":145.75062545436927},{"$f":"E$22*MIN(I22,P22)+IF(P22-I22>0,E$23*(P22-I22))+ROUND($F$14*365/12,2)+(Summary!N19/12)*2","v":139.55096499708182},{"$f":"E$22*MIN(J22,Q22)+IF(Q22-J22>0,E$23*(Q22-J22))+ROUND($F$14*365/12,2)+(Summary!N19/12)*2","v":144.24014546386516},{"$f":"F$22*MIN(I22,P22)+IF(P22-I22>0,F$23*(P22-I22))+ROUND($F$14*365/12,2)+(Summary!N19/12)*2","v":139.55096499708182},{"$f":"F$22*MIN(J22,Q22)+IF(Q22-J22>0,F$23*(Q22-J22))+ROUND($F$14*365/12,2)+(Summary!N19/12)*2","v":144.24014546386516},null,"5 warm",{"$f":"C$22*I22+ROUND($C$25*365/12,2)+(Summary!N19/12)*2","v":163.83867078666665},{"$f":"C$22*J22+ROUND($C$25*365/12,2)+(Summary!N19/12)*2","v":178.02248289066662},{"$f":"D$22*I22+ROUND($F$14*365/12,2)+(Summary!N19/12)*2","v":179.77839944666667},{"$f":"D$22*J22+ROUND($F$14*365/12,2)+(Summary!N19/12)*2","v":193.36348332266664},{"$f":"E$22*I22+ROUND($F$14*365/12,2)+(Summary!N19/12)*2","v":177.87536833945725},{"$f":"E$22*J22+ROUND($F$14*365/12,2)+(Summary!N19/12)*2","v":191.30373200662819},{"$f":"F$22*I22+ROUND($F$14*365/12,2)+(Summary!N19/12)*2","v":177.87536833945725},{"$f":"F$22*J22+ROUND($F$14*365/12,2)+(Summary!N19/12)*2","v":191.30373200662819},null,"5 warm",{"$f":"C$28*I22+ROUND($C$31*365/12,2)+(Summary!N19/12)*2","v":99.264508086666694},{"$f":"C$28*J22+ROUND($C$31*365/12,2)+(Summary!N19/12)*2","v":108.15515385066666},{"$f":"D$28*I22+ROUND($P$14*365/12,2)+(Summary!N19/12)*2","v":105.37462891666668},{"$f":"D$28*J22+ROUND($P$14*365/12,2)+(Summary!N19/12)*2","v":114.32787286666665},{"$f":"E$28*I22+ROUND($P$14*365/12,2)+(Summary!N19/12)*2","v":104.12043704690686},{"$f":"E$28*J22+ROUND($P$14*365/12,2)+(Summary!N19/12)*2","v":112.97039460763249},{"$f":"F$28*I22+ROUND($P$14*365/12,2)+(Summary!N19/12)*2","v":104.12043704690686},{"$f":"F$28*J22+ROUND($P$14*365/12,2)+(Summary!N19/12)*2","v":112.97039460763249}]
[null,"6 cool",{"$f":"C$22*MIN(I23,P23)+IF(P23-I23>0,C$23*(P23-I23))+ROUND($C$25*365/12,2)+(Summary!N19/12)*2","v":147.61609998143197},{"$f":"C$22*MIN(J23,Q23)+IF(Q23-J23>0,C$23*(Q23-J23))+ROUND($C$25*365/12,2)+(Summary!N19/12)*2","v":121.89631649844939},{"$f":"D$22*MIN(I23,P23)+IF(P23-I23>0,D$23*(P23-I23))+ROUND($F$14*365/12,2)+(Summary!N19/12)*2","v":165.50607752230101},{"$f":"D$22*MIN(J23,Q23)+IF(Q23-J23>0,D$23*(Q23-J23))+ROUND($F$14*365/12,2)+(Summary!N19/12)*2","v":140.1951774883058},{"$f":"E$22*MIN(I23,P23)+IF(P23-I23>0,E$23*(P23-I23))+ROUND($F$14*365/12,2)+(Summary!N19/12)*2","v":163.76769473768405},{"$f":"E$22*MIN(J23,Q23)+IF(Q23-J23>0,E$23*(Q23-J23))+ROUND($F$14*365/12,2)+(Summary!N19/12)*2","v":138.7487862419955},{"$f":"F$22*MIN(I23,P23)+IF(P23-I23>0,F$23*(P23-I23))+ROUND($F$14*365/12,2)+(Summary!N19/12)*2","v":163.76769473768405},{"$f":"F$22*MIN(J23,Q23)+IF(Q23-J23>0,F$23*(Q23-J23))+ROUND($F$14*365/12,2)+(Summary!N19/12)*2","v":138.7487862419955},null,"6 cool",{"$f":"C$22*I23+ROUND($C$25*365/12,2)+(Summary!N19/12)*2","v":107.10342237066666},{"$f":"C$22*J23+ROUND($C$25*365/12,2)+(Summary!N19/12)*2","v":103.05090462666666},{"$f":"D$22*I23+ROUND($F$14*365/12,2)+(Summary!N19/12)*2","v":125.43806394266666},{"$f":"D$22*J23+ROUND($F$14*365/12,2)+(Summary!N19/12)*2","v":121.55661140666665},{"$f":"E$22*I23+ROUND($F$14*365/12,2)+(Summary!N19/12)*2","v":124.16191367077327},{"$f":"E$22*J23+ROUND($F$14*365/12,2)+(Summary!N19/12)*2","v":120.32523833729586},{"$f":"F$22*I23+ROUND($F$14*365/12,2)+(Summary!N19/12)*2","v":124.16191367077327},{"$f":"F$22*J23+ROUND($F$14*365/12,2)+(Summary!N19/12)*2","v":120.32523833729586},null,"6 cool",{"$f":"C$28*I23+ROUND($C$31*365/12,2)+(Summary!N19/12)*2","v":63.701925030666679},{"$f":"C$28*J23+ROUND($C$31*365/12,2)+(Summary!N19/12)*2","v":61.161740526666669},{"$f":"D$28*I23+ROUND($P$14*365/12,2)+(Summary!N19/12)*2","v":69.561653116666662},{"$f":"D$28*J23+ROUND($P$14*365/12,2)+(Summary!N19/12)*2","v":67.003583416666658},{"$f":"E$28*I23+ROUND($P$14*365/12,2)+(Summary!N19/12)*2","v":68.720606804004206},{"$f":"E$28*J23+ROUND($P$14*365/12,2)+(Summary!N19/12)*2","v":66.192047500939722},{"$f":"F$28*I23+ROUND($P$14*365/12,2)+(Summary!N19/12)*2","v":68.720606804004206},{"$f":"F$28*J23+ROUND($P$14*365/12,2)+(Summary!N19/12)*2","v":66.192047500939722}]
[null,"8 cool",{"$f":"C$22*MIN(I24,P24)+IF(P24-I24>0,C$23*(P24-I24))+ROUND($C$25*365/12,2)+(Summary!N19/12)*2","v":198.00532808039347},{"$f":"C$22*MIN(J24,Q24)+IF(Q24-J24>0,C$23*(Q24-J24))+ROUND($C$25*365/12,2)+(Summary!N19/12)*2","v":132.06225356822173},{"$f":"D$22*MIN(I24,P24)+IF(P24-I24>0,D$23*(P24-I24))+ROUND($F$14*365/12,2)+(Summary!N19/12)*2","v":214.89918953408983},{"$f":"D$22*MIN(J24,Q24)+IF(Q24-J24>0,D$23*(Q24-J24))+ROUND($F$14*365/12,2)+(Summary!N19/12)*2","v":150.471057914337},{"$f":"E$22*MIN(I24,P24)+IF(P24-I24>0,E$23*(P24-I24))+ROUND($F$14*365/12,2)+(Summary!N19/12)*2","v":212.59099806077737},{"$f":"E$22*MIN(J24,Q24)+IF(Q24-J24>0,E$23*(Q24-J24))+ROUND($F$14*365/12,2)+(Summary!N19/12)*2","v":148.90612208332124},{"$f":"F$22*MIN(I24,P24)+IF(P24-I24>0,F$23*(P24-I24))+ROUND($F$14*365/12,2)+(Summary!N19/12)*2","v":212.59099806077737},{"$f":"F$22*MIN(J24,Q24)+IF(Q24-J24>0,F$23*(Q24-J24))+ROUND($F$14*365/12,2)+(Summary!N19/12)*2","v":148.90612208332124},null,"8 cool",{"$f":"C$22*I24+ROUND($C$25*365/12,2)+(Summary!N19/12)*2","v":121.28723447466668},{"$f":"C$22*J24+ROUND($C$25*365/12,2)+(Summary!N19/12)*2","v":95.95899857466668},{"$f":"D$22*I24+ROUND($F$14*365/12,2)+(Summary!N19/12)*2","v":139.02314781866667},{"$f":"D$22*J24+ROUND($F$14*365/12,2)+(Summary!N19/12)*2","v":114.76406946866668},{"$f":"E$22*I24+ROUND($F$14*365/12,2)+(Summary!N19/12)*2","v":137.59027733794429},{"$f":"E$22*J24+ROUND($F$14*365/12,2)+(Summary!N19/12)*2","v":113.61105650371037},{"$f":"F$22*I24+ROUND($F$14*365/12,2)+(Summary!N19/12)*2","v":137.59027733794429},{"$f":"F$22*J24+ROUND($F$14*365/12,2)+(Summary!N19/12)*2","v":113.61105650371037},null,"8 cool",{"$f":"C$28*I24+ROUND($C$31*365/12,2)+(Summary!N19/12)*2","v":72.592570794666699},{"$f":"C$28*J24+ROUND($C$31*365/12,2)+(Summary!N19/12)*2","v":56.716417644666684},{"$f":"D$28*I24+ROUND($P$14*365/12,2)+(Summary!N19/12)*2","v":78.514897066666677},{"$f":"D$28*J24+ROUND($P$14*365/12,2)+(Summary!N19/12)*2","v":62.526961441666664},{"$f":"E$28*I24+ROUND($P$14*365/12,2)+(Summary!N19/12)*2","v":77.570564364729876},{"$f":"E$28*J24+ROUND($P$14*365/12,2)+(Summary!N19/12)*2","v":61.767068720576894},{"$f":"F$28*I24+ROUND($P$14*365/12,2)+(Summary!N19/12)*2","v":77.570564364729876},{"$f":"F$28*J24+ROUND($P$14*365/12,2)+(Summary!N19/12)*2","v":61.767068720576894}]
[null,"9 warm",{"$f":"C$22*MIN(I25,P25)+IF(P25-I25>0,C$23*(P25-I25))+ROUND($C$25*365/12,2)+(Summary!N19/12)*2","v":257.94911025955139},{"$f":"C$22*MIN(J25,Q25)+IF(Q25-J25>0,C$23*(Q25-J25))+ROUND($C$25*365/12,2)+(Summary!N19/12)*2","v":151.31441544156175},{"$f":"D$22*MIN(I25,P25)+IF(P25-I25>0,D$23*(P25-I25))+ROUND($F$14*365/12,2)+(Summary!N19/12)*2","v":272.88753625101879},{"$f":"D$22*MIN(J25,Q25)+IF(Q25-J25>0,D$23*(Q25-J25))+ROUND($F$14*365/12,2)+(Summary!N19/12)*2","v":168.97392292884976},{"$f":"E$22*MIN(I25,P25)+IF(P25-I25>0,E$23*(P25-I25))+ROUND($F$14*365/12,2)+(Summary!N19/12)*2","v":269.91037976504401},{"$f":"E$22*MIN(J25,Q25)+IF(Q25-J25>0,E$23*(Q25-J25))+ROUND($F$14*365/12,2)+(Summary!N19/12)*2","v":167.19553439518762},{"$f":"F$22*MIN(I25,P25)+IF(P25-I25>0,F$23*(P25-I25))+ROUND($F$14*365/12,2)+(Summary!N19/12)*2","v":269.91037976504401},{"$f":"F$22*MIN(J25,Q25)+IF(Q25-J25>0,F$23*(Q25-J25))+ROUND($F$14*365/12,2)+(Summary!N19/12)*2","v":167.19553439518762},null,"9 warm",{"$f":"C$22*I25+ROUND($C$25*365/12,2)+(Summary!N19/12)*2","v":162.82554135066664},{"$f":"C$22*J25+ROUND($C$25*365/12,2)+(Summary!N19/12)*2","v":113.18219898666668},{"$f":"D$22*I25+ROUND($F$14*365/12,2)+(Summary!N19/12)*2","v":178.80803631266664},{"$f":"D$22*J25+ROUND($F$14*365/12,2)+(Summary!N19/12)*2","v":131.26024274666665},{"$f":"E$22*I25+ROUND($F$14*365/12,2)+(Summary!N19/12)*2","v":176.91619950608785},{"$f":"E$22*J25+ROUND($F$14*365/12,2)+(Summary!N19/12)*2","v":129.9169266709894},{"$f":"F$22*I25+ROUND($F$14*365/12,2)+(Summary!N19/12)*2","v":176.91619950608785},{"$f":"F$22*J25+ROUND($F$14*365/12,2)+(Summary!N19/12)*2","v":129.9169266709894},null,"9 warm",{"$f":"C$28*I25+ROUND($C$31*365/12,2)+(Summary!N19/12)*2","v":98.629461960666674},{"$f":"C$28*J25+ROUND($C$31*365/12,2)+(Summary!N19/12)*2","v":67.512201786666679},{"$f":"D$28*I25+ROUND($P$14*365/12,2)+(Summary!N19/12)*2","v":104.73511149166666},{"$f":"D$28*J25+ROUND($P$14*365/12,2)+(Summary!N19/12)*2","v":73.398757666666668},{"$f":"E$28*I25+ROUND($P$14*365/12,2)+(Summary!N19/12)*2","v":103.48829722114071},{"$f":"E$28*J25+ROUND($P$14*365/12,2)+(Summary!N19/12)*2","v":72.513445758600909},{"$f":"F$28*I25+ROUND($P$14*365/12,2)+(Summary!N19/12)*2","v":103.48829722114071},{"$f":"F$28*J25+ROUND($P$14*365/12,2)+(Summary!N19/12)*2","v":72.513445758600909}]
[null,"10 hot (Sec 745)",{"$f":"C$22*MIN(I26,P26)+IF(P26-I26>0,C$23*(P26-I26))+ROUND($C$25*365/12,2)+(Summary!N19/12)*2","v":303.14469162971977},{"$f":"C$22*MIN(J26,Q26)+IF(Q26-J26>0,C$23*(Q26-J26))+ROUND($C$25*365/12,2)+(Summary!N19/12)*2","v":163.00482115091765},{"$f":"D$22*MIN(I26,P26)+IF(P26-I26>0,D$23*(P26-I26))+ROUND($F$14*365/12,2)+(Summary!N19/12)*2","v":316.82754388782024},{"$f":"D$22*MIN(J26,Q26)+IF(Q26-J26>0,D$23*(Q26-J26))+ROUND($F$14*365/12,2)+(Summary!N19/12)*2","v":180.50436937367613},{"$f":"E$22*MIN(I26,P26)+IF(P26-I26>0,E$23*(P26-I26))+ROUND($F$14*365/12,2)+(Summary!N19/12)*2","v":313.34348680147792},{"$f":"E$22*MIN(J26,Q26)+IF(Q26-J26>0,E$23*(Q26-J26))+ROUND($F$14*365/12,2)+(Summary!N19/12)*2","v":178.59296333410686},{"$f":"F$22*MIN(I26,P26)+IF(P26-I26>0,F$23*(P26-I26))+ROUND($F$14*365/12,2)+(Summary!N19/12)*2","v":313.34348680147792},{"$f":"F$22*MIN(J26,Q26)+IF(Q26-J26>0,F$23*(Q26-J26))+ROUND($F$14*365/12,2)+(Summary!N19/12)*2","v":178.59296333410686},null,"10 hot (Sec 745)",{"$f":"C$22*I26+ROUND($C$25*365/12,2)+(Summary!N19/12)*2","v":187.14064781466666},{"$f":"C$22*J26+ROUND($C$25*365/12,2)+(Summary!N19/12)*2","v":114.19532842266666},{"$f":"D$22*I26+ROUND($F$14*365/12,2)+(Summary!N19/12)*2","v":202.09675152866669},{"$f":"D$22*J26+ROUND($F$14*365/12,2)+(Summary!N19/12)*2","v":132.23060588066664},{"$f":"E$22*I26+ROUND($F$14*365/12,2)+(Summary!N19/12)*2","v":199.93625150695246},{"$f":"E$22*J26+ROUND($F$14*365/12,2)+(Summary!N19/12)*2","v":130.87609550435877},{"$f":"F$22*I26+ROUND($F$14*365/12,2)+(Summary!N19/12)*2","v":199.93625150695246},{"$f":"F$22*J26+ROUND($F$14*365/12,2)+(Summary!N19/12)*2","v":130.87609550435877},null,"10 hot (Sec 745)",{"$f":"C$28*I26+ROUND($C$31*365/12,2)+(Summary!N19/12)*2","v":113.8705689846667},{"$f":"C$28*J26+ROUND($C$31*365/12,2)+(Summary!N19/12)*2","v":68.147247912666685},{"$f":"D$28*I26+ROUND($P$14*365/12,2)+(Summary!N19/12)*2","v":120.0835296916667},{"$f":"D$28*J26+ROUND($P$14*365/12,2)+(Summary!N19/12)*2","v":74.038275091666662},{"$f":"E$28*I26+ROUND($P$14*365/12,2)+(Summary!N19/12)*2","v":118.6596530395276},{"$f":"E$28*J26+ROUND($P$14*365/12,2)+(Summary!N19/12)*2","v":73.145585584367026},{"$f":"F$28*I26+ROUND($P$14*365/12,2)+(Summary!N19/12)*2","v":118.6596530395276},{"$f":"F$28*J26+ROUND($P$14*365/12,2)+(Summary!N19/12)*2","v":73.145585584367026}]
[null,"13 hot",{"$f":"C$22*MIN(I27,P27)+IF(P27-I27>0,C$23*(P27-I27))+ROUND($C$25*365/12,2)+(Summary!N19/12)*2","v":353.75580484572947},{"$f":"C$22*MIN(J27,Q27)+IF(Q27-J27>0,C$23*(Q27-J27))+ROUND($C$25*365/12,2)+(Summary!N19/12)*2","v":165.42466106312597},{"$f":"D$22*MIN(I27,P27)+IF(P27-I27>0,D$23*(P27-I27))+ROUND($F$14*365/12,2)+(Summary!N19/12)*2","v":365.96541155330181},{"$f":"D$22*MIN(J27,Q27)+IF(Q27-J27>0,D$23*(Q27-J27))+ROUND($F$14*365/12,2)+(Summary!N19/12)*2","v":182.86600303797431},{"$f":"E$22*MIN(I27,P27)+IF(P27-I27>0,E$23*(P27-I27))+ROUND($F$14*365/12,2)+(Summary!N19/12)*2","v":361.91449032741963},{"$f":"E$22*MIN(J27,Q27)+IF(Q27-J27>0,E$23*(Q27-J27))+ROUND($F$14*365/12,2)+(Summary!N19/12)*2","v":180.92735272634718},{"$f":"F$22*MIN(I27,P27)+IF(P27-I27>0,F$23*(P27-I27))+ROUND($F$14*365/12,2)+(Summary!N19/12)*2","v":361.91449032741963},{"$f":"F$22*MIN(J27,Q27)+IF(Q27-J27>0,F$23*(Q27-J27))+ROUND($F$14*365/12,2)+(Summary!N19/12)*2","v":180.92735272634718},null,"13 hot",{"$f":"C$22*I27+ROUND($C$25*365/12,2)+(Summary!N19/12)*2","v":216.52140145866665},{"$f":"C$22*J27+ROUND($C$25*365/12,2)+(Summary!N19/12)*2","v":115.20845785866666},{"$f":"D$22*I27+ROUND($F$14*365/12,2)+(Summary!N19/12)*2","v":230.23728241466662},{"$f":"D$22*J27+ROUND($F$14*365/12,2)+(Summary!N19/12)*2","v":133.20096901466664},{"$f":"E$22*I27+ROUND($F$14*365/12,2)+(Summary!N19/12)*2","v":227.75214767466375},{"$f":"E$22*J27+ROUND($F$14*365/12,2)+(Summary!N19/12)*2","v":131.83526433772812},{"$f":"F$22*I27+ROUND($F$14*365/12,2)+(Summary!N19/12)*2","v":227.75214767466375},{"$f":"F$22*J27+ROUND($F$14*365/12,2)+(Summary!N19/12)*2","v":131.83526433772812},null,"13 hot",{"$f":"C$28*I27+ROUND($C$31*365/12,2)+(Summary!N19/12)*2","v":132.28690663866664},{"$f":"C$28*J27+ROUND($C$31*365/12,2)+(Summary!N19/12)*2","v":68.782294038666677},{"$f":"D$28*I27+ROUND($P$14*365/12,2)+(Summary!N19/12)*2","v":138.62953501666667},{"$f":"D$28*J27+ROUND($P$14*365/12,2)+(Summary!N19/12)*2","v":74.677792516666671},{"$f":"E$28*I27+ROUND($P$14*365/12,2)+(Summary!N19/12)*2","v":136.99170798674501},{"$f":"E$28*J27+ROUND($P$14*365/12,2)+(Summary!N19/12)*2","v":73.777725410133144},{"$f":"F$28*I27+ROUND($P$14*365/12,2)+(Summary!N19/12)*2","v":136.99170798674501},{"$f":"F$28*J27+ROUND($P$14*365/12,2)+(Summary!N19/12)*2","v":73.777725410133144}]
[null,"14 hot",{"$f":"C$22*MIN(I28,P28)+IF(P28-I28>0,C$23*(P28-I28))+ROUND($C$25*365/12,2)+(Summary!N19/12)*2","v":294.000314413208},{"$f":"C$22*MIN(J28,Q28)+IF(Q28-J28>0,C$23*(Q28-J28))+ROUND($C$25*365/12,2)+(Summary!N19/12)*2","v":159.91175684238502},{"$f":"D$22*MIN(I28,P28)+IF(P28-I28>0,D$23*(P28-I28))+ROUND($F$14*365/12,2)+(Summary!N19/12)*2","v":307.81518092307232},{"$f":"D$22*MIN(J28,Q28)+IF(Q28-J28>0,D$23*(Q28-J28))+ROUND($F$14*365/12,2)+(Summary!N19/12)*2","v":177.50854684350119},{"$f":"E$22*MIN(I28,P28)+IF(P28-I28>0,E$23*(P28-I28))+ROUND($F$14*365/12,2)+(Summary!N19/12)*2","v":304.43509223462661},{"$f":"E$22*MIN(J28,Q28)+IF(Q28-J28>0,E$23*(Q28-J28))+ROUND($F$14*365/12,2)+(Summary!N19/12)*2","v":175.63170120391391},{"$f":"F$22*MIN(I28,P28)+IF(P28-I28>0,F$23*(P28-I28))+ROUND($F$14*365/12,2)+(Summary!N19/12)*2","v":304.43509223462661},{"$f":"F$22*MIN(J28,Q28)+IF(Q28-J28>0,F$23*(Q28-J28))+ROUND($F$14*365/12,2)+(Summary!N19/12)*2","v":175.63170120391391},null,"14 hot",{"$f":"C$22*I28+ROUND($C$25*365/12,2)+(Summary!N19/12)*2","v":186.12751837866665},{"$f":"C$22*J28+ROUND($C$25*365/12,2)+(Summary!N19/12)*2","v":112.16906955066668},{"$f":"D$22*I28+ROUND($F$14*365/12,2)+(Summary!N19/12)*2","v":201.12638839466663},{"$f":"D$22*J28+ROUND($F$14*365/12,2)+(Summary!N19/12)*2","v":130.28987961266665},{"$f":"E$22*I28+ROUND($F$14*365/12,2)+(Summary!N19/12)*2","v":198.97708267358306},{"$f":"E$22*J28+ROUND($F$14*365/12,2)+(Summary!N19/12)*2","v":128.95775783762005},{"$f":"F$22*I28+ROUND($F$14*365/12,2)+(Summary!N19/12)*2","v":198.97708267358306},{"$f":"F$22*J28+ROUND($F$14*365/12,2)+(Summary!N19/12)*2","v":128.95775783762005},null,"14 hot",{"$f":"C$28*I28+ROUND($C$31*365/12,2)+(Summary!N19/12)*2","v":113.23552285866668},{"$f":"C$28*J28+ROUND($C$31*365/12,2)+(Summary!N19/12)*2","v":66.877155660666688},{"$f":"D$28*I28+ROUND($P$14*365/12,2)+(Summary!N19/12)*2","v":119.44401226666666},{"$f":"D$28*J28+ROUND($P$14*365/12,2)+(Summary!N19/12)*2","v":72.759240241666674},{"$f":"E$28*I28+ROUND($P$14*365/12,2)+(Summary!N19/12)*2","v":118.02751321376145},{"$f":"E$28*J28+ROUND($P$14*365/12,2)+(Summary!N19/12)*2","v":71.881305932834792},{"$f":"F$28*I28+ROUND($P$14*365/12,2)+(Summary!N19/12)*2","v":118.02751321376145},{"$f":"F$28*J28+ROUND($P$14*365/12,2)+(Summary!N19/12)*2","v":71.881305932834792}]
[null,"15 hot",{"$f":"C$22*MIN(I29,P29)+IF(P29-I29>0,C$23*(P29-I29))+ROUND($C$25*365/12,2)+(Summary!N19/12)*2","v":397.76342052499672},{"$f":"C$22*MIN(J29,Q29)+IF(Q29-J29>0,C$23*(Q29-J29))+ROUND($C$25*365/12,2)+(Summary!N19/12)*2","v":195.10046660252115},{"$f":"D$22*MIN(I29,P29)+IF(P29-I29>0,D$23*(P29-I29))+ROUND($F$14*365/12,2)+(Summary!N19/12)*2","v":403.82869865863387},{"$f":"D$22*MIN(J29,Q29)+IF(Q29-J29>0,D$23*(Q29-J29))+ROUND($F$14*365/12,2)+(Summary!N19/12)*2","v":213.00724600227858},{"$f":"E$22*MIN(I29,P29)+IF(P29-I29>0,E$23*(P29-I29))+ROUND($F$14*365/12,2)+(Summary!N19/12)*2","v":399.34097907977394},{"$f":"E$22*MIN(J29,Q29)+IF(Q29-J29>0,E$23*(Q29-J29))+ROUND($F$14*365/12,2)+(Summary!N19/12)*2","v":210.72088036295469},{"$f":"F$22*MIN(I29,P29)+IF(P29-I29>0,F$23*(P29-I29))+ROUND($F$14*365/12,2)+(Summary!N19/12)*2","v":399.34097907977394},{"$f":"F$22*MIN(J29,Q29)+IF(Q29-J29>0,F$23*(Q29-J29))+ROUND($F$14*365/12,2)+(Summary!N19/12)*2","v":210.72088036295469},null,"15 hot",{"$f":"C$22*I29+ROUND($C$25*365/12,2)+(Summary!N19/12)*2","v":447.51491286666669},{"$f":"C$22*J29+ROUND($C$25*365/12,2)+(Summary!N19/12)*2","v":89.880221958666667},{"$f":"D$22*I29+ROUND($F$14*365/12,2)+(Summary!N19/12)*2","v":451.48007696666667},{"$f":"D$22*J29+ROUND($F$14*365/12,2)+(Summary!N19/12)*2","v":108.94189066466664},{"$f":"E$22*I29+ROUND($F$14*365/12,2)+(Summary!N19/12)*2","v":446.44264168287702},{"$f":"E$22*J29+ROUND($F$14*365/12,2)+(Summary!N19/12)*2","v":107.85604350349423},{"$f":"F$22*I29+ROUND($F$14*365/12,2)+(Summary!N19/12)*2","v":446.44264168287702},{"$f":"F$22*J29+ROUND($F$14*365/12,2)+(Summary!N19/12)*2","v":107.85604350349423},null,"15 hot",{"$f":"C$28*I29+ROUND($C$31*365/12,2)+(Summary!N19/12)*2","v":277.07742336666672},{"$f":"C$28*J29+ROUND($C$31*365/12,2)+(Summary!N19/12)*2","v":52.90614088866667},{"$f":"D$28*I29+ROUND($P$14*365/12,2)+(Summary!N19/12)*2","v":284.43950791666668},{"$f":"D$28*J29+ROUND($P$14*365/12,2)+(Summary!N19/12)*2","v":58.689856891666658},{"$f":"E$28*I29+ROUND($P$14*365/12,2)+(Summary!N19/12)*2","v":281.11958826142012},{"$f":"E$28*J29+ROUND($P$14*365/12,2)+(Summary!N19/12)*2","v":57.974229765980176},{"$f":"F$28*I29+ROUND($P$14*365/12,2)+(Summary!N19/12)*2","v":281.11958826142012},{"$f":"F$28*J29+ROUND($P$14*365/12,2)+(Summary!N19/12)*2","v":57.974229765980176}]
[null,"16 cool",{"$f":"C$22*MIN(I30,P30)+IF(P30-I30>0,C$23*(P30-I30))+ROUND($C$25*365/12,2)+(Summary!N19/12)*2","v":191.06965059935786},{"$f":"C$22*MIN(J30,Q30)+IF(Q30-J30>0,C$23*(Q30-J30))+ROUND($C$25*365/12,2)+(Summary!N19/12)*2","v":134.14426846607483},{"$f":"D$22*MIN(I30,P30)+IF(P30-I30>0,D$23*(P30-I30))+ROUND($F$14*365/12,2)+(Summary!N19/12)*2","v":207.43835836067592},{"$f":"D$22*MIN(J30,Q30)+IF(Q30-J30>0,D$23*(Q30-J30))+ROUND($F$14*365/12,2)+(Summary!N19/12)*2","v":151.86564907978189},{"$f":"E$22*MIN(I30,P30)+IF(P30-I30>0,E$23*(P30-I30))+ROUND($F$14*365/12,2)+(Summary!N19/12)*2","v":205.21623650829537},{"$f":"E$22*MIN(J30,Q30)+IF(Q30-J30>0,E$23*(Q30-J30))+ROUND($F$14*365/12,2)+(Summary!N19/12)*2","v":150.28462496983647},{"$f":"F$22*MIN(I30,P30)+IF(P30-I30>0,F$23*(P30-I30))+ROUND($F$14*365/12,2)+(Summary!N19/12)*2","v":205.21623650829537},{"$f":"F$22*MIN(J30,Q30)+IF(Q30-J30>0,F$23*(Q30-J30))+ROUND($F$14*365/12,2)+(Summary!N19/12)*2","v":150.28462496983647},null,"16 cool",{"$f":"C$22*I30+ROUND($C$25*365/12,2)+(Summary!N19/12)*2","v":140.53669375866664},{"$f":"C$22*J30+ROUND($C$25*365/12,2)+(Summary!N19/12)*2","v":117.23471673066668},{"$f":"D$22*I30+ROUND($F$14*365/12,2)+(Summary!N19/12)*2","v":157.46004736466665},{"$f":"D$22*J30+ROUND($F$14*365/12,2)+(Summary!N19/12)*2","v":135.14169528266666},{"$f":"E$22*I30+ROUND($F$14*365/12,2)+(Summary!N19/12)*2","v":155.81448517196205},{"$f":"E$22*J30+ROUND($F$14*365/12,2)+(Summary!N19/12)*2","v":133.75360200446684},{"$f":"F$22*I30+ROUND($F$14*365/12,2)+(Summary!N19/12)*2","v":155.81448517196205},{"$f":"F$22*J30+ROUND($F$14*365/12,2)+(Summary!N19/12)*2","v":133.75360200446684},null,"16 cool",{"$f":"C$28*I30+ROUND($C$31*365/12,2)+(Summary!N19/12)*2","v":84.658447188666685},{"$f":"C$28*J30+ROUND($C$31*365/12,2)+(Summary!N19/12)*2","v":70.052386290666689},{"$f":"D$28*I30+ROUND($P$14*365/12,2)+(Summary!N19/12)*2","v":90.665728141666662},{"$f":"D$28*J30+ROUND($P$14*365/12,2)+(Summary!N19/12)*2","v":75.956827366666673},{"$f":"E$28*I30+ROUND($P$14*365/12,2)+(Summary!N19/12)*2","v":89.581221054286118},{"$f":"E$28*J30+ROUND($P$14*365/12,2)+(Summary!N19/12)*2","v":75.042005061665392},{"$f":"F$28*I30+ROUND($P$14*365/12,2)+(Summary!N19/12)*2","v":89.581221054286118},{"$f":"F$28*J30+ROUND($P$14*365/12,2)+(Summary!N19/12)*2","v":75.042005061665392}]
[null,"ALL",{"$f":"SUMPRODUCT(C37:C45,$T$22:$T$30)","v":248.39076603342522},147.53746476255091,263.45443390195385,165.42191244251964,260.58609954645283,163.68450060287438,260.58609954645283,163.68450060287438,null,"ALL",{"$f":"SUMPRODUCT(M37:M45,$T$22:$T$30)","v":163.79206291629771},107.32755249629763,179.73375899150545,125.65273306923918,177.83124286539729,124.37410633193328,177.83124286539729,124.37410633193328,null,"ALL",{"$f":"SUMPRODUCT(W37:W45,$U$22:$U$30)","v":109.90021444919638},{"$f":"SUMPRODUCT(X37:X45,$U$22:$U$30)","v":65.325893184346199},116.08522026987039,71.197055474704385,114.70746890435198,70.337142837666562,114.70746890435198,70.337142837666562]
[]
[]
[null,null,"CARE",null,null,null,null,null,null,null,null,null,"Essential Use (All-Electric) - Non-CARE",null,null,null,null,null,null,null,null,null,"Essential Use (All-Electric) - CARE"]
[null,null,{"$f":"C27","v":"Jan 2025"},null,{"$f":"D27","v":"2025-11-15"},null,{"$f":"E27","v":"Authorized"},null,{"$f":"F27","v":"w/Pending"},null,null,null,{"$f":"C50","v":"Jan 2025"},null,{"$f":"E50","v":"2025-11-15"},null,{"$f":"G50","v":"Authorized"},null,{"$f":"I50","v":"w/Pending"},null,null,null,{"$f":"M50","v":"Jan 2025"},null,{"$f":"O50","v":"2025-11-15"},null,{"$f":"Q50","v":"Authorized"},null,{"$f":"S50","v":"w/Pending"}]
[null,null,"Summer","Winter","Summer","Winter","Summer","Winter","Summer","Winter",null,null,"Summer","Winter","Summer","Winter","Summer","Winter","Summer","Winter",null,null,"Summer","Winter","Summer","Winter","Summer","Winter","Summer","Winter"]
[null,"5 warm",{"$f":"C$28*MIN(I22,R22)+IF(R22-I22>0,C$29*(R22-I22))+ROUND($C$31*365/12,2)+(Summary!N19/12)*2","v":68.667642853938901},{"$f":"C$28*MIN(J22,S22)+IF(S22-J22>0,C$29*(S22-J22))+ROUND($C$31*365/12,2)+(Summary!N19/12)*2","v":64.966958647056117},{"$f":"D$28*MIN(I22,R22)+IF(R22-I22>0,D$29*(R22-I22))+ROUND($P$14*365/12,2)+(Summary!N19/12)*2","v":74.562334083919197},{"$f":"D$28*MIN(J22,S22)+IF(S22-J22>0,D$29*(S22-J22))+ROUND($P$14*365/12,2)+(Summary!N19/12)*2","v":70.835593713686876},{"$f":"E$28*MIN(I22,R22)+IF(R22-I22>0,E$29*(R22-I22))+ROUND($P$14*365/12,2)+(Summary!N19/12)*2","v":73.663598928653442},{"$f":"E$28*MIN(J22,S22)+IF(S22-J22>0,E$29*(S22-J22))+ROUND($P$14*365/12,2)+(Summary!N19/12)*2","v":69.979850970864462},{"$f":"F$28*MIN(I22,R22)+IF(R22-I22>0,F$29*(R22-I22))+ROUND($P$14*365/12,2)+(Summary!N19/12)*2","v":73.663598928653442},{"$f":"F$28*MIN(J22,S22)+IF(S22-J22>0,F$29*(S22-J22))+ROUND($P$14*365/12,2)+(Summary!N19/12)*2","v":69.979850970864462},null,"5 warm",{"$f":"C$22*K22+ROUND($C$25*365/12,2)+(Summary!N19/12)*2","v":161.81241191466668},{"$f":"C$22*L22+ROUND($C$25*365/12,2)+(Summary!N19/12)*2","v":265.15161438666667},{"$f":"D$22*K22+ROUND($F$14*365/12,2)+(Summary!N19/12)*2","v":177.83767317866668},{"$f":"D$22*L22+ROUND($F$14*365/12,2)+(Summary!N19/12)*2","v":276.81471284666662},{"$f":"E$22*K22+ROUND($F$14*365/12,2)+(Summary!N19/12)*2","v":175.95703067271853},{"$f":"E$22*L22+ROUND($F$14*365/12,2)+(Summary!N19/12)*2","v":273.79225167639288},{"$f":"F$22*K22+ROUND($F$14*365/12,2)+(Summary!N19/12)*2","v":175.95703067271853},{"$f":"F$22*L22+ROUND($F$14*365/12,2)+(Summary!N19/12)*2","v":273.79225167639288},null,"5 warm",{"$f":"C$28*K22+ROUND($C$31*365/12,2)+(Summary!N19/12)*2","v":97.994415834666697},{"$f":"C$28*L22+ROUND($C$31*365/12,2)+(Summary!N19/12)*2","v":162.76912068666667},{"$f":"D$28*K22+ROUND($P$14*365/12,2)+(Summary!N19/12)*2","v":104.09559406666668},{"$f":"D$28*L22+ROUND($P$14*365/12,2)+(Summary!N19/12)*2","v":169.32637141666666},{"$f":"E$28*K22+ROUND($P$14*365/12,2)+(Summary!N19/12)*2","v":102.85615739537462},{"$f":"E$28*L22+ROUND($P$14*365/12,2)+(Summary!N19/12)*2","v":167.33441962351873},{"$f":"F$28*K22+ROUND($P$14*365/12,2)+(Summary!N19/12)*2","v":102.85615739537462},{"$f":"F$28*L22+ROUND($P$14*365/12,2)+(Summary!N19/12)*2","v":167.33441962351873}]
[null,"6 cool",{"$f":"C$28*MIN(I23,R23)+IF(R23-I23>0,C$29*(R23-I23))+ROUND($C$31*365/12,2)+(Summary!N19/12)*2","v":79.174969090847597},{"$f":"C$28*MIN(J23,S23)+IF(S23-J23>0,C$29*(S23-J23))+ROUND($C$31*365/12,2)+(Summary!N19/12)*2","v":64.479619009415131},{"$f":"D$28*MIN(I23,R23)+IF(R23-I23>0,D$29*(R23-I23))+ROUND($P$14*365/12,2)+(Summary!N19/12)*2","v":85.476233545318252},{"$f":"D$28*MIN(J23,S23)+IF(S23-J23>0,D$29*(S23-J23))+ROUND($P$14*365/12,2)+(Summary!N19/12)*2","v":70.416140361558831},{"$f":"E$28*MIN(I23,R23)+IF(R23-I23>0,E$29*(R23-I23))+ROUND($P$14*365/12,2)+(Summary!N19/12)*2","v":84.451593491831673},{"$f":"E$28*MIN(J23,S23)+IF(S23-J23>0,E$29*(S23-J23))+ROUND($P$14*365/12,2)+(Summary!N19/12)*2","v":69.565236515392442},{"$f":"F$28*MIN(I23,R23)+IF(R23-I23>0,F$29*(R23-I23))+ROUND($P$14*365/12,2)+(Summary!N19/12)*2","v":84.451593491831673},{"$f":"F$28*MIN(J23,S23)+IF(S23-J23>0,F$29*(S23-J23))+ROUND($P$14*365/12,2)+(Summary!N19/12)*2","v":69.565236515392442},null,"6 cool",{"$f":"C$22*K23+ROUND($C$25*365/12,2)+(Summary!N19/12)*2","v":79.748927598666668},{"$f":"C$22*L23+ROUND($C$25*365/12,2)+(Summary!N19/12)*2","v":119.26097560266668},{"$f":"D$22*K23+ROUND($F$14*365/12,2)+(Summary!N19/12)*2","v":99.238259324666657},{"$f":"D$22*L23+ROUND($F$14*365/12,2)+(Summary!N19/12)*2","v":137.08242155066665},{"$f":"E$22*K23+ROUND($F$14*365/12,2)+(Summary!N19/12)*2","v":98.26435516980068},{"$f":"E$22*L23+ROUND($F$14*365/12,2)+(Summary!N19/12)*2","v":135.67193967120556},{"$f":"F$22*K23+ROUND($F$14*365/12,2)+(Summary!N19/12)*2","v":98.26435516980068},{"$f":"F$22*L23+ROUND($F$14*365/12,2)+(Summary!N19/12)*2","v":135.67193967120556},null,"6 cool",{"$f":"C$28*K23+ROUND($C$31*365/12,2)+(Summary!N19/12)*2","v":46.555679628666674},{"$f":"C$28*L23+ROUND($C$31*365/12,2)+(Summary!N19/12)*2","v":71.322478542666687},{"$f":"D$28*K23+ROUND($P$14*365/12,2)+(Summary!N19/12)*2","v":52.294682641666668},{"$f":"D$28*L23+ROUND($P$14*365/12,2)+(Summary!N19/12)*2","v":77.235862216666675},{"$f":"E$28*K23+ROUND($P$14*365/12,2)+(Summary!N19/12)*2","v":51.652831508318997},{"$f":"E$28*L23+ROUND($P$14*365/12,2)+(Summary!N19/12)*2","v":76.306284713197627},{"$f":"F$28*K23+ROUND($P$14*365/12,2)+(Summary!N19/12)*2","v":51.652831508318997},{"$f":"F$28*L23+ROUND($P$14*365/12,2)+(Summary!N19/12)*2","v":76.306284713197627}]
[null,"8 cool",{"$f":"C$28*MIN(I24,R24)+IF(R24-I24>0,C$29*(R24-I24))+ROUND($C$31*365/12,2)+(Summary!N19/12)*2","v":103.6442695309554},{"$f":"C$28*MIN(J24,S24)+IF(S24-J24>0,C$29*(S24-J24))+ROUND($C$31*365/12,2)+(Summary!N19/12)*2","v":72.968403174305436},{"$f":"D$28*MIN(I24,R24)+IF(R24-I24>0,D$29*(R24-I24))+ROUND($P$14*365/12,2)+(Summary!N19/12)*2","v":110.45268222793683},{"$f":"D$28*MIN(J24,S24)+IF(S24-J24>0,D$29*(S24-J24))+ROUND($P$14*365/12,2)+(Summary!N19/12)*2","v":79.242711091880849},{"$f":"E$28*MIN(I24,R24)+IF(R24-I24>0,E$29*(R24-I24))+ROUND($P$14*365/12,2)+(Summary!N19/12)*2","v":109.13990893294246},{"$f":"E$28*MIN(J24,S24)+IF(S24-J24>0,E$29*(S24-J24))+ROUND($P$14*365/12,2)+(Summary!N19/12)*2","v":78.28998218370333},{"$f":"F$28*MIN(I24,R24)+IF(R24-I24>0,F$29*(R24-I24))+ROUND($P$14*365/12,2)+(Summary!N19/12)*2","v":109.13990893294246},{"$f":"F$28*MIN(J24,S24)+IF(S24-J24>0,F$29*(S24-J24))+ROUND($P$14*365/12,2)+(Summary!N19/12)*2","v":78.28998218370333},null,"8 cool",{"$f":"C$22*K24+ROUND($C$25*365/12,2)+(Summary!N19/12)*2","v":91.906480830666666},{"$f":"C$22*L24+ROUND($C$25*365/12,2)+(Summary!N19/12)*2","v":116.22158729466668},{"$f":"D$22*K24+ROUND($F$14*365/12,2)+(Summary!N19/12)*2","v":110.88261693266666},{"$f":"D$22*L24+ROUND($F$14*365/12,2)+(Summary!N19/12)*2","v":134.17133214866666},{"$f":"E$22*K24+ROUND($F$14*365/12,2)+(Summary!N19/12)*2","v":109.77438117023296},{"$f":"E$22*L24+ROUND($F$14*365/12,2)+(Summary!N19/12)*2","v":132.7944331710975},{"$f":"F$22*K24+ROUND($F$14*365/12,2)+(Summary!N19/12)*2","v":109.77438117023296},{"$f":"F$22*L24+ROUND($F$14*365/12,2)+(Summary!N19/12)*2","v":132.7944331710975},null,"8 cool",{"$f":"C$28*K24+ROUND($C$31*365/12,2)+(Summary!N19/12)*2","v":54.176233140666675},{"$f":"C$28*L24+ROUND($C$31*365/12,2)+(Summary!N19/12)*2","v":69.417340164666697},{"$f":"D$28*K24+ROUND($P$14*365/12,2)+(Summary!N19/12)*2","v":59.96889174166666},{"$f":"D$28*L24+ROUND($P$14*365/12,2)+(Summary!N19/12)*2","v":75.317309941666679},{"$f":"E$28*K24+ROUND($P$14*365/12,2)+(Summary!N19/12)*2","v":59.238509417512411},{"$f":"E$28*L24+ROUND($P$14*365/12,2)+(Summary!N19/12)*2","v":74.409865235899275},{"$f":"F$28*K24+ROUND($P$14*365/12,2)+(Summary!N19/12)*2","v":59.238509417512411},{"$f":"F$28*L24+ROUND($P$14*365/12,2)+(Summary!N19/12)*2","v":74.409865235899275}]
[null,"9 warm",{"$f":"C$28*MIN(I25,R25)+IF(R25-I25>0,C$29*(R25-I25))+ROUND($C$31*365/12,2)+(Summary!N19/12)*2","v":145.43341208684404},{"$f":"C$28*MIN(J25,S25)+IF(S25-J25>0,C$29*(S25-J25))+ROUND($C$31*365/12,2)+(Summary!N19/12)*2","v":83.684302793455004},{"$f":"D$28*MIN(I25,R25)+IF(R25-I25>0,D$29*(R25-I25))+ROUND($P$14*365/12,2)+(Summary!N19/12)*2","v":152.87465182804561},{"$f":"D$28*MIN(J25,S25)+IF(S25-J25>0,D$29*(S25-J25))+ROUND($P$14*365/12,2)+(Summary!N19/12)*2","v":90.032343221764023},{"$f":"E$28*MIN(I25,R25)+IF(R25-I25>0,E$29*(R25-I25))+ROUND($P$14*365/12,2)+(Summary!N19/12)*2","v":151.07249031908427},{"$f":"E$28*MIN(J25,S25)+IF(S25-J25>0,E$29*(S25-J25))+ROUND($P$14*365/12,2)+(Summary!N19/12)*2","v":88.955142987828197},{"$f":"F$28*MIN(I25,R25)+IF(R25-I25>0,F$29*(R25-I25))+ROUND($P$14*365/12,2)+(Summary!N19/12)*2","v":151.07249031908427},{"$f":"F$28*MIN(J25,S25)+IF(S25-J25>0,F$29*(S25-J25))+ROUND($P$14*365/12,2)+(Summary!N19/12)*2","v":88.955142987828197},null,"9 warm",{"$f":"C$22*K25+ROUND($C$25*365/12,2)+(Summary!N19/12)*2","v":118.24784616666668},{"$f":"C$22*L25+ROUND($C$25*365/12,2)+(Summary!N19/12)*2","v":132.43165827066667},{"$f":"D$22*K25+ROUND($F$14*365/12,2)+(Summary!N19/12)*2","v":136.11205841666666},{"$f":"D$22*L25+ROUND($F$14*365/12,2)+(Summary!N19/12)*2","v":149.69714229266665},{"$f":"E$22*K25+ROUND($F$14*365/12,2)+(Summary!N19/12)*2","v":134.71277083783619},{"$f":"E$22*L25+ROUND($F$14*365/12,2)+(Summary!N19/12)*2","v":148.14113450500719},{"$f":"F$22*K25+ROUND($F$14*365/12,2)+(Summary!N19/12)*2","v":134.71277083783619},{"$f":"F$22*L25+ROUND($F$14*365/12,2)+(Summary!N19/12)*2","v":148.14113450500719},null,"9 warm",{"$f":"C$28*K25+ROUND($C$31*365/12,2)+(Summary!N19/12)*2","v":70.687432416666681},{"$f":"C$28*L25+ROUND($C$31*365/12,2)+(Summary!N19/12)*2","v":79.578078180666694},{"$f":"D$28*K25+ROUND($P$14*365/12,2)+(Summary!N19/12)*2","v":76.596344791666667},{"$f":"D$28*L25+ROUND($P$14*365/12,2)+(Summary!N19/12)*2","v":85.549588741666668},{"$f":"E$28*K25+ROUND($P$14*365/12,2)+(Summary!N19/12)*2","v":75.67414488743151},{"$f":"E$28*L25+ROUND($P$14*365/12,2)+(Summary!N19/12)*2","v":84.524102448157166},{"$f":"F$28*K25+ROUND($P$14*365/12,2)+(Summary!N19/12)*2","v":75.67414488743151},{"$f":"F$28*L25+ROUND($P$14*365/12,2)+(Summary!N19/12)*2","v":84.524102448157166}]
[null,"10 hot (Sec 745)",{"$f":"C$28*MIN(I26,R26)+IF(R26-I26>0,C$29*(R26-I26))+ROUND($C$31*365/12,2)+(Summary!N19/12)*2","v":204.32861376895355},{"$f":"C$28*MIN(J26,S26)+IF(S26-J26>0,C$29*(S26-J26))+ROUND($C$31*365/12,2)+(Summary!N19/12)*2","v":104.07563692877537},{"$f":"D$28*MIN(I26,R26)+IF(R26-I26>0,D$29*(R26-I26))+ROUND($P$14*365/12,2)+(Summary!N19/12)*2","v":213.12287111271533},{"$f":"D$28*MIN(J26,S26)+IF(S26-J26>0,D$29*(S26-J26))+ROUND($P$14*365/12,2)+(Summary!N19/12)*2","v":110.99191100486127},{"$f":"E$28*MIN(I26,R26)+IF(R26-I26>0,E$29*(R26-I26))+ROUND($P$14*365/12,2)+(Summary!N19/12)*2","v":210.62567425512796},{"$f":"E$28*MIN(J26,S26)+IF(S26-J26>0,E$29*(S26-J26))+ROUND($P$14*365/12,2)+(Summary!N19/12)*2","v":109.67291706027078},{"$f":"F$28*MIN(I26,R26)+IF(R26-I26>0,F$29*(R26-I26))+ROUND($P$14*365/12,2)+(Summary!N19/12)*2","v":210.62567425512796},{"$f":"F$28*MIN(J26,S26)+IF(S26-J26>0,F$29*(S26-J26))+ROUND($P$14*365/12,2)+(Summary!N19/12)*2","v":109.67291706027078},null,"10 hot (Sec 745)",{"$f":"C$22*K26+ROUND($C$25*365/12,2)+(Summary!N19/12)*2","v":152.69424699066667},{"$f":"C$22*L26+ROUND($C$25*365/12,2)+(Summary!N19/12)*2","v":157.75989417066666},{"$f":"D$22*K26+ROUND($F$14*365/12,2)+(Summary!N19/12)*2","v":169.10440497266666},{"$f":"D$22*L26+ROUND($F$14*365/12,2)+(Summary!N19/12)*2","v":173.95622064266664},{"$f":"E$22*K26+ROUND($F$14*365/12,2)+(Summary!N19/12)*2","v":167.32451117239432},{"$f":"E$22*L26+ROUND($F$14*365/12,2)+(Summary!N19/12)*2","v":172.12035533924109},{"$f":"F$22*K26+ROUND($F$14*365/12,2)+(Summary!N19/12)*2","v":167.32451117239432},{"$f":"F$22*L26+ROUND($F$14*365/12,2)+(Summary!N19/12)*2","v":172.12035533924109},null,"10 hot (Sec 745)",{"$f":"C$28*K26+ROUND($C$31*365/12,2)+(Summary!N19/12)*2","v":92.279000700666685},{"$f":"C$28*L26+ROUND($C$31*365/12,2)+(Summary!N19/12)*2","v":95.454231330666687},{"$f":"D$28*K26+ROUND($P$14*365/12,2)+(Summary!N19/12)*2","v":98.339937241666675},{"$f":"D$28*L26+ROUND($P$14*365/12,2)+(Summary!N19/12)*2","v":101.53752436666666},{"$f":"E$28*K26+ROUND($P$14*365/12,2)+(Summary!N19/12)*2","v":97.166898963479539},{"$f":"E$28*L26+ROUND($P$14*365/12,2)+(Summary!N19/12)*2","v":100.32759809231013},{"$f":"F$28*K26+ROUND($P$14*365/12,2)+(Summary!N19/12)*2","v":97.166898963479539},{"$f":"F$28*L26+ROUND($P$14*365/12,2)+(Summary!N19/12)*2","v":100.32759809231013}]
[null,"13 hot",{"$f":"C$28*MIN(I27,R27)+IF(R27-I27>0,C$29*(R27-I27))+ROUND($C$31*365/12,2)+(Summary!N19/12)*2","v":228.45514408150163},{"$f":"C$28*MIN(J27,S27)+IF(S27-J27>0,C$29*(S27-J27))+ROUND($C$31*365/12,2)+(Summary!N19/12)*2","v":100.13653809345971},{"$f":"D$28*MIN(I27,R27)+IF(R27-I27>0,D$29*(R27-I27))+ROUND($P$14*365/12,2)+(Summary!N19/12)*2","v":237.54201426205736},{"$f":"D$28*MIN(J27,S27)+IF(S27-J27>0,D$29*(S27-J27))+ROUND($P$14*365/12,2)+(Summary!N19/12)*2","v":106.92675638239358},{"$f":"E$28*MIN(I27,R27)+IF(R27-I27>0,E$29*(R27-I27))+ROUND($P$14*365/12,2)+(Summary!N19/12)*2","v":234.76311334958731},{"$f":"E$28*MIN(J27,S27)+IF(S27-J27>0,E$29*(S27-J27))+ROUND($P$14*365/12,2)+(Summary!N19/12)*2","v":105.65465886385172},{"$f":"F$28*MIN(I27,R27)+IF(R27-I27>0,F$29*(R27-I27))+ROUND($P$14*365/12,2)+(Summary!N19/12)*2","v":234.76311334958731},{"$f":"F$28*MIN(J27,S27)+IF(S27-J27>0,F$29*(S27-J27))+ROUND($P$14*365/12,2)+(Summary!N19/12)*2","v":105.65465886385172},null,"13 hot",{"$f":"C$22*K27+ROUND($C$25*365/12,2)+(Summary!N19/12)*2","v":236.78399017866664},{"$f":"C$22*L27+ROUND($C$25*365/12,2)+(Summary!N19/12)*2","v":224.62643694666664},{"$f":"D$22*K27+ROUND($F$14*365/12,2)+(Summary!N19/12)*2","v":249.64454509466665},{"$f":"D$22*L27+ROUND($F$14*365/12,2)+(Summary!N19/12)*2","v":238.00018748666665},{"$f":"E$22*K27+ROUND($F$14*365/12,2)+(Summary!N19/12)*2","v":246.93552434205085},{"$f":"E$22*L27+ROUND($F$14*365/12,2)+(Summary!N19/12)*2","v":235.42549834161861},{"$f":"F$22*K27+ROUND($F$14*365/12,2)+(Summary!N19/12)*2","v":246.93552434205085},{"$f":"F$22*L27+ROUND($F$14*365/12,2)+(Summary!N19/12)*2","v":235.42549834161861},null,"13 hot",{"$f":"C$28*K27+ROUND($C$31*365/12,2)+(Summary!N19/12)*2","v":144.98782915866667},{"$f":"C$28*L27+ROUND($C$31*365/12,2)+(Summary!N19/12)*2","v":137.36727564666666},{"$f":"D$28*K27+ROUND($P$14*365/12,2)+(Summary!N19/12)*2","v":151.41988351666666},{"$f":"D$28*L27+ROUND($P$14*365/12,2)+(Summary!N19/12)*2","v":143.74567441666667},{"$f":"E$28*K27+ROUND($P$14*365/12,2)+(Summary!N19/12)*2","v":149.63450450206739},{"$f":"E$28*L27+ROUND($P$14*365/12,2)+(Summary!N19/12)*2","v":142.04882659287398},{"$f":"F$28*K27+ROUND($P$14*365/12,2)+(Summary!N19/12)*2","v":149.63450450206739},{"$f":"F$28*L27+ROUND($P$14*365/12,2)+(Summary!N19/12)*2","v":142.04882659287398}]
[null,"14 hot",{"$f":"C$28*MIN(I28,R28)+IF(R28-I28>0,C$29*(R28-I28))+ROUND($C$31*365/12,2)+(Summary!N19/12)*2","v":208.54835238598284},{"$f":"C$28*MIN(J28,S28)+IF(S28-J28>0,C$29*(S28-J28))+ROUND($C$31*365/12,2)+(Summary!N19/12)*2","v":112.08816524548445},{"$f":"D$28*MIN(I28,R28)+IF(R28-I28>0,D$29*(R28-I28))+ROUND($P$14*365/12,2)+(Summary!N19/12)*2","v":217.47667380987278},{"$f":"D$28*MIN(J28,S28)+IF(S28-J28>0,D$29*(S28-J28))+ROUND($P$14*365/12,2)+(Summary!N19/12)*2","v":119.26038413420902},{"$f":"E$28*MIN(I28,R28)+IF(R28-I28>0,E$29*(R28-I28))+ROUND($P$14*365/12,2)+(Summary!N19/12)*2","v":214.9292506250778},{"$f":"E$28*MIN(J28,S28)+IF(S28-J28>0,E$29*(S28-J28))+ROUND($P$14*365/12,2)+(Summary!N19/12)*2","v":117.8460034516818},{"$f":"F$28*MIN(I28,R28)+IF(R28-I28>0,F$29*(R28-I28))+ROUND($P$14*365/12,2)+(Summary!N19/12)*2","v":214.9292506250778},{"$f":"F$28*MIN(J28,S28)+IF(S28-J28>0,F$29*(S28-J28))+ROUND($P$14*365/12,2)+(Summary!N19/12)*2","v":117.8460034516818},null,"14 hot",{"$f":"C$22*K28+ROUND($C$25*365/12,2)+(Summary!N19/12)*2","v":179.03561232666667},{"$f":"C$22*L28+ROUND($C$25*365/12,2)+(Summary!N19/12)*2","v":205.37697766266666},{"$f":"D$22*K28+ROUND($F$14*365/12,2)+(Summary!N19/12)*2","v":194.33384645666666},{"$f":"D$22*L28+ROUND($F$14*365/12,2)+(Summary!N19/12)*2","v":219.56328794066667},{"$f":"E$22*K28+ROUND($F$14*365/12,2)+(Summary!N19/12)*2","v":192.26290083999757},{"$f":"E$22*L28+ROUND($F$14*365/12,2)+(Summary!N19/12)*2","v":217.20129050760085},{"$f":"F$22*K28+ROUND($F$14*365/12,2)+(Summary!N19/12)*2","v":192.26290083999757},{"$f":"F$22*L28+ROUND($F$14*365/12,2)+(Summary!N19/12)*2","v":217.20129050760085},null,"14 hot",{"$f":"C$28*K28+ROUND($C$31*365/12,2)+(Summary!N19/12)*2","v":108.7901999766667},{"$f":"C$28*L28+ROUND($C$31*365/12,2)+(Summary!N19/12)*2","v":125.30139925266668},{"$f":"D$28*K28+ROUND($P$14*365/12,2)+(Summary!N19/12)*2","v":114.96739029166667},{"$f":"D$28*L28+ROUND($P$14*365/12,2)+(Summary!N19/12)*2","v":131.59484334166666},{"$f":"E$28*K28+ROUND($P$14*365/12,2)+(Summary!N19/12)*2","v":113.60253443339863},{"$f":"E$28*L28+ROUND($P$14*365/12,2)+(Summary!N19/12)*2","v":130.03816990331771},{"$f":"F$28*K28+ROUND($P$14*365/12,2)+(Summary!N19/12)*2","v":113.60253443339863},{"$f":"F$28*L28+ROUND($P$14*365/12,2)+(Summary!N19/12)*2","v":130.03816990331771}]
[null,"15 hot",{"$f":"C$28*MIN(I29,R29)+IF(R29-I29>0,C$29*(R29-I29))+ROUND($C$31*365/12,2)+(Summary!N19/12)*2","v":275.37109993017856},{"$f":"C$28*MIN(J29,S29)+IF(S29-J29>0,C$29*(S29-J29))+ROUND($C$31*365/12,2)+(Summary!N19/12)*2","v":118.56826980575093},{"$f":"D$28*MIN(I29,R29)+IF(R29-I29>0,D$29*(R29-I29))+ROUND($P$14*365/12,2)+(Summary!N19/12)*2","v":282.72117042015537},{"$f":"D$28*MIN(J29,S29)+IF(S29-J29>0,D$29*(S29-J29))+ROUND($P$14*365/12,2)+(Summary!N19/12)*2","v":126.22571006335399},{"$f":"E$28*MIN(I29,R29)+IF(R29-I29>0,E$29*(R29-I29))+ROUND($P$14*365/12,2)+(Summary!N19/12)*2","v":279.42107384541021},{"$f":"E$28*MIN(J29,S29)+IF(S29-J29>0,E$29*(S29-J29))+ROUND($P$14*365/12,2)+(Summary!N19/12)*2","v":124.73097600618873},{"$f":"F$28*MIN(I29,R29)+IF(R29-I29>0,F$29*(R29-I29))+ROUND($P$14*365/12,2)+(Summary!N19/12)*2","v":279.42107384541021},{"$f":"F$28*MIN(J29,S29)+IF(S29-J29>0,F$29*(S29-J29))+ROUND($P$14*365/12,2)+(Summary!N19/12)*2","v":124.73097600618873},null,"15 hot",{"$f":"C$22*K29+ROUND($C$25*365/12,2)+(Summary!N19/12)*2","v":234.75773130666667},{"$f":"C$22*L29+ROUND($C$25*365/12,2)+(Summary!N19/12)*2","v":167.89118853066665},{"$f":"D$22*K29+ROUND($F$14*365/12,2)+(Summary!N19/12)*2","v":247.70381882666666},{"$f":"D$22*L29+ROUND($F$14*365/12,2)+(Summary!N19/12)*2","v":183.65985198266665},{"$f":"E$22*K29+ROUND($F$14*365/12,2)+(Summary!N19/12)*2","v":245.01718667531216},{"$f":"E$22*L29+ROUND($F$14*365/12,2)+(Summary!N19/12)*2","v":181.71204367293467},{"$f":"F$22*K29+ROUND($F$14*365/12,2)+(Summary!N19/12)*2","v":245.01718667531216},{"$f":"F$22*L29+ROUND($F$14*365/12,2)+(Summary!N19/12)*2","v":181.71204367293467},null,"15 hot",{"$f":"C$28*K29+ROUND($C$31*365/12,2)+(Summary!N19/12)*2","v":143.71773690666666},{"$f":"C$28*L29+ROUND($C$31*365/12,2)+(Summary!N19/12)*2","v":101.80469259066669},{"$f":"D$28*K29+ROUND($P$14*365/12,2)+(Summary!N19/12)*2","v":150.14084866666667},{"$f":"D$28*L29+ROUND($P$14*365/12,2)+(Summary!N19/12)*2","v":107.93269861666667},{"$f":"E$28*K29+ROUND($P$14*365/12,2)+(Summary!N19/12)*2","v":148.37022485053515},{"$f":"E$28*L29+ROUND($P$14*365/12,2)+(Summary!N19/12)*2","v":106.64899634997133},{"$f":"F$28*K29+ROUND($P$14*365/12,2)+(Summary!N19/12)*2","v":148.37022485053515},{"$f":"F$28*L29+ROUND($P$14*365/12,2)+(Summary!N19/12)*2","v":106.64899634997133}]
[null,"16 cool",{"$f":"C$28*MIN(I30,R30)+IF(R30-I30>0,C$29*(R30-I30))+ROUND($C$31*365/12,2)+(Summary!N19/12)*2","v":174.65190665496664},{"$f":"C$28*MIN(J30,S30)+IF(S30-J30>0,C$29*(S30-J30))+ROUND($C$31*365/12,2)+(Summary!N19/12)*2","v":101.83742221993342},{"$f":"D$28*MIN(I30,R30)+IF(R30-I30>0,D$29*(R30-I30))+ROUND($P$14*365/12,2)+(Summary!N19/12)*2","v":183.22722691066079},{"$f":"D$28*MIN(J30,S30)+IF(S30-J30>0,D$29*(S30-J30))+ROUND($P$14*365/12,2)+(Summary!N19/12)*2","v":108.6488761165092},{"$f":"E$28*MIN(I30,R30)+IF(R30-I30>0,E$29*(R30-I30))+ROUND($P$14*365/12,2)+(Summary!N19/12)*2","v":181.07491210497602},{"$f":"E$28*MIN(J30,S30)+IF(S30-J30>0,E$29*(S30-J30))+ROUND($P$14*365/12,2)+(Summary!N19/12)*2","v":107.3569118848265},{"$f":"F$28*MIN(I30,R30)+IF(R30-I30>0,F$29*(R30-I30))+ROUND($P$14*365/12,2)+(Summary!N19/12)*2","v":181.07491210497602},{"$f":"F$28*MIN(J30,S30)+IF(S30-J30>0,F$29*(S30-J30))+ROUND($P$14*365/12,2)+(Summary!N19/12)*2","v":107.3569118848265},null,"16 cool",{"$f":"C$22*K30+ROUND($C$25*365/12,2)+(Summary!N19/12)*2","v":128.37914052666665},{"$f":"C$22*L30+ROUND($C$25*365/12,2)+(Summary!N19/12)*2","v":226.65269581866664},{"$f":"D$22*K30+ROUND($F$14*365/12,2)+(Summary!N19/12)*2","v":145.81568975666664},{"$f":"D$22*L30+ROUND($F$14*365/12,2)+(Summary!N19/12)*2","v":239.94091375466664},{"$f":"E$22*K30+ROUND($F$14*365/12,2)+(Summary!N19/12)*2","v":144.30445917152977},{"$f":"E$22*L30+ROUND($F$14*365/12,2)+(Summary!N19/12)*2","v":237.3438360083573},{"$f":"F$22*K30+ROUND($F$14*365/12,2)+(Summary!N19/12)*2","v":144.30445917152977},{"$f":"F$22*L30+ROUND($F$14*365/12,2)+(Summary!N19/12)*2","v":237.3438360083573},null,"16 cool",{"$f":"C$28*K30+ROUND($C$31*365/12,2)+(Summary!N19/12)*2","v":77.037893676666684},{"$f":"C$28*L30+ROUND($C$31*365/12,2)+(Summary!N19/12)*2","v":138.63736789866667},{"$f":"D$28*K30+ROUND($P$14*365/12,2)+(Summary!N19/12)*2","v":82.991519041666663},{"$f":"D$28*L30+ROUND($P$14*365/12,2)+(Summary!N19/12)*2","v":145.02470926666666},{"$f":"E$28*K30+ROUND($P$14*365/12,2)+(Summary!N19/12)*2","v":81.995543145092697},{"$f":"E$28*L30+ROUND($P$14*365/12,2)+(Summary!N19/12)*2","v":143.31310624440621},{"$f":"F$28*K30+ROUND($P$14*365/12,2)+(Summary!N19/12)*2","v":81.995543145092697},{"$f":"F$28*L30+ROUND($P$14*365/12,2)+(Summary!N19/12)*2","v":143.31310624440621}]
[null,"ALL",{"$f":"SUMPRODUCT(C52:C60,$U$22:$U$30)","v":180.22264444803372},95.703626328791856,188.41568760547727,102.44169653163338,186.20351769319069,101.22133954872885,186.20351769319069,101.22133954872885,null,"ALL",{"$f":"SUMPRODUCT(M52:M60,$T$22:$T$30)","v":129.76847402319129},{"$f":"SUMPRODUCT(N52:N60,$T$22:$T$30)","v":147.25324094204134},147.14637659484751,163.89307511307604,145.61979494371289,162.17330024260394,145.61979494371289,162.17330024260394,null,"ALL",{"$f":"SUMPRODUCT(W52:W60,$U$22:$U$30)","v":90.60495946630688},{"$f":"SUMPRODUCT(X52:X60,$U$22:$U$30)","v":97.633048628749549},96.654109243179491,103.73168250883511,95.500519009508281,102.496443993098,95.500519009508281,102.496443993098]
[]
[]
[null,null,"All-Electric - Non-CARE",null,null,null,null,null,null,null,null,{"$f":"Summary!J4","v":500},{"$f":"L64&\" kWh Monthly - Non-CARE\"","v":"500 kWh Monthly - Non-CARE"},null,null,null,null,null,null,null,null,null,{"$f":"L64&\" kWh Monthly - CARE\"","v":"500 kWh Monthly - CARE"}]
[null,null,{"$f":"C35","v":"Jan 2025"},null,"2025-11-15",null,"Authorized",null,"w/Pending",null,null,null,{"$f":"M50","v":"Jan 2025"},null,{"$f":"O50","v":"2025-11-15"},null,{"$f":"Q50","v":"Authorized"},null,{"$f":"S50","v":"w/Pending"},null,null,null,{"$f":"M65","v":"Jan 2025"},null,{"$f":"O65","v":"2025-11-15"},null,{"$f":"Q65","v":"Authorized"},null,{"$f":"S65","v":"w/Pending"}]
[null,null,"Summer","Winter","Summer","Winter","Summer","Winter","Summer","Winter",null,null,"Summer","Winter","Summer","Winter","Summer","Winter","Summer","Winter",null,null,"Summer","Winter","Summer","Winter","Summer","Winter","Summer","Winter"]
[null,{"$f":"B37","v":"5 warm"},{"$f":"C$22*MIN(K22,X22)+IF(X22-K22>0,C$23*(X22-K22))+ROUND($C$25*365/12,2)+(Summary!N19/12)*2","v":123.19037560260527},{"$f":"C$22*MIN(L22,Y22)+IF(Y22-L22>0,C$23*(Y22-L22))+ROUND($C$25*365/12,2)+(Summary!N19/12)*2","v":148.93808797258953},{"$f":"D$22*MIN(K22,X22)+IF(X22-K22>0,D$23*(X22-K22))+ROUND($F$14*365/12,2)+(Summary!N19/12)*2","v":140.8459533988125},{"$f":"D$22*MIN(L22,Y22)+IF(Y22-L22>0,D$23*(Y22-L22))+ROUND($F$14*365/12,2)+(Summary!N19/12)*2","v":165.50680124399196},{"$f":"E$22*MIN(K22,X22)+IF(X22-K22>0,E$23*(X22-K22))+ROUND($F$14*365/12,2)+(Summary!N19/12)*2","v":139.39205467315745},{"$f":"E$22*MIN(L22,Y22)+IF(Y22-L22>0,E$23*(Y22-L22))+ROUND($F$14*365/12,2)+(Summary!N19/12)*2","v":163.76841011037877},{"$f":"F$22*MIN(K22,X22)+IF(X22-K22>0,F$23*(X22-K22))+ROUND($F$14*365/12,2)+(Summary!N19/12)*2","v":139.39205467315745},{"$f":"F$22*MIN(L22,Y22)+IF(Y22-L22>0,F$23*(Y22-L22))+ROUND($F$14*365/12,2)+(Summary!N19/12)*2","v":163.76841011037877},null,"5 warm",{"$f":"C$22*MIN(I22,$L$64)+IF($L$64-I22>0,C$23*($L$64-I22))+ROUND($C$25*365/12,2)+(Summary!N19/12)*2","v":158.14666666666665},{"$f":"C$22*MIN(J22,$L$64)+IF($L$64-J22>0,C$23*($L$64-J22))+ROUND($C$25*365/12,2)+(Summary!N19/12)*2","v":158.14666666666665},{"$f":"D$22*MIN(I22,$L$64)+IF($L$64-I22>0,D$23*($L$64-I22))+ROUND($F$14*365/12,2)+(Summary!N19/12)*2","v":174.32666666666665},{"$f":"D$22*MIN(J22,$L$64)+IF($L$64-J22>0,D$23*($L$64-J22))+ROUND($F$14*365/12,2)+(Summary!N19/12)*2","v":174.32666666666665},{"$f":"E$22*MIN(I22,$L$64)+IF($L$64-I22>0,E$23*($L$64-I22))+ROUND($F$14*365/12,2)+(Summary!N19/12)*2","v":172.48652782479473},{"$f":"E$22*MIN(J22,$L$64)+IF($L$64-J22>0,E$23*($L$64-J22))+ROUND($F$14*365/12,2)+(Summary!N19/12)*2","v":172.48652782479473},{"$f":"F$22*MIN(I22,$L$64)+IF($L$64-I22>0,F$23*($L$64-I22))+ROUND($F$14*365/12,2)+(Summary!N19/12)*2","v":172.48652782479473},{"$f":"F$22*MIN(J22,$L$64)+IF($L$64-J22>0,F$23*($L$64-J22))+ROUND($F$14*365/12,2)+(Summary!N19/12)*2","v":172.48652782479473},null,"5 warm",{"$f":"C$28*MIN(I22,$L$64)+IF($L$64-I22>0,C$29*($L$64-I22))+ROUND($C$31*365/12,2)+(Summary!N19/12)*2","v":95.696666666666687},{"$f":"C$28*MIN(J22,$L$64)+IF($L$64-J22>0,C$29*($L$64-J22))+ROUND($C$31*365/12,2)+(Summary!N19/12)*2","v":95.696666666666687},{"$f":"D$28*MIN(I22,$L$64)+IF($L$64-I22>0,D$29*($L$64-I22))+ROUND($P$14*365/12,2)+(Summary!N19/12)*2","v":101.78166666666667},{"$f":"D$28*MIN(J22,$L$64)+IF($L$64-J22>0,D$29*($L$64-J22))+ROUND($P$14*365/12,2)+(Summary!N19/12)*2","v":101.78166666666667},{"$f":"E$28*MIN(I22,$L$64)+IF($L$64-I22>0,E$29*($L$64-I22))+ROUND($P$14*365/12,2)+(Summary!N19/12)*2","v":100.5689239185519},{"$f":"E$28*MIN(J22,$L$64)+IF($L$64-J22>0,E$29*($L$64-J22))+ROUND($P$14*365/12,2)+(Summary!N19/12)*2","v":100.5689239185519},{"$f":"F$28*MIN(I22,$L$64)+IF($L$64-I22>0,F$29*($L$64-I22))+ROUND($P$14*365/12,2)+(Summary!N19/12)*2","v":100.5689239185519},{"$f":"F$28*MIN(J22,$L$64)+IF($L$64-J22>0,F$29*($L$64-J22))+ROUND($P$14*365/12,2)+(Summary!N19/12)*2","v":100.5689239185519}]
[null,"6 cool",{"$f":"C$22*MIN(K23,X23)+IF(X23-K23>0,C$23*(X23-K23))+ROUND($C$25*365/12,2)+(Summary!N19/12)*2","v":109.31193504366259},{"$f":"C$22*MIN(L23,Y23)+IF(Y23-L23>0,C$23*(Y23-L23))+ROUND($C$25*365/12,2)+(Summary!N19/12)*2","v":101.61644595538471},{"$f":"D$22*MIN(K23,X23)+IF(X23-K23>0,D$23*(X23-K23))+ROUND($F$14*365/12,2)+(Summary!N19/12)*2","v":128.47678547545766},{"$f":"D$22*MIN(L23,Y23)+IF(Y23-L23>0,D$23*(Y23-L23))+ROUND($F$14*365/12,2)+(Summary!N19/12)*2","v":120.18270422126865},{"$f":"E$22*MIN(K23,X23)+IF(X23-K23>0,E$23*(X23-K23))+ROUND($F$14*365/12,2)+(Summary!N19/12)*2","v":127.1655799122213},{"$f":"E$22*MIN(L23,Y23)+IF(Y23-L23>0,E$23*(Y23-L23))+ROUND($F$14*365/12,2)+(Summary!N19/12)*2","v":118.96718081635133},{"$f":"F$22*MIN(K23,X23)+IF(X23-K23>0,F$23*(X23-K23))+ROUND($F$14*365/12,2)+(Summary!N19/12)*2","v":127.1655799122213},{"$f":"F$22*MIN(L23,Y23)+IF(Y23-L23>0,F$23*(Y23-L23))+ROUND($F$14*365/12,2)+(Summary!N19/12)*2","v":118.96718081635133},null,"6 cool",{"$f":"C$22*MIN(I23,$L$64)+IF($L$64-I23>0,C$23*($L$64-I23))+ROUND($C$25*365/12,2)+(Summary!N19/12)*2","v":172.72497767266665},{"$f":"C$22*MIN(J23,$L$64)+IF($L$64-J23>0,C$23*($L$64-J23))+ROUND($C$25*365/12,2)+(Summary!N19/12)*2","v":173.88240535666668},{"$f":"D$22*MIN(I23,$L$64)+IF($L$64-I23>0,D$23*($L$64-I23))+ROUND($F$14*365/12,2)+(Summary!N19/12)*2","v":190.33936210466666},{"$f":"D$22*MIN(J23,$L$64)+IF($L$64-J23>0,D$23*($L$64-J23))+ROUND($F$14*365/12,2)+(Summary!N19/12)*2","v":191.61067103666664},{"$f":"E$22*MIN(I23,$L$64)+IF($L$64-I23>0,E$23*($L$64-I23))+ROUND($F$14*365/12,2)+(Summary!N19/12)*2","v":188.31449764785816},{"$f":"E$22*MIN(J23,$L$64)+IF($L$64-J23>0,E$23*($L$64-J23))+ROUND($F$14*365/12,2)+(Summary!N19/12)*2","v":189.57114050910531},{"$f":"F$22*MIN(I23,$L$64)+IF($L$64-I23>0,F$23*($L$64-I23))+ROUND($F$14*365/12,2)+(Summary!N19/12)*2","v":188.31449764785816},{"$f":"F$22*MIN(J23,$L$64)+IF($L$64-J23>0,F$23*($L$64-J23))+ROUND($F$14*365/12,2)+(Summary!N19/12)*2","v":189.57114050910531},null,"6 cool",{"$f":"C$28*MIN(I23,$L$64)+IF($L$64-I23>0,C$29*($L$64-I23))+ROUND($C$31*365/12,2)+(Summary!N19/12)*2","v":105.53660516866668},{"$f":"C$28*MIN(J23,$L$64)+IF($L$64-J23>0,C$29*($L$64-J23))+ROUND($C$31*365/12,2)+(Summary!N19/12)*2","v":106.31783539666668},{"$f":"D$28*MIN(I23,$L$64)+IF($L$64-I23>0,D$29*($L$64-I23))+ROUND($P$14*365/12,2)+(Summary!N19/12)*2","v":112.59012115266665},{"$f":"D$28*MIN(J23,$L$64)+IF($L$64-J23>0,D$29*($L$64-J23))+ROUND($P$14*365/12,2)+(Summary!N19/12)*2","v":113.44824555666666},{"$f":"E$28*MIN(I23,$L$64)+IF($L$64-I23>0,E$29*($L$64-I23))+ROUND($P$14*365/12,2)+(Summary!N19/12)*2","v":111.25268994037856},{"$f":"E$28*MIN(J23,$L$64)+IF($L$64-J23>0,E$29*($L$64-J23))+ROUND($P$14*365/12,2)+(Summary!N19/12)*2","v":112.10091485188931},{"$f":"F$28*MIN(I23,$L$64)+IF($L$64-I23>0,F$29*($L$64-I23))+ROUND($P$14*365/12,2)+(Summary!N19/12)*2","v":111.25268994037856},{"$f":"F$28*MIN(J23,$L$64)+IF($L$64-J23>0,F$29*($L$64-J23))+ROUND($P$14*365/12,2)+(Summary!N19/12)*2","v":112.10091485188931}]
[null,"8 cool",{"$f":"C$22*MIN(K24,X24)+IF(X24-K24>0,C$23*(X24-K24))+ROUND($C$25*365/12,2)+(Summary!N19/12)*2","v":132.35368619369473},{"$f":"C$22*MIN(L24,Y24)+IF(Y24-L24>0,C$23*(Y24-L24))+ROUND($C$25*365/12,2)+(Summary!N19/12)*2","v":107.21415509613786},{"$f":"D$22*MIN(K24,X24)+IF(X24-K24>0,D$23*(X24-K24))+ROUND($F$14*365/12,2)+(Summary!N19/12)*2","v":150.88587688291543},{"$f":"D$22*MIN(L24,Y24)+IF(Y24-L24>0,D$23*(Y24-L24))+ROUND($F$14*365/12,2)+(Summary!N19/12)*2","v":125.5441224093408},{"$f":"E$22*MIN(K24,X24)+IF(X24-K24>0,E$23*(X24-K24))+ROUND($F$14*365/12,2)+(Summary!N19/12)*2","v":149.3161556184069},{"$f":"E$22*MIN(L24,Y24)+IF(Y24-L24>0,E$23*(Y24-L24))+ROUND($F$14*365/12,2)+(Summary!N19/12)*2","v":124.26674862604351},{"$f":"F$22*MIN(K24,X24)+IF(X24-K24>0,F$23*(X24-K24))+ROUND($F$14*365/12,2)+(Summary!N19/12)*2","v":149.3161556184069},{"$f":"F$22*MIN(L24,Y24)+IF(Y24-L24>0,F$23*(Y24-L24))+ROUND($F$14*365/12,2)+(Summary!N19/12)*2","v":124.26674862604351},null,"8 cool",{"$f":"C$22*MIN(I24,$L$64)+IF($L$64-I24>0,C$23*($L$64-I24))+ROUND($C$25*365/12,2)+(Summary!N19/12)*2","v":168.67398077866665},{"$f":"C$22*MIN(J24,$L$64)+IF($L$64-J24>0,C$23*($L$64-J24))+ROUND($C$25*365/12,2)+(Summary!N19/12)*2","v":175.90790380366664},{"$f":"D$22*MIN(I24,$L$64)+IF($L$64-I24>0,D$23*($L$64-I24))+ROUND($F$14*365/12,2)+(Summary!N19/12)*2","v":185.88978084266665},{"$f":"D$22*MIN(J24,$L$64)+IF($L$64-J24>0,D$23*($L$64-J24))+ROUND($F$14*365/12,2)+(Summary!N19/12)*2","v":193.83546166766666},{"$f":"E$22*MIN(I24,$L$64)+IF($L$64-I24>0,E$23*($L$64-I24))+ROUND($F$14*365/12,2)+(Summary!N19/12)*2","v":183.91624763349324},{"$f":"E$22*MIN(J24,$L$64)+IF($L$64-J24>0,E$23*($L$64-J24))+ROUND($F$14*365/12,2)+(Summary!N19/12)*2","v":191.77026551628776},{"$f":"F$22*MIN(I24,$L$64)+IF($L$64-I24>0,F$23*($L$64-I24))+ROUND($F$14*365/12,2)+(Summary!N19/12)*2","v":183.91624763349324},{"$f":"F$22*MIN(J24,$L$64)+IF($L$64-J24>0,F$23*($L$64-J24))+ROUND($F$14*365/12,2)+(Summary!N19/12)*2","v":191.77026551628776},null,"8 cool",{"$f":"C$28*MIN(I24,$L$64)+IF($L$64-I24>0,C$29*($L$64-I24))+ROUND($C$31*365/12,2)+(Summary!N19/12)*2","v":102.80229937066667},{"$f":"C$28*MIN(J24,$L$64)+IF($L$64-J24>0,C$29*($L$64-J24))+ROUND($C$31*365/12,2)+(Summary!N19/12)*2","v":107.68498829566667},{"$f":"D$28*MIN(I24,$L$64)+IF($L$64-I24>0,D$29*($L$64-I24))+ROUND($P$14*365/12,2)+(Summary!N19/12)*2","v":109.58668573866666},{"$f":"D$28*MIN(J24,$L$64)+IF($L$64-J24>0,D$29*($L$64-J24))+ROUND($P$14*365/12,2)+(Summary!N19/12)*2","v":114.94996326366666},{"$f":"E$28*MIN(I24,$L$64)+IF($L$64-I24>0,E$29*($L$64-I24))+ROUND($P$14*365/12,2)+(Summary!N19/12)*2","v":108.28390275009087},{"$f":"E$28*MIN(J24,$L$64)+IF($L$64-J24>0,E$29*($L$64-J24))+ROUND($P$14*365/12,2)+(Summary!N19/12)*2","v":113.58530844703313},{"$f":"F$28*MIN(I24,$L$64)+IF($L$64-I24>0,F$29*($L$64-I24))+ROUND($P$14*365/12,2)+(Summary!N19/12)*2","v":108.28390275009087},{"$f":"F$28*MIN(J24,$L$64)+IF($L$64-J24>0,F$29*($L$64-J24))+ROUND($P$14*365/12,2)+(Summary!N19/12)*2","v":113.58530844703313}]
[null,"9 warm",{"$f":"C$22*MIN(K25,X25)+IF(X25-K25>0,C$23*(X25-K25))+ROUND($C$25*365/12,2)+(Summary!N19/12)*2","v":182.74270527969233},{"$f":"C$22*MIN(L25,Y25)+IF(Y25-L25>0,C$23*(Y25-L25))+ROUND($C$25*365/12,2)+(Summary!N19/12)*2","v":118.23582022428999},{"$f":"D$22*MIN(K25,X25)+IF(X25-K25>0,D$23*(X25-K25))+ROUND($F$14*365/12,2)+(Summary!N19/12)*2","v":199.89902692033894},{"$f":"D$22*MIN(L25,Y25)+IF(Y25-L25>0,D$23*(Y25-L25))+ROUND($F$14*365/12,2)+(Summary!N19/12)*2","v":136.10054011434588},{"$f":"E$22*MIN(K25,X25)+IF(X25-K25>0,E$23*(X25-K25))+ROUND($F$14*365/12,2)+(Summary!N19/12)*2","v":197.76388028346278},{"$f":"E$22*MIN(L25,Y25)+IF(Y25-L25>0,E$23*(Y25-L25))+ROUND($F$14*365/12,2)+(Summary!N19/12)*2","v":134.70138541292431},{"$f":"F$22*MIN(K25,X25)+IF(X25-K25>0,F$23*(X25-K25))+ROUND($F$14*365/12,2)+(Summary!N19/12)*2","v":197.76388028346278},{"$f":"F$22*MIN(L25,Y25)+IF(Y25-L25>0,F$23*(Y25-L25))+ROUND($F$14*365/12,2)+(Summary!N19/12)*2","v":134.70138541292431},null,"9 warm",{"$f":"C$22*MIN(I25,$L$64)+IF($L$64-I25>0,C$23*($L$64-I25))+ROUND($C$25*365/12,2)+(Summary!N19/12)*2","v":158.14666666666665},{"$f":"C$22*MIN(J25,$L$64)+IF($L$64-J25>0,C$23*($L$64-J25))+ROUND($C$25*365/12,2)+(Summary!N19/12)*2","v":170.98883614666667},{"$f":"D$22*MIN(I25,$L$64)+IF($L$64-I25>0,D$23*($L$64-I25))+ROUND($F$14*365/12,2)+(Summary!N19/12)*2","v":174.32666666666665},{"$f":"D$22*MIN(J25,$L$64)+IF($L$64-J25>0,D$23*($L$64-J25))+ROUND($F$14*365/12,2)+(Summary!N19/12)*2","v":188.43239870666667},{"$f":"E$22*MIN(I25,$L$64)+IF($L$64-I25>0,E$23*($L$64-I25))+ROUND($F$14*365/12,2)+(Summary!N19/12)*2","v":172.48652782479473},{"$f":"E$22*MIN(J25,$L$64)+IF($L$64-J25>0,E$23*($L$64-J25))+ROUND($F$14*365/12,2)+(Summary!N19/12)*2","v":186.4295333559875},{"$f":"F$22*MIN(I25,$L$64)+IF($L$64-I25>0,F$23*($L$64-I25))+ROUND($F$14*365/12,2)+(Summary!N19/12)*2","v":172.48652782479473},{"$f":"F$22*MIN(J25,$L$64)+IF($L$64-J25>0,F$23*($L$64-J25))+ROUND($F$14*365/12,2)+(Summary!N19/12)*2","v":186.4295333559875},null,"9 warm",{"$f":"C$28*MIN(I25,$L$64)+IF($L$64-I25>0,C$29*($L$64-I25))+ROUND($C$31*365/12,2)+(Summary!N19/12)*2","v":95.696666666666687},{"$f":"C$28*MIN(J25,$L$64)+IF($L$64-J25>0,C$29*($L$64-J25))+ROUND($C$31*365/12,2)+(Summary!N19/12)*2","v":104.36475982666667},{"$f":"D$28*MIN(I25,$L$64)+IF($L$64-I25>0,D$29*($L$64-I25))+ROUND($P$14*365/12,2)+(Summary!N19/12)*2","v":101.78166666666667},{"$f":"D$28*MIN(J25,$L$64)+IF($L$64-J25>0,D$29*($L$64-J25))+ROUND($P$14*365/12,2)+(Summary!N19/12)*2","v":111.30293454666668},{"$f":"E$28*MIN(I25,$L$64)+IF($L$64-I25>0,E$29*($L$64-I25))+ROUND($P$14*365/12,2)+(Summary!N19/12)*2","v":100.5689239185519},{"$f":"E$28*MIN(J25,$L$64)+IF($L$64-J25>0,E$29*($L$64-J25))+ROUND($P$14*365/12,2)+(Summary!N19/12)*2","v":109.9803525731124},{"$f":"F$28*MIN(I25,$L$64)+IF($L$64-I25>0,F$29*($L$64-I25))+ROUND($P$14*365/12,2)+(Summary!N19/12)*2","v":100.5689239185519},{"$f":"F$28*MIN(J25,$L$64)+IF($L$64-J25>0,F$29*($L$64-J25))+ROUND($P$14*365/12,2)+(Summary!N19/12)*2","v":109.9803525731124}]
[null,"10 hot (Sec 745)",{"$f":"C$22*MIN(K26,X26)+IF(X26-K26>0,C$23*(X26-K26))+ROUND($C$25*365/12,2)+(Summary!N19/12)*2","v":214.29868179984689},{"$f":"C$22*MIN(L26,Y26)+IF(Y26-L26>0,C$23*(Y26-L26))+ROUND($C$25*365/12,2)+(Summary!N19/12)*2","v":133.86568444666349},{"$f":"D$22*MIN(K26,X26)+IF(X26-K26>0,D$23*(X26-K26))+ROUND($F$14*365/12,2)+(Summary!N19/12)*2","v":230.03267424717197},{"$f":"D$22*MIN(L26,Y26)+IF(Y26-L26>0,D$23*(Y26-L26))+ROUND($F$14*365/12,2)+(Summary!N19/12)*2","v":151.07063523930563},{"$f":"E$22*MIN(K26,X26)+IF(X26-K26>0,E$23*(X26-K26))+ROUND($F$14*365/12,2)+(Summary!N19/12)*2","v":227.54989990737201},{"$f":"E$22*MIN(L26,Y26)+IF(Y26-L26>0,E$23*(Y26-L26))+ROUND($F$14*365/12,2)+(Summary!N19/12)*2","v":149.49878256593274},{"$f":"F$22*MIN(K26,X26)+IF(X26-K26>0,F$23*(X26-K26))+ROUND($F$14*365/12,2)+(Summary!N19/12)*2","v":227.54989990737201},{"$f":"F$22*MIN(L26,Y26)+IF(Y26-L26>0,F$23*(Y26-L26))+ROUND($F$14*365/12,2)+(Summary!N19/12)*2","v":149.49878256593274},null,"10 hot (Sec 745)",{"$f":"C$22*MIN(I26,$L$64)+IF($L$64-I26>0,C$23*($L$64-I26))+ROUND($C$25*365/12,2)+(Summary!N19/12)*2","v":158.14666666666665},{"$f":"C$22*MIN(J26,$L$64)+IF($L$64-J26>0,C$23*($L$64-J26))+ROUND($C$25*365/12,2)+(Summary!N19/12)*2","v":170.69947922566664},{"$f":"D$22*MIN(I26,$L$64)+IF($L$64-I26>0,D$23*($L$64-I26))+ROUND($F$14*365/12,2)+(Summary!N19/12)*2","v":174.32666666666665},{"$f":"D$22*MIN(J26,$L$64)+IF($L$64-J26>0,D$23*($L$64-J26))+ROUND($F$14*365/12,2)+(Summary!N19/12)*2","v":188.11457147366667},{"$f":"E$22*MIN(I26,$L$64)+IF($L$64-I26>0,E$23*($L$64-I26))+ROUND($F$14*365/12,2)+(Summary!N19/12)*2","v":172.48652782479473},{"$f":"E$22*MIN(J26,$L$64)+IF($L$64-J26>0,E$23*($L$64-J26))+ROUND($F$14*365/12,2)+(Summary!N19/12)*2","v":186.11537264067573},{"$f":"F$22*MIN(I26,$L$64)+IF($L$64-I26>0,F$23*($L$64-I26))+ROUND($F$14*365/12,2)+(Summary!N19/12)*2","v":172.48652782479473},{"$f":"F$22*MIN(J26,$L$64)+IF($L$64-J26>0,F$23*($L$64-J26))+ROUND($F$14*365/12,2)+(Summary!N19/12)*2","v":186.11537264067573},null,"10 hot (Sec 745)",{"$f":"C$28*MIN(I26,$L$64)+IF($L$64-I26>0,C$29*($L$64-I26))+ROUND($C$31*365/12,2)+(Summary!N19/12)*2","v":95.696666666666687},{"$f":"C$28*MIN(J26,$L$64)+IF($L$64-J26>0,C$29*($L$64-J26))+ROUND($C$31*365/12,2)+(Summary!N19/12)*2","v":104.16945226966669},{"$f":"D$28*MIN(I26,$L$64)+IF($L$64-I26>0,D$29*($L$64-I26))+ROUND($P$14*365/12,2)+(Summary!N19/12)*2","v":101.78166666666667},{"$f":"D$28*MIN(J26,$L$64)+IF($L$64-J26>0,D$29*($L$64-J26))+ROUND($P$14*365/12,2)+(Summary!N19/12)*2","v":111.08840344566667},{"$f":"E$28*MIN(I26,$L$64)+IF($L$64-I26>0,E$29*($L$64-I26))+ROUND($P$14*365/12,2)+(Summary!N19/12)*2","v":100.5689239185519},{"$f":"E$28*MIN(J26,$L$64)+IF($L$64-J26>0,E$29*($L$64-J26))+ROUND($P$14*365/12,2)+(Summary!N19/12)*2","v":109.76829634523472},{"$f":"F$28*MIN(I26,$L$64)+IF($L$64-I26>0,F$29*($L$64-I26))+ROUND($P$14*365/12,2)+(Summary!N19/12)*2","v":100.5689239185519},{"$f":"F$28*MIN(J26,$L$64)+IF($L$64-J26>0,F$29*($L$64-J26))+ROUND($P$14*365/12,2)+(Summary!N19/12)*2","v":109.76829634523472}]
[null,"13 hot",{"$f":"C$22*MIN(K27,X27)+IF(X27-K27>0,C$23*(X27-K27))+ROUND($C$25*365/12,2)+(Summary!N19/12)*2","v":335.22657897458271},{"$f":"C$22*MIN(L27,Y27)+IF(Y27-L27>0,C$23*(Y27-L27))+ROUND($C$25*365/12,2)+(Summary!N19/12)*2","v":183.03274737024662},{"$f":"D$22*MIN(K27,X27)+IF(X27-K27>0,D$23*(X27-K27))+ROUND($F$14*365/12,2)+(Summary!N19/12)*2","v":347.00663561324029},{"$f":"D$22*MIN(L27,Y27)+IF(Y27-L27>0,D$23*(Y27-L27))+ROUND($F$14*365/12,2)+(Summary!N19/12)*2","v":198.16225411129281},{"$f":"E$22*MIN(K27,X27)+IF(X27-K27>0,E$23*(X27-K27))+ROUND($F$14*365/12,2)+(Summary!N19/12)*2","v":343.17442656842292},{"$f":"E$22*MIN(L27,Y27)+IF(Y27-L27>0,E$23*(Y27-L27))+ROUND($F$14*365/12,2)+(Summary!N19/12)*2","v":196.04714322832194},{"$f":"F$22*MIN(K27,X27)+IF(X27-K27>0,F$23*(X27-K27))+ROUND($F$14*365/12,2)+(Summary!N19/12)*2","v":343.17442656842292},{"$f":"F$22*MIN(L27,Y27)+IF(Y27-L27>0,F$23*(Y27-L27))+ROUND($F$14*365/12,2)+(Summary!N19/12)*2","v":196.04714322832194},null,"13 hot",{"$f":"C$22*MIN(I27,$L$64)+IF($L$64-I27>0,C$23*($L$64-I27))+ROUND($C$25*365/12,2)+(Summary!N19/12)*2","v":158.14666666666665},{"$f":"C$22*MIN(J27,$L$64)+IF($L$64-J27>0,C$23*($L$64-J27))+ROUND($C$25*365/12,2)+(Summary!N19/12)*2","v":170.41012230466666},{"$f":"D$22*MIN(I27,$L$64)+IF($L$64-I27>0,D$23*($L$64-I27))+ROUND($F$14*365/12,2)+(Summary!N19/12)*2","v":174.32666666666665},{"$f":"D$22*MIN(J27,$L$64)+IF($L$64-J27>0,D$23*($L$64-J27))+ROUND($F$14*365/12,2)+(Summary!N19/12)*2","v":187.79674424066667},{"$f":"E$22*MIN(I27,$L$64)+IF($L$64-I27>0,E$23*($L$64-I27))+ROUND($F$14*365/12,2)+(Summary!N19/12)*2","v":172.48652782479473},{"$f":"E$22*MIN(J27,$L$64)+IF($L$64-J27>0,E$23*($L$64-J27))+ROUND($F$14*365/12,2)+(Summary!N19/12)*2","v":185.80121192536393},{"$f":"F$22*MIN(I27,$L$64)+IF($L$64-I27>0,F$23*($L$64-I27))+ROUND($F$14*365/12,2)+(Summary!N19/12)*2","v":172.48652782479473},{"$f":"F$22*MIN(J27,$L$64)+IF($L$64-J27>0,F$23*($L$64-J27))+ROUND($F$14*365/12,2)+(Summary!N19/12)*2","v":185.80121192536393},null,"13 hot",{"$f":"C$28*MIN(I27,$L$64)+IF($L$64-I27>0,C$29*($L$64-I27))+ROUND($C$31*365/12,2)+(Summary!N19/12)*2","v":95.696666666666687},{"$f":"C$28*MIN(J27,$L$64)+IF($L$64-J27>0,C$29*($L$64-J27))+ROUND($C$31*365/12,2)+(Summary!N19/12)*2","v":103.97414471266669},{"$f":"D$28*MIN(I27,$L$64)+IF($L$64-I27>0,D$29*($L$64-I27))+ROUND($P$14*365/12,2)+(Summary!N19/12)*2","v":101.78166666666667},{"$f":"D$28*MIN(J27,$L$64)+IF($L$64-J27>0,D$29*($L$64-J27))+ROUND($P$14*365/12,2)+(Summary!N19/12)*2","v":110.87387234466667},{"$f":"E$28*MIN(I27,$L$64)+IF($L$64-I27>0,E$29*($L$64-I27))+ROUND($P$14*365/12,2)+(Summary!N19/12)*2","v":100.5689239185519},{"$f":"E$28*MIN(J27,$L$64)+IF($L$64-J27>0,E$29*($L$64-J27))+ROUND($P$14*365/12,2)+(Summary!N19/12)*2","v":109.55624011735702},{"$f":"F$28*MIN(I27,$L$64)+IF($L$64-I27>0,F$29*($L$64-I27))+ROUND($P$14*365/12,2)+(Summary!N19/12)*2","v":100.5689239185519},{"$f":"F$28*MIN(J27,$L$64)+IF($L$64-J27>0,F$29*($L$64-J27))+ROUND($P$14*365/12,2)+(Summary!N19/12)*2","v":109.55624011735702}]
[null,"14 hot",{"$f":"C$22*MIN(K28,X28)+IF(X28-K28>0,C$23*(X28-K28))+ROUND($C$25*365/12,2)+(Summary!N19/12)*2","v":261.81143781129128},{"$f":"C$22*MIN(L28,Y28)+IF(Y28-L28>0,C$23*(Y28-L28))+ROUND($C$25*365/12,2)+(Summary!N19/12)*2","v":177.03245012311169},{"$f":"D$22*MIN(K28,X28)+IF(X28-K28>0,D$23*(X28-K28))+ROUND($F$14*365/12,2)+(Summary!N19/12)*2","v":276.20113085215809},{"$f":"D$22*MIN(L28,Y28)+IF(Y28-L28>0,D$23*(Y28-L28))+ROUND($F$14*365/12,2)+(Summary!N19/12)*2","v":192.41524189866826},{"$f":"E$22*MIN(K28,X28)+IF(X28-K28>0,E$23*(X28-K28))+ROUND($F$14*365/12,2)+(Summary!N19/12)*2","v":273.18574808487318},{"$f":"E$22*MIN(L28,Y28)+IF(Y28-L28>0,E$23*(Y28-L28))+ROUND($F$14*365/12,2)+(Summary!N19/12)*2","v":190.36642968284781},{"$f":"F$22*MIN(K28,X28)+IF(X28-K28>0,F$23*(X28-K28))+ROUND($F$14*365/12,2)+(Summary!N19/12)*2","v":273.18574808487318},{"$f":"F$22*MIN(L28,Y28)+IF(Y28-L28>0,F$23*(Y28-L28))+ROUND($F$14*365/12,2)+(Summary!N19/12)*2","v":190.36642968284781},null,"14 hot",{"$f":"C$22*MIN(I28,$L$64)+IF($L$64-I28>0,C$23*($L$64-I28))+ROUND($C$25*365/12,2)+(Summary!N19/12)*2","v":158.14666666666665},{"$f":"C$22*MIN(J28,$L$64)+IF($L$64-J28>0,C$23*($L$64-J28))+ROUND($C$25*365/12,2)+(Summary!N19/12)*2","v":171.27819306766665},{"$f":"D$22*MIN(I28,$L$64)+IF($L$64-I28>0,D$23*($L$64-I28))+ROUND($F$14*365/12,2)+(Summary!N19/12)*2","v":174.32666666666665},{"$f":"D$22*MIN(J28,$L$64)+IF($L$64-J28>0,D$23*($L$64-J28))+ROUND($F$14*365/12,2)+(Summary!N19/12)*2","v":188.75022593966668},{"$f":"E$22*MIN(I28,$L$64)+IF($L$64-I28>0,E$23*($L$64-I28))+ROUND($F$14*365/12,2)+(Summary!N19/12)*2","v":172.48652782479473},{"$f":"E$22*MIN(J28,$L$64)+IF($L$64-J28>0,E$23*($L$64-J28))+ROUND($F$14*365/12,2)+(Summary!N19/12)*2","v":186.74369407129927},{"$f":"F$22*MIN(I28,$L$64)+IF($L$64-I28>0,F$23*($L$64-I28))+ROUND($F$14*365/12,2)+(Summary!N19/12)*2","v":172.48652782479473},{"$f":"F$22*MIN(J28,$L$64)+IF($L$64-J28>0,F$23*($L$64-J28))+ROUND($F$14*365/12,2)+(Summary!N19/12)*2","v":186.74369407129927},null,"14 hot",{"$f":"C$28*MIN(I28,$L$64)+IF($L$64-I28>0,C$29*($L$64-I28))+ROUND($C$31*365/12,2)+(Summary!N19/12)*2","v":95.696666666666687},{"$f":"C$28*MIN(J28,$L$64)+IF($L$64-J28>0,C$29*($L$64-J28))+ROUND($C$31*365/12,2)+(Summary!N19/12)*2","v":104.56006738366668},{"$f":"D$28*MIN(I28,$L$64)+IF($L$64-I28>0,D$29*($L$64-I28))+ROUND($P$14*365/12,2)+(Summary!N19/12)*2","v":101.78166666666667},{"$f":"D$28*MIN(J28,$L$64)+IF($L$64-J28>0,D$29*($L$64-J28))+ROUND($P$14*365/12,2)+(Summary!N19/12)*2","v":111.51746564766667},{"$f":"E$28*MIN(I28,$L$64)+IF($L$64-I28>0,E$29*($L$64-I28))+ROUND($P$14*365/12,2)+(Summary!N19/12)*2","v":100.5689239185519},{"$f":"E$28*MIN(J28,$L$64)+IF($L$64-J28>0,E$29*($L$64-J28))+ROUND($P$14*365/12,2)+(Summary!N19/12)*2","v":110.19240880099008},{"$f":"F$28*MIN(I28,$L$64)+IF($L$64-I28>0,F$29*($L$64-I28))+ROUND($P$14*365/12,2)+(Summary!N19/12)*2","v":100.5689239185519},{"$f":"F$28*MIN(J28,$L$64)+IF($L$64-J28>0,F$29*($L$64-J28))+ROUND($P$14*365/12,2)+(Summary!N19/12)*2","v":110.19240880099008}]
[null,"15 hot",{"$f":"C$22*MIN(K29,X29)+IF(X29-K29>0,C$23*(X29-K29))+ROUND($C$25*365/12,2)+(Summary!N19/12)*2","v":318.24183155555795},{"$f":"C$22*MIN(L29,Y29)+IF(Y29-L29>0,C$23*(Y29-L29))+ROUND($C$25*365/12,2)+(Summary!N19/12)*2","v":142.0377559510865},{"$f":"D$22*MIN(K29,X29)+IF(X29-K29>0,D$23*(X29-K29))+ROUND($F$14*365/12,2)+(Summary!N19/12)*2","v":330.27160401712916},{"$f":"D$22*MIN(L29,Y29)+IF(Y29-L29>0,D$23*(Y29-L29))+ROUND($F$14*365/12,2)+(Summary!N19/12)*2","v":158.89774659796129},{"$f":"E$22*MIN(K29,X29)+IF(X29-K29>0,E$23*(X29-K29))+ROUND($F$14*365/12,2)+(Summary!N19/12)*2","v":326.63245359973297},{"$f":"E$22*MIN(L29,Y29)+IF(Y29-L29>0,E$23*(Y29-L29))+ROUND($F$14*365/12,2)+(Summary!N19/12)*2","v":157.23559882314825},{"$f":"F$22*MIN(K29,X29)+IF(X29-K29>0,F$23*(X29-K29))+ROUND($F$14*365/12,2)+(Summary!N19/12)*2","v":326.63245359973297},{"$f":"F$22*MIN(L29,Y29)+IF(Y29-L29>0,F$23*(Y29-L29))+ROUND($F$14*365/12,2)+(Summary!N19/12)*2","v":157.23559882314825},null,"15 hot",{"$f":"C$22*MIN(I29,$L$64)+IF($L$64-I29>0,C$23*($L$64-I29))+ROUND($C$25*365/12,2)+(Summary!N19/12)*2","v":158.14666666666665},{"$f":"C$22*MIN(J29,$L$64)+IF($L$64-J29>0,C$23*($L$64-J29))+ROUND($C$25*365/12,2)+(Summary!N19/12)*2","v":177.64404532966668},{"$f":"D$22*MIN(I29,$L$64)+IF($L$64-I29>0,D$23*($L$64-I29))+ROUND($F$14*365/12,2)+(Summary!N19/12)*2","v":174.32666666666665},{"$f":"D$22*MIN(J29,$L$64)+IF($L$64-J29>0,D$23*($L$64-J29))+ROUND($F$14*365/12,2)+(Summary!N19/12)*2","v":195.74242506566668},{"$f":"E$22*MIN(I29,$L$64)+IF($L$64-I29>0,E$23*($L$64-I29))+ROUND($F$14*365/12,2)+(Summary!N19/12)*2","v":172.48652782479473},{"$f":"E$22*MIN(J29,$L$64)+IF($L$64-J29>0,E$23*($L$64-J29))+ROUND($F$14*365/12,2)+(Summary!N19/12)*2","v":193.65522980815845},{"$f":"F$22*MIN(I29,$L$64)+IF($L$64-I29>0,F$23*($L$64-I29))+ROUND($F$14*365/12,2)+(Summary!N19/12)*2","v":172.48652782479473},{"$f":"F$22*MIN(J29,$L$64)+IF($L$64-J29>0,F$23*($L$64-J29))+ROUND($F$14*365/12,2)+(Summary!N19/12)*2","v":193.65522980815845},null,"15 hot",{"$f":"C$28*MIN(I29,$L$64)+IF($L$64-I29>0,C$29*($L$64-I29))+ROUND($C$31*365/12,2)+(Summary!N19/12)*2","v":95.696666666666687},{"$f":"C$28*MIN(J29,$L$64)+IF($L$64-J29>0,C$29*($L$64-J29))+ROUND($C$31*365/12,2)+(Summary!N19/12)*2","v":108.85683363766668},{"$f":"D$28*MIN(I29,$L$64)+IF($L$64-I29>0,D$29*($L$64-I29))+ROUND($P$14*365/12,2)+(Summary!N19/12)*2","v":101.78166666666667},{"$f":"D$28*MIN(J29,$L$64)+IF($L$64-J29>0,D$29*($L$64-J29))+ROUND($P$14*365/12,2)+(Summary!N19/12)*2","v":116.23714986966667},{"$f":"E$28*MIN(I29,$L$64)+IF($L$64-I29>0,E$29*($L$64-I29))+ROUND($P$14*365/12,2)+(Summary!N19/12)*2","v":100.5689239185519},{"$f":"E$28*MIN(J29,$L$64)+IF($L$64-J29>0,E$29*($L$64-J29))+ROUND($P$14*365/12,2)+(Summary!N19/12)*2","v":114.85764581429927},{"$f":"F$28*MIN(I29,$L$64)+IF($L$64-I29>0,F$29*($L$64-I29))+ROUND($P$14*365/12,2)+(Summary!N19/12)*2","v":100.5689239185519},{"$f":"F$28*MIN(J29,$L$64)+IF($L$64-J29>0,F$29*($L$64-J29))+ROUND($P$14*365/12,2)+(Summary!N19/12)*2","v":114.85764581429927}]
[null,"16 cool",{"$f":"C$22*MIN(K30,X30)+IF(X30-K30>0,C$23*(X30-K30))+ROUND($C$25*365/12,2)+(Summary!N19/12)*2","v":145.17251748267714},{"$f":"C$22*MIN(L30,Y30)+IF(Y30-L30>0,C$23*(Y30-L30))+ROUND($C$25*365/12,2)+(Summary!N19/12)*2","v":171.02454044566267},{"$f":"D$22*MIN(K30,X30)+IF(X30-K30>0,D$23*(X30-K30))+ROUND($F$14*365/12,2)+(Summary!N19/12)*2","v":162.42474389982073},{"$f":"D$22*MIN(L30,Y30)+IF(Y30-L30>0,D$23*(Y30-L30))+ROUND($F$14*365/12,2)+(Summary!N19/12)*2","v":186.660938592256},{"$f":"E$22*MIN(K30,X30)+IF(X30-K30>0,E$23*(X30-K30))+ROUND($F$14*365/12,2)+(Summary!N19/12)*2","v":160.72190798802362},{"$f":"E$22*MIN(L30,Y30)+IF(Y30-L30>0,E$23*(Y30-L30))+ROUND($F$14*365/12,2)+(Summary!N19/12)*2","v":184.67850915508293},{"$f":"F$22*MIN(K30,X30)+IF(X30-K30>0,F$23*(X30-K30))+ROUND($F$14*365/12,2)+(Summary!N19/12)*2","v":160.72190798802362},{"$f":"F$22*MIN(L30,Y30)+IF(Y30-L30>0,F$23*(Y30-L30))+ROUND($F$14*365/12,2)+(Summary!N19/12)*2","v":184.67850915508293},null,"16 cool",{"$f":"C$22*MIN(I30,$L$64)+IF($L$64-I30>0,C$23*($L$64-I30))+ROUND($C$25*365/12,2)+(Summary!N19/12)*2","v":163.17619927966663},{"$f":"C$22*MIN(J30,$L$64)+IF($L$64-J30>0,C$23*($L$64-J30))+ROUND($C$25*365/12,2)+(Summary!N19/12)*2","v":169.83140846266664},{"$f":"D$22*MIN(I30,$L$64)+IF($L$64-I30>0,D$23*($L$64-I30))+ROUND($F$14*365/12,2)+(Summary!N19/12)*2","v":179.85106341566666},{"$f":"D$22*MIN(J30,$L$64)+IF($L$64-J30>0,D$23*($L$64-J30))+ROUND($F$14*365/12,2)+(Summary!N19/12)*2","v":187.16108977466666},{"$f":"E$22*MIN(I30,$L$64)+IF($L$64-I30>0,E$23*($L$64-I30))+ROUND($F$14*365/12,2)+(Summary!N19/12)*2","v":177.94719404256944},{"$f":"E$22*MIN(J30,$L$64)+IF($L$64-J30>0,E$23*($L$64-J30))+ROUND($F$14*365/12,2)+(Summary!N19/12)*2","v":185.17289049474039},{"$f":"F$22*MIN(I30,$L$64)+IF($L$64-I30>0,F$23*($L$64-I30))+ROUND($F$14*365/12,2)+(Summary!N19/12)*2","v":177.94719404256944},{"$f":"F$22*MIN(J30,$L$64)+IF($L$64-J30>0,F$23*($L$64-J30))+ROUND($F$14*365/12,2)+(Summary!N19/12)*2","v":185.17289049474039},null,"16 cool",{"$f":"C$28*MIN(I30,$L$64)+IF($L$64-I30>0,C$29*($L$64-I30))+ROUND($C$31*365/12,2)+(Summary!N19/12)*2","v":99.091455787666675},{"$f":"C$28*MIN(J30,$L$64)+IF($L$64-J30>0,C$29*($L$64-J30))+ROUND($C$31*365/12,2)+(Summary!N19/12)*2","v":103.58352959866667},{"$f":"D$28*MIN(I30,$L$64)+IF($L$64-I30>0,D$29*($L$64-I30))+ROUND($P$14*365/12,2)+(Summary!N19/12)*2","v":105.51059481966666},{"$f":"D$28*MIN(J30,$L$64)+IF($L$64-J30>0,D$29*($L$64-J30))+ROUND($P$14*365/12,2)+(Summary!N19/12)*2","v":110.44481014266665},{"$f":"E$28*MIN(I30,$L$64)+IF($L$64-I30>0,E$29*($L$64-I30))+ROUND($P$14*365/12,2)+(Summary!N19/12)*2","v":104.25483442041477},{"$f":"E$28*MIN(J30,$L$64)+IF($L$64-J30>0,E$29*($L$64-J30))+ROUND($P$14*365/12,2)+(Summary!N19/12)*2","v":109.13212766160163},{"$f":"F$28*MIN(I30,$L$64)+IF($L$64-I30>0,F$29*($L$64-I30))+ROUND($P$14*365/12,2)+(Summary!N19/12)*2","v":104.25483442041477},{"$f":"F$28*MIN(J30,$L$64)+IF($L$64-J30>0,F$29*($L$64-J30))+ROUND($P$14*365/12,2)+(Summary!N19/12)*2","v":109.13212766160163}]
[null,"ALL",{"$f":"SUMPRODUCT(C67:C75,$AB$22:$AB$30)","v":170.552539217613},{"$f":"SUMPRODUCT(D67:D75,$AB$22:$AB$30)","v":122.73944863575313},{"$f":"SUMPRODUCT(E67:E75,$AB$22:$AB$30)","v":187.74425375389816},140.41406099769213,{"$f":"SUMPRODUCT(G67:G75,$AB$22:$AB$30)","v":185.74932697921062},138.9651446680173,{"$f":"SUMPRODUCT(I67:I75,$AB$22:$AB$30)","v":185.74932697921062},138.9651446680173,null,"ALL",{"$f":"SUMPRODUCT(M67:M75,$T$22:$T$30)","v":163.1865904614148},172.66318728033542,179.86247700318754,190.27149205216276,177.95847596069203,188.24741055767524,177.95847596069203,188.24741055767524,null,"ALL",{"$f":"SUMPRODUCT(W67:W75,$U$22:$U$30)","v":97.499916045803843},{"$f":"SUMPRODUCT(X67:X75,$U$22:$U$30)","v":105.03737750586474},103.76240453787898,112.04175599058254,102.52681160675132,110.71065082703295,102.52681160675132,110.71065082703295]
[]
[]
[null,null,"All-Electric - CARE\t"]
[null,null,{"$f":"C50","v":"Jan 2025"},null,"2025-11-15",null,"Authorized",null,"w/Pending"]
[null,null,"Summer","Winter","Summer","Winter","Summer","Winter","Summer","Winter"]
[null,{"$f":"B52","v":"5 warm"},{"$f":"C$28*MIN(K22,Z22)+IF(Z22-K22>0,C$29*(Z22-K22))+ROUND($C$31*365/12,2)+(Summary!N19/12)*2","v":65.221086284944491},{"$f":"C$28*MIN(L22,AA22)+IF(AA22-L22>0,C$29*(AA22-L22))+ROUND($C$31*365/12,2)+(Summary!N19/12)*2","v":81.091586750128357},{"$f":"D$28*MIN(K22,Z22)+IF(Z22-K22>0,D$29*(Z22-K22))+ROUND($P$14*365/12,2)+(Summary!N19/12)*2","v":71.09151063995391},{"$f":"D$28*MIN(L22,AA22)+IF(AA22-L22>0,D$29*(AA22-L22))+ROUND($P$14*365/12,2)+(Summary!N19/12)*2","v":87.073753780124932},{"$f":"E$28*MIN(K22,Z22)+IF(Z22-K22>0,E$29*(Z22-K22))+ROUND($P$14*365/12,2)+(Summary!N19/12)*2","v":70.232815588960733},{"$f":"E$28*MIN(L22,AA22)+IF(AA22-L22>0,E$29*(AA22-L22))+ROUND($P$14*365/12,2)+(Summary!N19/12)*2","v":86.030684417913221},{"$f":"F$28*MIN(K22,Z22)+IF(Z22-K22>0,F$29*(Z22-K22))+ROUND($P$14*365/12,2)+(Summary!N19/12)*2","v":70.232815588960733},{"$f":"F$28*MIN(L22,AA22)+IF(AA22-L22>0,F$29*(AA22-L22))+ROUND($P$14*365/12,2)+(Summary!N19/12)*2","v":86.030684417913221}]
[null,"6 cool",{"$f":"C$28*MIN(K23,Z23)+IF(Z23-K23>0,C$29*(Z23-K23))+ROUND($C$31*365/12,2)+(Summary!N19/12)*2","v":73.814120829680391},{"$f":"C$28*MIN(L23,AA23)+IF(AA23-L23>0,C$29*(AA23-L23))+ROUND($C$31*365/12,2)+(Summary!N19/12)*2","v":69.313510553200629},{"$f":"D$28*MIN(K23,Z23)+IF(Z23-K23>0,D$29*(Z23-K23))+ROUND($P$14*365/12,2)+(Summary!N19/12)*2","v":80.330966463127638},{"$f":"D$28*MIN(L23,AA23)+IF(AA23-L23>0,D$29*(AA23-L23))+ROUND($P$14*365/12,2)+(Summary!N19/12)*2","v":75.212749275842654},{"$f":"E$28*MIN(K23,Z23)+IF(Z23-K23>0,E$29*(Z23-K23))+ROUND($P$14*365/12,2)+(Summary!N19/12)*2","v":79.365683226202663},{"$f":"E$28*MIN(L23,AA23)+IF(AA23-L23>0,E$29*(AA23-L23))+ROUND($P$14*365/12,2)+(Summary!N19/12)*2","v":74.306510802552936},{"$f":"F$28*MIN(K23,Z23)+IF(Z23-K23>0,F$29*(Z23-K23))+ROUND($P$14*365/12,2)+(Summary!N19/12)*2","v":79.365683226202663},{"$f":"F$28*MIN(L23,AA23)+IF(AA23-L23>0,F$29*(AA23-L23))+ROUND($P$14*365/12,2)+(Summary!N19/12)*2","v":74.306510802552936}]
[null,"8 cool",{"$f":"C$28*MIN(K24,Z24)+IF(Z24-K24>0,C$29*(Z24-K24))+ROUND($C$31*365/12,2)+(Summary!N19/12)*2","v":85.102231337513004},{"$f":"C$28*MIN(L24,AA24)+IF(AA24-L24>0,C$29*(AA24-L24))+ROUND($C$31*365/12,2)+(Summary!N19/12)*2","v":68.608184149109775},{"$f":"D$28*MIN(K24,Z24)+IF(Z24-K24>0,D$29*(Z24-K24))+ROUND($P$14*365/12,2)+(Summary!N19/12)*2","v":91.777389392534872},{"$f":"D$28*MIN(L24,AA24)+IF(AA24-L24>0,D$29*(AA24-L24))+ROUND($P$14*365/12,2)+(Summary!N19/12)*2","v":74.502456736039491},{"$f":"E$28*MIN(K24,Z24)+IF(Z24-K24>0,E$29*(Z24-K24))+ROUND($P$14*365/12,2)+(Summary!N19/12)*2","v":90.68005796156001},{"$f":"E$28*MIN(L24,AA24)+IF(AA24-L24>0,E$29*(AA24-L24))+ROUND($P$14*365/12,2)+(Summary!N19/12)*2","v":73.604412337676635},{"$f":"F$28*MIN(K24,Z24)+IF(Z24-K24>0,F$29*(Z24-K24))+ROUND($P$14*365/12,2)+(Summary!N19/12)*2","v":90.68005796156001},{"$f":"F$28*MIN(L24,AA24)+IF(AA24-L24>0,F$29*(AA24-L24))+ROUND($P$14*365/12,2)+(Summary!N19/12)*2","v":73.604412337676635}]
[null,"9 warm",{"$f":"C$28*MIN(K25,Z25)+IF(Z25-K25>0,C$29*(Z25-K25))+ROUND($C$31*365/12,2)+(Summary!N19/12)*2","v":106.12090488259082},{"$f":"C$28*MIN(L25,AA25)+IF(AA25-L25>0,C$29*(AA25-L25))+ROUND($C$31*365/12,2)+(Summary!N19/12)*2","v":69.738276911497366},{"$f":"D$28*MIN(K25,Z25)+IF(Z25-K25>0,D$29*(Z25-K25))+ROUND($P$14*365/12,2)+(Summary!N19/12)*2","v":113.04094129330475},{"$f":"D$28*MIN(L25,AA25)+IF(AA25-L25>0,D$29*(AA25-L25))+ROUND($P$14*365/12,2)+(Summary!N19/12)*2","v":75.640506373418518},{"$f":"E$28*MIN(K25,Z25)+IF(Z25-K25>0,E$29*(Z25-K25))+ROUND($P$14*365/12,2)+(Summary!N19/12)*2","v":111.69830933089762},{"$f":"E$28*MIN(L25,AA25)+IF(AA25-L25>0,E$29*(AA25-L25))+ROUND($P$14*365/12,2)+(Summary!N19/12)*2","v":74.729333209826393},{"$f":"F$28*MIN(K25,Z25)+IF(Z25-K25>0,F$29*(Z25-K25))+ROUND($P$14*365/12,2)+(Summary!N19/12)*2","v":111.69830933089762},{"$f":"F$28*MIN(L25,AA25)+IF(AA25-L25>0,F$29*(AA25-L25))+ROUND($P$14*365/12,2)+(Summary!N19/12)*2","v":74.729333209826393}]
[null,"10 hot (Sec 745)",{"$f":"C$28*MIN(K26,Z26)+IF(Z26-K26>0,C$29*(Z26-K26))+ROUND($C$31*365/12,2)+(Summary!N19/12)*2","v":140.51515785234997},{"$f":"C$28*MIN(L26,AA26)+IF(AA26-L26>0,C$29*(AA26-L26))+ROUND($C$31*365/12,2)+(Summary!N19/12)*2","v":80.270711555973023},{"$f":"D$28*MIN(K26,Z26)+IF(Z26-K26>0,D$29*(Z26-K26))+ROUND($P$14*365/12,2)+(Summary!N19/12)*2","v":147.95255383952608},{"$f":"D$28*MIN(L26,AA26)+IF(AA26-L26>0,D$29*(AA26-L26))+ROUND($P$14*365/12,2)+(Summary!N19/12)*2","v":86.247098882284334},{"$f":"E$28*MIN(K26,Z26)+IF(Z26-K26>0,E$29*(Z26-K26))+ROUND($P$14*365/12,2)+(Summary!N19/12)*2","v":146.20717462441573},{"$f":"E$28*MIN(L26,AA26)+IF(AA26-L26>0,E$29*(AA26-L26))+ROUND($P$14*365/12,2)+(Summary!N19/12)*2","v":85.213565974127789},{"$f":"F$28*MIN(K26,Z26)+IF(Z26-K26>0,F$29*(Z26-K26))+ROUND($P$14*365/12,2)+(Summary!N19/12)*2","v":146.20717462441573},{"$f":"F$28*MIN(L26,AA26)+IF(AA26-L26>0,F$29*(AA26-L26))+ROUND($P$14*365/12,2)+(Summary!N19/12)*2","v":85.213565974127789}]
[null,"13 hot",{"$f":"C$28*MIN(K27,Z27)+IF(Z27-K27>0,C$29*(Z27-K27))+ROUND($C$31*365/12,2)+(Summary!N19/12)*2","v":206.90517857334945},{"$f":"C$28*MIN(L27,AA27)+IF(AA27-L27>0,C$29*(AA27-L27))+ROUND($C$31*365/12,2)+(Summary!N19/12)*2","v":106.07654793941936},{"$f":"D$28*MIN(K27,Z27)+IF(Z27-K27>0,D$29*(Z27-K27))+ROUND($P$14*365/12,2)+(Summary!N19/12)*2","v":215.10409674299228},{"$f":"D$28*MIN(L27,AA27)+IF(AA27-L27>0,D$29*(AA27-L27))+ROUND($P$14*365/12,2)+(Summary!N19/12)*2","v":112.23463169011838},{"$f":"E$28*MIN(K27,Z27)+IF(Z27-K27>0,E$29*(Z27-K27))+ROUND($P$14*365/12,2)+(Summary!N19/12)*2","v":212.58404407550719},{"$f":"E$28*MIN(L27,AA27)+IF(AA27-L27>0,E$29*(AA27-L27))+ROUND($P$14*365/12,2)+(Summary!N19/12)*2","v":110.90130147443179},{"$f":"F$28*MIN(K27,Z27)+IF(Z27-K27>0,F$29*(Z27-K27))+ROUND($P$14*365/12,2)+(Summary!N19/12)*2","v":212.58404407550719},{"$f":"F$28*MIN(L27,AA27)+IF(AA27-L27>0,F$29*(AA27-L27))+ROUND($P$14*365/12,2)+(Summary!N19/12)*2","v":110.90130147443179}]
[null,"14 hot",{"$f":"C$28*MIN(K28,Z28)+IF(Z28-K28>0,C$29*(Z28-K28))+ROUND($C$31*365/12,2)+(Summary!N19/12)*2","v":195.6352795196178},{"$f":"C$28*MIN(L28,AA28)+IF(AA28-L28>0,C$29*(AA28-L28))+ROUND($C$31*365/12,2)+(Summary!N19/12)*2","v":129.64310847141215},{"$f":"D$28*MIN(K28,Z28)+IF(Z28-K28>0,D$29*(Z28-K28))+ROUND($P$14*365/12,2)+(Summary!N19/12)*2","v":204.29066745958426},{"$f":"D$28*MIN(L28,AA28)+IF(AA28-L28>0,D$29*(AA28-L28))+ROUND($P$14*365/12,2)+(Summary!N19/12)*2","v":136.06044689651978},{"$f":"E$28*MIN(K28,Z28)+IF(Z28-K28>0,E$29*(Z28-K28))+ROUND($P$14*365/12,2)+(Summary!N19/12)*2","v":201.89536064651728},{"$f":"E$28*MIN(L28,AA28)+IF(AA28-L28>0,E$29*(AA28-L28))+ROUND($P$14*365/12,2)+(Summary!N19/12)*2","v":134.45225737420313},{"$f":"F$28*MIN(K28,Z28)+IF(Z28-K28>0,F$29*(Z28-K28))+ROUND($P$14*365/12,2)+(Summary!N19/12)*2","v":201.89536064651728},{"$f":"F$28*MIN(L28,AA28)+IF(AA28-L28>0,F$29*(AA28-L28))+ROUND($P$14*365/12,2)+(Summary!N19/12)*2","v":134.45225737420313}]
[null,"15 hot",{"$f":"C$28*MIN(K29,Z29)+IF(Z29-K29>0,C$29*(Z29-K29))+ROUND($C$31*365/12,2)+(Summary!N19/12)*2","v":248.59744334007226},{"$f":"C$28*MIN(L29,AA29)+IF(AA29-L29>0,C$29*(AA29-L29))+ROUND($C$31*365/12,2)+(Summary!N19/12)*2","v":99.935320198408775},{"$f":"D$28*MIN(K29,Z29)+IF(Z29-K29>0,D$29*(Z29-K29))+ROUND($P$14*365/12,2)+(Summary!N19/12)*2","v":258.0133860210446},{"$f":"D$28*MIN(L29,AA29)+IF(AA29-L29>0,D$29*(AA29-L29))+ROUND($P$14*365/12,2)+(Summary!N19/12)*2","v":106.0501641522916},{"$f":"E$28*MIN(K29,Z29)+IF(Z29-K29>0,E$29*(Z29-K29))+ROUND($P$14*365/12,2)+(Summary!N19/12)*2","v":254.99832332360737},{"$f":"E$28*MIN(L29,AA29)+IF(AA29-L29>0,E$29*(AA29-L29))+ROUND($P$14*365/12,2)+(Summary!N19/12)*2","v":104.78817917472584},{"$f":"F$28*MIN(K29,Z29)+IF(Z29-K29>0,F$29*(Z29-K29))+ROUND($P$14*365/12,2)+(Summary!N19/12)*2","v":254.99832332360737},{"$f":"F$28*MIN(L29,AA29)+IF(AA29-L29>0,F$29*(AA29-L29))+ROUND($P$14*365/12,2)+(Summary!N19/12)*2","v":104.78817917472584}]
[null,"16 cool",{"$f":"C$28*MIN(K30,Z30)+IF(Z30-K30>0,C$29*(Z30-K30))+ROUND($C$31*365/12,2)+(Summary!N19/12)*2","v":155.73797085441481},{"$f":"C$28*MIN(L30,AA30)+IF(AA30-L30>0,C$29*(AA30-L30))+ROUND($C$31*365/12,2)+(Summary!N19/12)*2","v":110.33440520527222},{"$f":"D$28*MIN(K30,Z30)+IF(Z30-K30>0,D$29*(Z30-K30))+ROUND($P$14*365/12,2)+(Summary!N19/12)*2","v":163.93736932910625},{"$f":"D$28*MIN(L30,AA30)+IF(AA30-L30>0,D$29*(AA30-L30))+ROUND($P$14*365/12,2)+(Summary!N19/12)*2","v":116.5224681215082},{"$f":"E$28*MIN(K30,Z30)+IF(Z30-K30>0,E$29*(Z30-K30))+ROUND($P$14*365/12,2)+(Summary!N19/12)*2","v":162.00758612764687},{"$f":"E$28*MIN(L30,AA30)+IF(AA30-L30>0,E$29*(AA30-L30))+ROUND($P$14*365/12,2)+(Summary!N19/12)*2","v":115.1396725784754},{"$f":"F$28*MIN(K30,Z30)+IF(Z30-K30>0,F$29*(Z30-K30))+ROUND($P$14*365/12,2)+(Summary!N19/12)*2","v":162.00758612764687},{"$f":"F$28*MIN(L30,AA30)+IF(AA30-L30>0,F$29*(AA30-L30))+ROUND($P$14*365/12,2)+(Summary!N19/12)*2","v":115.1396725784754}]
[null,"ALL",{"$f":"SUMPRODUCT(C82:C90,$AC$22:$AC$30)","v":131.76475096845519},{"$f":"SUMPRODUCT(D82:D90,$AC$22:$AC$30)","v":82.668515741607067},139.14243170496439,88.668410132490294,137.49868779761812,87.606944499866529,137.49868779761812,{"$f":"SUMPRODUCT(J82:J90,$AC$22:$AC$30)","v":87.606944499866529}]
[]
[]
[]
[null,null,null,null,null,2025,2026,2027,2028,2029,null,null,{"$f":"F95","v":2025},{"$f":"G95","v":2026},2027,2028,2029]
[null,null,null,null,null,"Non-CARE","Non-CARE","Non-CARE","Non-CARE","Non-CARE",null,null,"CARE","CARE","CARE","CARE","CARE"]
[3,null,null,"Baseline - Summer",null,3085.6709369045998,3384.8159978449999,{"$f":"H$107*(G97/SUM(G$97:G$102))","v":3521.3442288760398},{"$f":"I$107*(H97/SUM(H$97:H$102))","v":3594.3827115689892},{"$f":"I97","v":3594.3827115689892},null,null,1783.36012901,1757.8132523999998,{"$f":"O$107*(N97/SUM(N$97:N$102))","v":1828.7155212340772},{"$f":"P$107*(O97/SUM(O$97:O$102))","v":1866.646094977109},{"$f":"P97","v":1866.646094977109}]
[{"$f":"A97+1","v":4},null,null,"- Winter",null,4290.2912726942004,4580.5545835053999,{"$f":"H$107*(G98/SUM(G$97:G$102))","v":4765.313523082993},4864.1539790736497,{"$f":"I98","v":4864.1539790736497},null,null,2747.2776541200001,2693.8852452999995,{"$f":"O$107*(N98/SUM(N$97:N$102))","v":2802.5444419522223},2860.6738324392986,{"$f":"P98","v":2860.6738324392986}]
[{"$f":"A98+1","v":5},null,null,"101% - 400% of Baseline - Summer",null,1911.9288203185401,2083.1447903274002,{"$f":"H$107*(G99/SUM(G$97:G$102))","v":2167.1694680014598},2212.1201343928101,2212.1201343928101,null,null,745.49075508300007,727.67480486999989,{"$f":"O$107*(N99/SUM(N$97:N$102))","v":757.02592881233841},772.72789419994888,772.72789419994888]
[6,null,null,"- Winter",null,2615.8042580374204,2778.8608380299002,{"$f":"H$107*(G100/SUM(G$97:G$102))","v":2890.9475673348911},2950.9105843360462,2950.9105843360462,null,null,1112.0237662050001,1081.6592311099998,{"$f":"O$107*(N100/SUM(N$97:N$102))","v":1125.2884923448394},1148.6288302188611,1148.6288302188611]
[7,null,null,"401% of Baseline - Summer",null,151.63255821328497,165.13382629226001,{"$f":"H$107*(G101/SUM(G$97:G$102))","v":171.79458102794527},175.35788376621721,175.35788376621721,null,null,8.4770059659299992,8.2546070853999982,{"$f":"O$107*(N101/SUM(N$97:N$102))","v":8.587560753765862},8.765680916613098,8.765680916613098]
[8,null,null,"- Winter",null,262.89674742179903,277.87393748765999,{"$f":"H$107*(G102/SUM(G$97:G$102))","v":289.08212049050968},295.07816009412051,295.07816009412051,null,null,21.080184433099998,20.228396120000003,{"$f":"O$107*(N102/SUM(N$97:N$102))","v":21.04431850414646},21.480812352218962,21.480812352218962]
[9]
[10,null,null,"Basic Charge - Single-Family Residence",null,18879671.950581908,19072895.180971641,{"$f":"$F107/SUM($F$107:$F$108)*H$108","v":19268095.946609862},{"$f":"$F107/SUM($F$107:$F$108)*I$108","v":19465294.486500196},19465294.486500196,null,null,6433922.1264425237,6438624.7575091971,{"$f":"$M107/SUM($M$107:$M$108)*O$108","v":6443330.8257854776},6448040.3337836647,6448040.3337836647]
[11,null,null,"Basic Charge - Multi-Family Residence",null,8588406.5244109407,8676304.2197146863,{"$f":"$F108/SUM($F$107:$F$108)*H$108","v":8765101.5003859568},8854807.5731944013,8854807.5731944013,null,null,5402078.3984754756,5406026.8425508039,5409978.1725913966,5413932.3907066407,5413932.3907066407]
[]
[null,null,null,null,null,{"$f":"1-F108","v":0.687331367855604},{"$f":"SUM(G97:G102)","v":13270.383973487622},{"$f":"G107/'SAR and RAR'!$K$59*'SAR and RAR'!$K$60","v":13805.651488813841},{"$f":"H107/'SAR and RAR'!$K$60*'SAR and RAR'!$K$61","v":14092.003453231831},{"$f":"I107","v":14092.003453231831},null,null,{"$f":"1-M108","v":0.54358920590594506},{"$f":"SUM(N97:N102)","v":6289.5155368853993},{"$f":"N107/'SAR and RAR'!$K$59*'SAR and RAR'!$K$60","v":6543.2062636013898},{"$f":"O107/'SAR and RAR'!$K$60*'SAR and RAR'!$K$61","v":6678.9231451040487},{"$f":"P107","v":6678.9231451040487}]
[null,null,null,null,"Customers",0.312668632144396,{"$f":"SUM(G104:G105)","v":27749199.400686327},{"$f":"(SUM(G104:G105)/SUM(F104:F105))*SUM(G104:G105)","v":28033197.446995821},{"$f":"(SUM(G104:G105)/SUM(F104:F105))*H108","v":28320102.059694599},{"$f":"I108","v":28320102.059694599},null,null,0.45641079409405494,{"$f":"SUM(N104:N105)","v":11844651.600060001},{"$f":"(SUM(N104:N105)/SUM(M104:M105))*SUM(N104:N105)","v":11853308.998376874},{"$f":"(SUM(O104:O105)/SUM(N104:N105))*SUM(O104:O105)","v":11861972.724490305},{"$f":"P108","v":11861972.724490305}]

{"sheet":"Simple Bill Insert Calc (2)","index":8,"n_rows":122,"n_cols":17,"rows_kept":122,"cut":false,"hidden":false,"merged":[[102,1,102,2],[103,1,103,2],[93,1,93,7],[95,1,95,2],[96,1,96,2],[97,1,97,2],[99,1,99,7],[101,1,101,2],[91,1,91,2],[73,1,73,2],[74,1,74,2],[76,1,76,7],[78,1,78,2],[79,1,79,2],[81,1,81,7],[83,1,83,2],[84,1,84,2],[87,1,87,7],[89,1,89,2],[90,1,90,2],[71,1,71,7],[54,1,54,2],[56,1,56,7],[58,1,58,2],[59,1,59,2],[60,1,60,2],[61,1,61,2],[63,1,63,7],[65,1,65,2],[66,1,66,2],[67,1,67,2],[68,1,68,2],[53,1,53,2],[36,1,36,7],[38,1,38,2],[39,1,39,2],[40,1,40,2],[42,1,42,7],[44,1,44,2],[45,1,45,2],[46,1,46,2],[49,1,49,7],[51,1,51,2],[52,1,52,2],[33,1,33,2],[22,1,22,7],[22,9,22,15],[23,1,23,2],[23,9,23,10],[24,1,24,2],[24,9,24,10],[26,1,26,2],[26,9,26,10],[29,1,29,7],[31,1,31,2],[32,1,32,2],[115,1,115,2],[119,1,119,2],[120,1,120,2],[121,1,121,2],[105,1,105,7],[111,1,111,7],[117,1,117,7],[107,1,107,2],[108,1,108,2],[109,1,109,2],[113,1,113,2],[114,1,114,2]]}
[]
[null,"Inputs:",null,null,null,null,null,null,null,null,"Assumptions:"]
[null,null,null,null,null,null,null,null,null,null,"Current Effective Rates",null,{"$f":"Summary!N3","v":"2025-11-15"}]
[null,null,"Baseline Region - (Residential bill)","9 warm",null,null,null,null,null,null,"Sales Forecast",null,2025]
[null,null,"Typical residential average usage kWh/month",500,null,null,null,null,null,null,"Residential bill calculated using ",null,"Schedule D, Basic, Single Family"]
[null,null,"Include CA Climate Credit in Rates","N",null,null,null,null,null,null,"Non-CARE bill impact calculated with average summer usage of ",null,null,null,{"$f":"IF($D$4=\"All\",SUMPRODUCT('Res Bill Impact (2)'!P$22:P$30,'Res Bill Impact (2)'!$T$22:$T$30),VLOOKUP(D$4,'Res Bill Impact (2)'!$O$22:$S$30,2,FALSE))","v":736.18963415586904},"kWh per month"]
[null,null,null,"Revenue Change",null,null,null,null,null,null,"Non-CARE bill impact calculated with average winter usage of ",null,null,null,{"$f":"IF($D$4=\"All\",SUMPRODUCT('Res Bill Impact (2)'!Q$22:Q$30,'Res Bill Impact (2)'!$T$22:$T$30),VLOOKUP(D$4,'Res Bill Impact (2)'!$O$22:$S$30,3,FALSE))","v":454.05427078978795},"kWh per month"]
[null,null,"Generation",null,null,null,null,null,null,null,"CARE bill impact calculated with average summer usage of ",null,null,null,{"$f":"IF($D$4=\"All\",SUMPRODUCT('Res Bill Impact (2)'!R$22:R$30,'Res Bill Impact (2)'!$U$22:$U$30),VLOOKUP(D$4,'Res Bill Impact (2)'!$O$22:$S$30,4,FALSE))","v":685.49662095013514},"kWh per month"]
[null,null,"Distribution",null,null,null,null,null,null,null,"CARE bill impact calculated with average winter usage of ",null,null,null,{"$f":"IF($D$4=\"All\",SUMPRODUCT('Res Bill Impact (2)'!S$22:S$30,'Res Bill Impact (2)'!$U$22:$U$30),VLOOKUP(D$4,'Res Bill Impact (2)'!$O$22:$S$30,5,FALSE))","v":424.24463521296872},"kWh per month"]
[null,null,"Nuclear",null,null,null,null,null,null,null,"Essential Use (Basic) bill impact calculated with average summer usage of ",null,null,null,{"$f":"IF($D$4=\"All\",SUMPRODUCT('Res Bill Impact (2)'!I$22:I$30,'Res Bill Impact (2)'!$T$22:$T$30),VLOOKUP($D$4,'Res Bill Impact (2)'!$H$22:$L$30,2,FALSE))","v":514.04729999999995},"kWh per month"]
[null,null,"Public Purpose",null,null,null,null,null,null,null,"Essential Use (Basic) bill impact calculated with average winter usage of ",null,null,null,{"$f":"IF($D$4=\"All\",SUMPRODUCT('Res Bill Impact (2)'!J$22:J$30,'Res Bill Impact (2)'!$T$22:$T$30),VLOOKUP($D$4,'Res Bill Impact (2)'!$H$22:$L$30,3,FALSE))","v":365.00400000000002},"kWh per month"]
[null,null,"DCPP",null,null,null,null,null,null,null,"Essential Use (All-Electric) bill impact calculated with average summer usage of ",null,null,null,{"$f":"IF($D$4=\"All\",SUMPRODUCT('Res Bill Impact (2)'!K$22:K$30,'Res Bill Impact (2)'!$T$22:$T$30),VLOOKUP($D$4,'Res Bill Impact (2)'!$H$22:$L$30,4,FALSE))","v":380.21250000000003},"kWh per month"]
[null,null,"New System Gen",null,null,null,null,null,null,null,"Essential Use (All-Electric) bill impact calculated with average winter usage of ",null,null,null,{"$f":"IF($D$4=\"All\",SUMPRODUCT('Res Bill Impact (2)'!L$22:L$30,'Res Bill Impact (2)'!$T$22:$T$30),VLOOKUP($D$4,'Res Bill Impact (2)'!$H$22:$L$30,5,FALSE))","v":422.79630000000003},"kWh per month"]
[null,null,"FERC",null,null,null,null,null,null,null,"Average monthly usage is for all customers (Non-CARE and CARE) based on seasonal usage in",null,null,null,null,null,2024]
[null,null,"TOTCA",null,null,null,null,null,null,null,"Summer season",null,4,"months"]
[null,null,"GHG Revenue",null,null,null,null,null,null,null,"Winter Season",null,8,"months"]
[null,null,"DWR",null,null,null,null,null,null,null,"Residential Bi-Annual Climate Credit",null,{"$f":"Summary!N19","v":-56}]
[null,null,"PUCRF"]
[null,null,"SECURITIZATION"]
[null,null,"Total",{"$f":"SUM(D8:D19)","v":0}]
[null,"Outputs:"]
[null,null,null,"(A)","(B)","(C)","(C)/(A)","(C)/(B)",null,null,null,"(A)","(B)","(C)","(C)/(A)","(C)/(B)"]
[null,"Bundled Average Rates - ¢/kWh",null,null,null,null,null,null,null,"Total System (Bundled and Unbundled) Average Rates - ¢/kWh"]
[null,"Customer Group",null,{"$f":"Summary!D32","v":"2025-01-01"},{"$f":"M3","v":"2025-11-15"},"Proposed","% Change over 1/1/2025","% Change over Current",null,"Customer Group",null,{"$f":"$D$24","v":"2025-01-01"},{"$f":"$E$24","v":"2025-11-15"},"Proposed",{"$f":"$G$24","v":"% Change over 1/1/2025"},"% Change over Current"]
[null,"Residential",null,{"$f":"IF(D6=\"Y\",'SAR and RAR'!W28,'SAR and RAR'!X28)","v":31.629738146992409},{"$f":"'SAR and RAR (2)'!F24","v":35.260672614547445},{"$f":"'SAR and RAR (2)'!G24","v":35.260672614547445},{"$f":"$F25/D25-1","v":0.11479495817135921},0,null,"Total Residential (RAR)",null,{"$f":"IF(D6=\"Y\",'SAR and RAR'!Z28,'SAR and RAR'!AA28)","v":28.361307178419636},{"$f":"'SAR and RAR (2)'!N24","v":31.475217358277142},{"$f":"'SAR and RAR (2)'!O24","v":31.475217358277142},{"$f":"$N25/L25-1","v":0.10979431096980274},0]
[null,null,"Small Commercial",{"$f":"IF(D6=\"Y\",'SAR and AR (GS1)'!W28,'SAR and AR (GS1)'!X28)","v":29.174067662266477},{"$f":"'SAR and AR (GS1) (2)'!G24","v":31.983408553249816},{"$f":"'SAR and AR (GS1) (2)'!H24","v":31.983408553249816},9.6295824206129366E-2,0,null,null,"Small Commercial (AR)",{"$f":"IF(D6=\"Y\",'SAR and AR (GS1)'!Z28,'SAR and AR (GS1)'!AA28)","v":25.779500964262311},{"$f":"'SAR and AR (GS1) (2)'!O24","v":28.072807513619431},{"$f":"'SAR and AR (GS1) (2)'!P24","v":28.072807513619431},8.895853153000477E-2,0]
[null,"System",null,{"$f":"IF(D6=\"Y\",'SAR and RAR'!W29,'SAR and RAR'!X29)","v":27.30660684898934},{"$f":"'SAR and RAR (2)'!F25","v":30.163203046939159},{"$f":"'SAR and RAR (2)'!G25","v":30.163203046939159},0.10461190633268114,0,null,"Total System (SAR)",null,{"$f":"IF(D6=\"Y\",'SAR and RAR'!Z29,'SAR and RAR'!AA29)","v":22.919117042486967},{"$f":"'SAR and RAR (2)'!N25","v":25.126029785552312},{"$f":"'SAR and RAR (2)'!O25","v":25.126029785552312},9.6291350970206135E-2,0]
[]
[]
[null,"Bundled Residential Monthly Average Bills"]
[null,null,null,{"$f":"$D$24","v":"2025-01-01"},{"$f":"$E$24","v":"2025-11-15"},"Proposed",{"$f":"$G$24","v":"% Change over 1/1/2025"},"% Change over Current"]
[null,"Non-CARE",null,{"$f":"((D39*4)+(D45*8))/12","v":186.85931371422498},{"$f":"((E39*4)+(E45*8))/12","v":203.61179403623942},203.61179403623942,{"$f":"$F32/D32-1","v":8.9652905113603243E-2},0]
[null,"CARE",null,104.26733922458469,110.97977942385789,110.97977942385789,6.4377208138159725E-2,0]
[null,"Total",null,157.95212264285087,171.19058892190591,171.19058892190591,8.3813158427689105E-2,0]
[]
[null,"Seasonality:"]
[null,"Bundled Residential Monthly Average Bills - Summer"]
[null,null,null,{"$f":"$D$24","v":"2025-01-01"},{"$f":"$E$24","v":"2025-11-15"},"Proposed",{"$f":"$G$24","v":"% Change over 1/1/2025"},"% Change over Current"]
[null,"Non-CARE",null,{"$f":"VLOOKUP($D$4,'Res Bill Impact (2)'!$B$37:$H$46,2,FALSE)","v":257.94911025955139},{"$f":"VLOOKUP($D$4,'Res Bill Impact (2)'!$B$37:$H$46,4,FALSE)","v":272.88753625101879},{"$f":"VLOOKUP($D$4,'Res Bill Impact (2)'!$B$37:$H$46,6,FALSE)","v":272.88753625101879},{"$f":"$F39/D39-1","v":5.7912298966397602E-2},0]
[null,"CARE",null,{"$f":"VLOOKUP($D$4,'Res Bill Impact (2)'!$B$52:$H$61,2,FALSE)","v":145.43341208684404},{"$f":"VLOOKUP($D$4,'Res Bill Impact (2)'!$B$52:$H$61,4,FALSE)","v":152.87465182804561},{"$f":"VLOOKUP($D$4,'Res Bill Impact (2)'!$B$52:$H$61,6,FALSE)","v":152.87465182804561},5.116595722005135E-2,0]
[null,"Total",null,{"$f":"D39*0.65+D40*0.35","v":218.5686158991038},{"$f":"E39*0.65+E40*0.35","v":230.88302670297819},{"$f":"F39*0.65+F40*0.35","v":230.88302670297819},5.6341166609020332E-2,0]
[]
[null,"Bundled Residential Monthly Average Bills - Winter"]
[null,null,null,{"$f":"$D$24","v":"2025-01-01"},{"$f":"$E$24","v":"2025-11-15"},"Proposed",{"$f":"$G$24","v":"% Change over 1/1/2025"},"% Change over Current"]
[null,"Non-CARE",null,{"$f":"VLOOKUP($D$4,'Res Bill Impact (2)'!$B$37:$H$46,3,FALSE)","v":151.31441544156175},{"$f":"VLOOKUP($D$4,'Res Bill Impact (2)'!$B$37:$H$46,5,FALSE)","v":168.97392292884976},{"$f":"VLOOKUP($D$4,'Res Bill Impact (2)'!$B$37:$H$46,7,FALSE)","v":168.97392292884976},{"$f":"$F45/D45-1","v":0.11670737011906307},0]
[null,"CARE",null,{"$f":"VLOOKUP($D$4,'Res Bill Impact (2)'!$B$52:$H$61,3,FALSE)","v":83.684302793455004},{"$f":"VLOOKUP($D$4,'Res Bill Impact (2)'!$B$52:$H$61,5,FALSE)","v":90.032343221764023},{"$f":"VLOOKUP($D$4,'Res Bill Impact (2)'!$B$52:$H$61,7,FALSE)","v":90.032343221764023},7.5857003242016718E-2,0]
[null,"Total",null,{"$f":"D45*0.65+D46*0.35","v":127.6438760147244},{"$f":"E45*0.65+E46*0.35","v":141.34437003136975},{"$f":"F45*0.65+F46*0.35","v":141.34437003136975},0.10733373542389857,0]
[]
[]
[null,"Bundled Residential Monthly Average Bills"]
[null,null,null,{"$f":"$D$24","v":"2025-01-01"},{"$f":"$E$24","v":"2025-11-15"},{"$f":"$F$24","v":"Proposed"},{"$f":"$G$24","v":"% Change over 1/1/2025"},"% Change over Current"]
[null,"Essential Use (Basic) - Non-CARE",null,{"$f":"((D59*4)+(D66*8))/12","v":129.72997977466665},147.10950726866665,147.10950726866665,{"$f":"$F52/D52-1","v":0.13396693288773509},0]
[null,"Essential Use (Basic) - CARE",null,77.884621844666682,83.844208941666665,83.844208941666665,7.6518148972794631E-2,0]
[null,"Essential Use (All-Electric) - Non-CARE",null,127.70372090266669,145.16878100066666,145.16878100066666,0.13676234313729596,0]
[null,"Essential Use (All-Electric) - CARE",null,{"$f":"((D62*4)+(D69*8))/12","v":76.614529592666699},{"$f":"((E62*4)+(E69*8))/12","v":82.565174091666663},{"$f":"((F62*4)+(F69*8))/12","v":82.565174091666663},7.7669921497103944E-2,0]
[]
[null,"Bundled Residential Monthly Average Bills - Summer"]
[null,null,null,{"$f":"$D$24","v":"2025-01-01"},{"$f":"$E$24","v":"2025-11-15"},{"$f":"$F$24","v":"Proposed"},{"$f":"$G$24","v":"% Change over 1/1/2025"},"% Change over Current"]
[null,"Essential Use (Basic) - Non-CARE",null,{"$f":"VLOOKUP($D$4,'Res Bill Impact (2)'!$J$37:$P$46,2,FALSE)","v":162.82554135066664},{"$f":"VLOOKUP($D$4,'Res Bill Impact (2)'!$J$37:$P$46,4,FALSE)","v":178.80803631266664},{"$f":"VLOOKUP($D$4,'Res Bill Impact (2)'!$J$37:$P$46,6,FALSE)","v":178.80803631266664},{"$f":"$F59/D59-1","v":9.8157173803461006E-2},0]
[null,"Essential Use (Basic) - CARE",null,{"$f":"VLOOKUP($D$4,'Res Bill Impact (2)'!$R$37:$X$46,2,FALSE)","v":98.629461960666674},{"$f":"VLOOKUP($D$4,'Res Bill Impact (2)'!$R$37:$X$46,4,FALSE)","v":104.73511149166666},{"$f":"VLOOKUP($D$4,'Res Bill Impact (2)'!$R$37:$X$46,6,FALSE)","v":104.73511149166666},6.1904925867231286E-2,0]
[null,"Essential Use (All-Electric) - Non-CARE",null,{"$f":"VLOOKUP($D$4,'Res Bill Impact (2)'!$J$52:$P$61,2,FALSE)","v":118.24784616666668},{"$f":"VLOOKUP($D$4,'Res Bill Impact (2)'!$J$52:$P$61,4,FALSE)","v":136.11205841666666},{"$f":"VLOOKUP($D$4,'Res Bill Impact (2)'!$J$52:$P$61,6,FALSE)","v":136.11205841666666},0.15107431407098049,0]
[null,"Essential Use (All-Electric) - CARE",null,{"$f":"VLOOKUP($D$4,'Res Bill Impact (2)'!$R$52:$X$61,2,FALSE)","v":70.687432416666681},{"$f":"VLOOKUP($D$4,'Res Bill Impact (2)'!$R$52:$X$61,4,FALSE)","v":76.596344791666667},{"$f":"VLOOKUP($D$4,'Res Bill Impact (2)'!$R$52:$X$61,6,FALSE)","v":76.596344791666667},8.3592120593232622E-2,0]
[]
[null,"Bundled Residential Monthly Average Bills - Winter"]
[null,null,null,{"$f":"$D$24","v":"2025-01-01"},{"$f":"$E$24","v":"2025-11-15"},{"$f":"$F$24","v":"Proposed"},{"$f":"$G$24","v":"% Change over 1/1/2025"},"% Change over Current"]
[null,"Essential Use (Basic) - Non-CARE",null,{"$f":"VLOOKUP($D$4,'Res Bill Impact (2)'!$J$37:$P$46,3,FALSE)","v":113.18219898666668},{"$f":"VLOOKUP($D$4,'Res Bill Impact (2)'!$J$37:$P$46,5,FALSE)","v":131.26024274666665},{"$f":"VLOOKUP($D$4,'Res Bill Impact (2)'!$J$37:$P$46,7,FALSE)","v":131.26024274666665},{"$f":"$F66/D66-1","v":0.15972515043756697},0]
[null,"Essential Use (Basic) - CARE",null,{"$f":"VLOOKUP($D$4,'Res Bill Impact (2)'!$R$37:$X$46,3,FALSE)","v":67.512201786666679},{"$f":"VLOOKUP($D$4,'Res Bill Impact (2)'!$R$37:$X$46,5,FALSE)","v":73.398757666666668},{"$f":"VLOOKUP($D$4,'Res Bill Impact (2)'!$R$37:$X$46,7,FALSE)","v":73.398757666666668},8.719247371906258E-2,0]
[null,"Essential Use (All-Electric) - Non-CARE",null,{"$f":"VLOOKUP($D$4,'Res Bill Impact (2)'!$J$52:$P$61,3,FALSE)","v":132.43165827066667},{"$f":"VLOOKUP($D$4,'Res Bill Impact (2)'!$J$52:$P$61,5,FALSE)","v":149.69714229266665},{"$f":"VLOOKUP($D$4,'Res Bill Impact (2)'!$J$52:$P$61,7,FALSE)","v":149.69714229266665},0.13037278432859623,0]
[null,"Essential Use (All-Electric) - CARE",null,{"$f":"VLOOKUP($D$4,'Res Bill Impact (2)'!$R$52:$X$61,3,FALSE)","v":79.578078180666694},{"$f":"VLOOKUP($D$4,'Res Bill Impact (2)'!$R$52:$X$61,5,FALSE)","v":85.549588741666668},{"$f":"VLOOKUP($D$4,'Res Bill Impact (2)'!$R$52:$X$61,7,FALSE)","v":85.549588741666668},7.5039642795127648E-2,0]
[]
[]
[null,"Bundled Residential Monthly Average Bills"]
[null,null,null,{"$f":"$D$24","v":"2025-01-01"},{"$f":"$E$24","v":"2025-11-15"},{"$f":"$F$24","v":"Proposed"},{"$f":"$G$24","v":"% Change over 1/1/2025"},"% Change over Current"]
[null,{"$f":"D5&\"kWh Monthly Usage - Non-CARE\"","v":"500kWh Monthly Usage - Non-CARE"},null,{"$f":"((D79*4)+(D84*8))/12","v":166.70811298666666},183.73048802666668,183.73048802666668,{"$f":"$F74/D74-1","v":0.10210885802157366},0]
[null,{"$f":"D5&\"kWh Monthly Usage - CARE\"","v":"500kWh Monthly Usage - CARE"},null,101.47539544000001,108.12917858666667,108.12917858666667,6.5570408647491973E-2,0]
[]
[null,"Bundled Residential Monthly Average Bills - Summer"]
[null,null,null,{"$f":"$D$24","v":"2025-01-01"},{"$f":"$E$24","v":"2025-11-15"},{"$f":"$F$24","v":"Proposed"},{"$f":"$G$24","v":"% Change over 1/1/2025"},"% Change over Current"]
[null,{"$f":"D5&\"kWh Monthly Usage - Non-CARE\"","v":"500kWh Monthly Usage - Non-CARE"},null,{"$f":"VLOOKUP($D$4,'Res Bill Impact (2)'!$J$67:$P$76,2,FALSE)","v":158.14666666666665},{"$f":"VLOOKUP($D$4,'Res Bill Impact (2)'!$J$67:$P$76,4,FALSE)","v":174.32666666666665},{"$f":"VLOOKUP($D$4,'Res Bill Impact (2)'!$J$67:$P$76,6,FALSE)","v":174.32666666666665},{"$f":"$F79/D79-1","v":0.10231009189781637},0]
[null,{"$f":"D5&\"kWh Monthly Usage - CARE\"","v":"500kWh Monthly Usage - CARE"},null,{"$f":"VLOOKUP($D$4,'Res Bill Impact (2)'!$R$67:$X$76,2,FALSE)","v":95.696666666666687},{"$f":"VLOOKUP($D$4,'Res Bill Impact (2)'!$R$67:$X$76,4,FALSE)","v":101.78166666666667},{"$f":"VLOOKUP($D$4,'Res Bill Impact (2)'!$R$67:$X$76,6,FALSE)","v":101.78166666666667},6.3586331812323538E-2,0]
[]
[null,"Bundled Residential Monthly Average Bills - Winter"]
[null,null,null,{"$f":"$D$24","v":"2025-01-01"},{"$f":"$E$24","v":"2025-11-15"},{"$f":"$F$24","v":"Proposed"},{"$f":"$G$24","v":"% Change over 1/1/2025"},"% Change over Current"]
[null,{"$f":"D5&\"kWh Monthly Usage - Non-CARE\"","v":"500kWh Monthly Usage - Non-CARE"},null,{"$f":"VLOOKUP($D$4,'Res Bill Impact (2)'!$J$67:$P$76,3,FALSE)","v":170.98883614666667},{"$f":"VLOOKUP($D$4,'Res Bill Impact (2)'!$J$67:$P$76,5,FALSE)","v":188.43239870666667},{"$f":"VLOOKUP($D$4,'Res Bill Impact (2)'!$J$67:$P$76,7,FALSE)","v":188.43239870666667},{"$f":"$F84/D84-1","v":0.10201579794974269},0]
[null,{"$f":"D5&\"kWh Monthly Usage - CARE\"","v":"500kWh Monthly Usage - CARE"},null,{"$f":"VLOOKUP($D$4,'Res Bill Impact (2)'!$R$67:$X$76,3,FALSE)","v":104.36475982666667},{"$f":"VLOOKUP($D$4,'Res Bill Impact (2)'!$R$67:$X$76,5,FALSE)","v":111.30293454666668},{"$f":"VLOOKUP($D$4,'Res Bill Impact (2)'!$R$67:$X$76,7,FALSE)","v":111.30293454666668},6.6480052572565729E-2,0]
[]
[]
[null,"Bundled Residential Monthly Average Bills"]
[null,null,null,{"$f":"$D$24","v":"2025-01-01"},{"$f":"$E$24","v":"2025-11-15"},"Proposed",{"$f":"$G$24","v":"% Change over 1/1/2025"},"% Change over Current"]
[null,"All-Electric - Non-CARE",null,{"$f":"((D96*4)+(D102*8))/12","v":139.73811524275743},157.36670238301022,157.36670238301022,{"$f":"$F90/D90-1","v":0.12615446479743819},0]
[null,"All-Electric - CARE",null,81.865819568528522,88.107318013380606,88.107318013380606,7.624059073429823E-2,0]
[null,"All-Electric - Total",null,119.48281175677732,133.12591785363986,133.12591785363986,0.11418467557187095,0]
[]
[null,"Bundled Residential Monthly Average Bills - Summer"]
[null,null,null,{"$f":"$D$24","v":"2025-01-01"},{"$f":"$E$24","v":"2025-11-15"},"Proposed",{"$f":"$G$24","v":"% Change over 1/1/2025"},"% Change over Current"]
[null,"All-Electric - Non-CARE",null,{"$f":"VLOOKUP($D$4,'Res Bill Impact (2)'!$B$67:$H$76,2,FALSE)","v":182.74270527969233},{"$f":"VLOOKUP($D$4,'Res Bill Impact (2)'!$B$67:$H$76,4,FALSE)","v":199.89902692033894},{"$f":"VLOOKUP($D$4,'Res Bill Impact (2)'!$B$67:$H$76,6,FALSE)","v":199.89902692033894},{"$f":"$F96/D96-1","v":9.3882388434539221E-2},0]
[null,"All-Electric - CARE",null,{"$f":"VLOOKUP($D$4,'Res Bill Impact (2)'!$B$82:$H$91,2,FALSE)","v":106.12090488259082},{"$f":"VLOOKUP($D$4,'Res Bill Impact (2)'!$B$82:$H$91,4,FALSE)","v":113.04094129330475},{"$f":"VLOOKUP($D$4,'Res Bill Impact (2)'!$B$82:$H$91,6,FALSE)","v":113.04094129330475},6.5208984208814158E-2,0]
[null,"All-Electric - Total",null,{"$f":"D96*0.65+D97*0.35","v":155.92507514070681},{"$f":"E96*0.65+E97*0.35","v":169.49869695087699},{"$f":"F96*0.65+F97*0.35","v":169.49869695087699},8.7052206310763935E-2,0]
[]
[null,"Bundled Residential Monthly Average Bills - Winter"]
[null,null,null,{"$f":"$D$24","v":"2025-01-01"},{"$f":"$E$24","v":"2025-11-15"},"Proposed",{"$f":"$G$24","v":"% Change over 1/1/2025"},"% Change over Current"]
[null,"All-Electric - Non-CARE",null,{"$f":"VLOOKUP($D$4,'Res Bill Impact (2)'!$B$67:$H$76,3,FALSE)","v":118.23582022428999},{"$f":"VLOOKUP($D$4,'Res Bill Impact (2)'!$B$67:$H$76,5,FALSE)","v":136.10054011434588},{"$f":"VLOOKUP($D$4,'Res Bill Impact (2)'!$B$67:$H$76,7,FALSE)","v":136.10054011434588},{"$f":"$F102/D102-1","v":0.15109397351975917},0]
[null,"All-Electric - CARE",null,{"$f":"VLOOKUP($D$4,'Res Bill Impact (2)'!$B$82:$H$91,3,FALSE)","v":69.738276911497366},{"$f":"VLOOKUP($D$4,'Res Bill Impact (2)'!$B$82:$H$91,5,FALSE)","v":75.640506373418518},{"$f":"VLOOKUP($D$4,'Res Bill Impact (2)'!$B$82:$H$91,7,FALSE)","v":75.640506373418518},8.4634001918508561E-2,0]
[null,"All-Electric - Total",null,{"$f":"D102*0.65+D103*0.35","v":101.26168006481257},{"$f":"E102*0.65+E103*0.35","v":114.93952830502131},{"$f":"F102*0.65+F103*0.35","v":114.93952830502131},0.13507427717428988,0]
[]
[null,"Small Commercial Monthly Average Bills"]
[null,null,null,{"$f":"$D$24","v":"2025-01-01"},{"$f":"$E$24","v":"2025-11-15"},"Proposed",{"$f":"$G$24","v":"% Change over 1/1/2025"},"% Change over Current"]
[null,"NAICS 531",null,{"$f":"((D114*4)+(D120*8))/12","v":200.01926318686915},218.97116877072119,218.97116877072128,{"$f":"$F108/D108-1","v":9.475040194576767E-2},{"$f":"$F108/E108-1","v":0}]
[null,"NAICS 621",null,276.15071000888247,302.60796377198847,302.60796377198852,9.5807299435352045E-2,0]
[null,"NAICS 722",null,798.56103234169098,879.28982265194372,879.28982265194406,0.10109282451902879,0]
[]
[null,"Small Commercial Monthly Average Bills - Summer"]
[null,null,null,{"$f":"$D$24","v":"2025-01-01"},{"$f":"$E$24","v":"2025-11-15"},"Proposed",{"$f":"$G$24","v":"% Change over 1/1/2025"},"% Change over Current"]
[null,"NAICS 531",null,{"$f":"'Bill Impact (GS1) (2)'!C37","v":221.67376357053666},{"$f":"'Bill Impact (GS1) (2)'!E37","v":244.01758868702501},{"$f":"'Bill Impact (GS1) (2)'!G37","v":244.01758868702504},{"$f":"$F114/D114-1","v":0.10079598395675071},{"$f":"$F114/E114-1","v":0}]
[null,"NAICS 621",null,{"$f":"'Bill Impact (GS1) (2)'!C38","v":369.4697689996658},{"$f":"'Bill Impact (GS1) (2)'!E38","v":408.18922386145016},{"$f":"'Bill Impact (GS1) (2)'!G38","v":408.18922386145016},0.10479735586112149,0]
[null,"NAICS 722",null,{"$f":"'Bill Impact (GS1) (2)'!C39","v":1048.7876611703905},{"$f":"'Bill Impact (GS1) (2)'!E39","v":1162.6425736294943},{"$f":"'Bill Impact (GS1) (2)'!G39","v":1162.6425736294946},0.10855859262498191,0]
[]
[null,"Small Commercial Monthly Average Bills - Winter"]
[null,null,null,{"$f":"$D$24","v":"2025-01-01"},{"$f":"$E$24","v":"2025-11-15"},"Proposed",{"$f":"$G$24","v":"% Change over 1/1/2025"},"% Change over Current"]
[null,"NAICS 531",null,{"$f":"'Bill Impact (GS1) (2)'!D37","v":189.19201299503538},{"$f":"'Bill Impact (GS1) (2)'!F37","v":206.44795881256928},{"$f":"'Bill Impact (GS1) (2)'!H37","v":206.44795881256937},{"$f":"$F120/D120-1","v":9.1208637956544214E-2},{"$f":"$F120/E120-1","v":0}]
[null,"NAICS 621",null,{"$f":"'Bill Impact (GS1) (2)'!D38","v":229.4911805134908},{"$f":"'Bill Impact (GS1) (2)'!F38","v":249.81733372725762},{"$f":"'Bill Impact (GS1) (2)'!H38","v":249.81733372725768},8.8570520088339544E-2,0]
[null,"NAICS 722",null,{"$f":"'Bill Impact (GS1) (2)'!D39","v":673.44771792734139},{"$f":"'Bill Impact (GS1) (2)'!F39","v":737.61344716316853},{"$f":"'Bill Impact (GS1) (2)'!H39","v":737.61344716316864},9.5279451585802422E-2,0]

{"sheet":"SAR and RAR (2)","index":9,"n_rows":25,"n_cols":23,"rows_kept":25,"cut":false,"hidden":true,"merged":[[0,1,0,21],[45,17,45,18],[3,5,3,14],[7,5,7,14],[13,5,13,15],[21,4,21,7],[21,12,21,15]]}
[null,"CONFIDENTIAL\nThis Excel Sheet Is Marked Confidential In Accordance With Applicable Law and Regulation.\nBasis for Confidentiality In Accompanying Confidentiality Declaration.\nPublic Disclosure Restricted."]
[null,null,"Revenue Change ($000)"]
[]
[null,"Generation",{"$f":"'Simple Bill Insert Calc (2)'!D8","v":0},null,null,"Allocation"]
[null,"Distribution",{"$f":"'Simple Bill Insert Calc (2)'!D9","v":0},null,null,"Generation","Distribution","NDC","PPPC","DCPP","NSGC","Transmission","TOTCA","GHG Rev","DWRBC","PUCRF","SECURITIZATION"]
[null,"Nuclear",{"$f":"'Simple Bill Insert Calc (2)'!D10","v":0},null,"Residential",{"$f":"'SAR and RAR'!G37","v":0.43353664097137312},0.4929724354318929,{"$f":"'SAR and RAR'!I37","v":0.3376537252060986},0.44907276802647744,{"$f":"'SAR and RAR'!K37","v":0.4505009853364747},{"$f":"'SAR and RAR'!L37","v":0.43823032581794397},{"$f":"'SAR and RAR'!M37","v":0.46381018246062999},{"$f":"'SAR and RAR'!N37","v":0.5669366333554875},{"$f":"'SAR and RAR'!O37","v":0.82642497364889311},{"$f":"'SAR and RAR'!P37","v":0.2594263611204975},{"$f":"'SAR and RAR'!Q37","v":0.33765372536611121},{"$f":"'SAR and RAR'!R37","v":0.36749008607402561}]
[null,"Public Purpose",{"$f":"'Simple Bill Insert Calc (2)'!D11","v":0}]
[null,"DCPP",{"$f":"'Simple Bill Insert Calc (2)'!D12","v":0},null,null,"Revenue Change ($000) - System"]
[null,"New System Gen",{"$f":"'Simple Bill Insert Calc (2)'!D13","v":0},null,null,"Generation","Distribution","NDC","PPPC","DCPP","NSGC","Transmission","TOTCA","GHG Rev","DWRBC","PUCRF","SECURITIZATION","Total","CARE Adj.",null,null,"% of CARE Sales (Bundled)",{"$f":"'SAR and RAR'!Q58","v":0.31283756928391171}]
[null,"FERC",{"$f":"'Simple Bill Insert Calc (2)'!D14","v":0},null,"Residential",{"$f":"F6*F11","v":0},0,0,0,0,0,0,0,0,0,0,{"$f":"Q6*Q11","v":0},{"$f":"SUM(F10:Q10)","v":0},{"$f":"(-W11+W14)","v":0},null,null,"CARE Effective Discount",{"$f":"'SAR and RAR'!X10","v":0.32500000000000001}]
[null,"TOTCA",{"$f":"'Simple Bill Insert Calc (2)'!D15","v":0},null,"Total System",{"$f":"C4","v":0},{"$f":"C5","v":0},{"$f":"C6","v":0},{"$f":"C7","v":0},{"$f":"C8","v":0},{"$f":"C9","v":0},{"$f":"C10","v":0},{"$f":"C11","v":0},{"$f":"C12","v":0},{"$f":"C13","v":0},{"$f":"C14","v":0},{"$f":"C15","v":0},{"$f":"SUM(F11:Q11)","v":0},0,null,null,"CARE Discounst",{"$f":"SUM(F10*F16/'SAR and RAR'!K58*'SAR and RAR'!O58,G10:M10,P10)*W9*W10","v":0}]
[null,"GHG Revenue",{"$f":"'Simple Bill Insert Calc (2)'!D16","v":0},null,null,null,null,null,null,null,null,null,null,null,null,null,null,null,null,null,null,"non-CARE Sales",{"$f":"'SAR and RAR'!G58","v":18361053.623393998}]
[null,"DWR",{"$f":"'Simple Bill Insert Calc (2)'!D17","v":0},null,null,null,null,null,null,null,null,null,null,null,null,null,null,null,null,null,null,"Total Sales (excl. CARE&SL)",{"$f":"'SAR and RAR'!G64","v":70344975.441687003}]
[null,"PUCRF",{"$f":"'Simple Bill Insert Calc (2)'!D18","v":0},null,null,"Revenue Split - Bundled",null,null,null,null,null,null,null,null,null,null,null,"Bundled Revenue Change",null,null,null,"Res CARE Surcharge",{"$f":"W11*W12/W13","v":0}]
[null,"SECURITIZATION",{"$f":"'Simple Bill Insert Calc (2)'!D19","v":0},null,null,"Generation","Distribution","NDC","PPPC","DCPP","NSGC","Transmission","TOTCA","GHG Rev","DWRBC","PUCRF","SECURITIZATION","Total"]
[null,"Total",{"$f":"SUM(C4:C15)","v":0},null,"Residential",{"$f":"'SAR and RAR'!G44","v":1.0345794207629018},{"$f":"'SAR and RAR'!H44","v":0.68268803963356428},{"$f":"'SAR and RAR'!I44","v":0.70119232776047224},{"$f":"'SAR and RAR'!J44","v":0.70119233211283682},{"$f":"'SAR and RAR'!K44","v":0.70119233209089205},{"$f":"'SAR and RAR'!L44","v":0.70119233209421095},{"$f":"'SAR and RAR'!M44","v":0.70119233209125587},{"$f":"'SAR and RAR'!N44","v":0.70119233042688878},{"$f":"'SAR and RAR'!O44","v":0.70657569996841219},{"$f":"'SAR and RAR'!P44","v":0.67088876526870445},{"$f":"'SAR and RAR'!Q44","v":0.70119233206503373},{"$f":"'SAR and RAR'!R44","v":0.6708887652086245},{"$f":"SUMPRODUCT(F10:Q10,F16:Q16)+S10*'SAR and RAR'!X15","v":0}]
[null,null,null,null,"Total System",{"$f":"'SAR and RAR'!G50","v":1.0300079979939982},{"$f":"'SAR and RAR'!H50","v":0.64971955806985959},{"$f":"'SAR and RAR'!I50","v":0.62830287983182231},{"$f":"'SAR and RAR'!J50","v":0.64289120974341818},{"$f":"'SAR and RAR'!K50","v":0.64095261765727696},{"$f":"'SAR and RAR'!L50","v":0.63866644750913237},{"$f":"'SAR and RAR'!M50","v":0.66417763828823584},{"$f":"'SAR and RAR'!N50","v":0.65322305642427669},{"$f":"'SAR and RAR'!O50","v":0.6916053708131884},{"$f":"'SAR and RAR'!P50","v":0.6118326262408581},{"$f":"'SAR and RAR'!Q50","v":0.6283028839215079},{"$f":"'SAR and RAR'!R50","v":0.62262350370857455},{"$f":"SUMPRODUCT(F11:Q11,F17:Q17)","v":0}]
[]
[null,null,null,null,null,null,null,null,null,null,null,null,null,null,null,null,null,{"$f":"N10*N16","v":0}]
[]
[]
[null,null,null,null,"Bundled",null,null,null,null,null,null,null,"System (Bundled and Unbundled)"]
[null,null,null,null,{"$f":"'Simple Bill Insert Calc (2)'!M4&\" Sales\"","v":"2025 Sales"},{"$f":"'SAR and RAR'!G27","v":"11/15/2025 Avg Rates"},"Proposed Avg Rates ","% Change ",null,null,null,null,{"$f":"'Simple Bill Insert Calc (2)'!M4&\" Sales\"","v":"2025 Sales"},{"$f":"'SAR and RAR'!O27","v":"11/15/2025 Avg Rates"},"Proposed Avg Rates ","% Change "]
[null,null,null,"Residential",{"$f":"'SAR and RAR'!K58","v":18735934.088574},{"$f":"IF('Simple Bill Insert Calc (2)'!$D$6=\"Y\",'SAR and RAR'!W32,'SAR and RAR'!X32)","v":35.260672614547445},{"$f":"R16/E24*100+F24","v":35.260672614547445},{"$f":"G24/F24-1","v":0},null,null,null,"Residential",{"$f":"'SAR and RAR'!O58","v":26720106.924734},{"$f":"IF('Simple Bill Insert Calc (2)'!$D$6=\"Y\",'SAR and RAR'!Z32,'SAR and RAR'!AA32)","v":31.475217358277142},{"$f":"SUM(R10:S10)/M24*100+N24","v":31.475217358277142},{"$f":"O24/N24-1","v":0}]
[null,null,null,"Total System",{"$f":"'SAR and RAR'!K64","v":49720524.250294097},{"$f":"IF('Simple Bill Insert Calc (2)'!$D$6=\"Y\",'SAR and RAR'!W33,'SAR and RAR'!X33)","v":30.163203046939159},{"$f":"R17/E25*100+F25","v":30.163203046939159},{"$f":"G25/F25-1","v":0},null,null,null,"Total System",{"$f":"'SAR and RAR'!O64","v":79134642.730374098},{"$f":"IF('Simple Bill Insert Calc (2)'!$D$6=\"Y\",'SAR and RAR'!Z33,'SAR and RAR'!AA33)","v":25.126029785552312},{"$f":"SUM(R11:S11)/M25*100+N25","v":25.126029785552312},{"$f":"O25/N25-1","v":0}]

{"sheet":"Res Bill Impact (2)","index":10,"n_rows":91,"n_cols":29,"rows_kept":91,"cut":false,"hidden":true,"merged":[[0,1,0,21],[64,18,64,19],[64,20,64,21],[64,22,64,23],[78,2,78,7],[64,10,64,11],[64,12,64,13],[64,14,64,15],[49,18,49,19],[49,20,49,21],[49,22,49,23],[34,18,34,19],[34,20,34,21],[34,22,34,23],[33,2,33,7],[33,10,33,15],[79,2,79,3],[79,4,79,5],[79,6,79,7],[64,2,64,3],[64,4,64,5],[64,6,64,7],[49,24,49,25],[63,2,63,7],[63,10,63,15],[63,18,63,23],[49,2,49,3],[49,4,49,5],[49,6,49,7],[49,10,49,11],[49,12,49,13],[49,14,49,15],[34,24,34,25],[48,2,48,7],[48,10,48,15],[48,18,48,23],[34,2,34,3],[34,4,34,5],[34,6,34,7],[34,10,34,11],[34,12,34,13],[34,14,34,15],[19,27,19,28],[20,15,20,16],[20,17,20,18],[20,23,20,24],[20,25,20,26],[33,18,33,23],[1,1,1,3],[2,4,2,7],[2,14,2,17],[19,8,19,9],[19,10,19,11],[19,19,19,20]]}
[null,"CONFIDENTIAL\nThis Excel Sheet Is Marked Confidential In Accordance With Applicable Law and Regulation.\nBasis for Confidentiality In Accompanying Confidentiality Declaration.\nPublic Disclosure Restricted."]
[]
[null,null,null,null,"Schedule D",null,null,null,null,null,null,null,null,null,"Schedule D-CARE"]
[null,null,null,null,{"$f":"'Simple Bill Insert Calc (2)'!M4","v":2025},{"$f":"'Simple Bill Insert Calc (2)'!M3","v":"2025-11-15"},"Proposed","Proposed",null,null,null,null,null,null,{"$f":"'Simple Bill Insert Calc (2)'!M4","v":2025},{"$f":"'Simple Bill Insert Calc (2)'!M3","v":"2025-11-15"},"Proposed","Proposed"]
[null,null,null,null,"Sales Forecast","Rates","Rates","Revenue",null,null,null,null,null,null,"Sales Forecast","Rates","Rates","Revenue"]
[]
[null,null,null,"Baseline - Summer",{"$f":"'Res Bill Impact'!F97","v":3085.6709369045998},{"$f":"'Res Bill Impact'!F7","v":0.31901999999999997},{"$f":"(V10-SUM(R14:R15,H14:H15))/SUM(SUM(E7:E8),F9/F7*SUM(E9:E10),F11/F7*SUM(E11:E12),SUM(O7:O8)*(1+(P7/F7-1)),SUM(O9:O10)*(1+(P9/F9-1))*F9/F7,SUM(O11:O12)*(1+(P11/F11-1))*F11/F7)","v":0.31901999999999997},{"$f":"E7*G7","v":984.39074229130529},null,null,null,null,null,"Baseline - Summer",{"$f":"'Res Bill Impact'!M97","v":1783.36012901},{"$f":"'Res Bill Impact'!P7","v":0.21024999999999999},{"$f":"G7*(1+(P7/F7-1))","v":0.21024999999999999},{"$f":"O7*Q7","v":374.95146712435252},null,null,"Bundled Residential Rev Req "]
[null,null,null,"- Winter",{"$f":"'Res Bill Impact'!F98","v":4290.2912726942004},{"$f":"'Res Bill Impact'!F8","v":0.31901999999999997},{"$f":"G7","v":0.31901999999999997},1368.6887218149036,null,null,null,null,null,"- Winter",{"$f":"'Res Bill Impact'!M98","v":2747.2776541200001},{"$f":"'Res Bill Impact'!P8","v":0.21024999999999999},0.21024999999999999,577.61512677872997,null,null,"Current",{"$f":"SUMPRODUCT(E7:E12,F7:F12)+SUMPRODUCT(O7:O12,P7:P12)+(E14*F14*365/12/10^6)+(E15*F15*365/12/10^6)+(O14*P14*365/12/10^6)+(O15*P15*365/12/10^6)","v":6662.8948821759823}]
[null,null,null,"101% - 400% of Baseline - Summer",{"$f":"'Res Bill Impact'!F99","v":1911.9288203185401},{"$f":"'Res Bill Impact'!F9","v":0.42351000000000005},{"$f":"F9/F$7*G$7","v":0.42351000000000005},809.72097469310506,null,null,null,null,null,"101% - 400% of Baseline - Summer",{"$f":"'Res Bill Impact'!M99","v":745.49075508300007},{"$f":"'Res Bill Impact'!P9","v":0.28078000000000003},0.28078000000000003,209.31889421220478,null,null,"Change",{"$f":"'SAR and RAR (2)'!R16/1000-'SAR and RAR (2)'!R19/1000","v":0}]
[null,null,null,"- Winter",{"$f":"'Res Bill Impact'!F100","v":2615.8042580374204},{"$f":"'Res Bill Impact'!F10","v":0.42351000000000005},{"$f":"G9","v":0.42351000000000005},1107.819261321428,null,null,null,null,null,"- Winter",{"$f":"'Res Bill Impact'!M100","v":1112.0237662050001},{"$f":"'Res Bill Impact'!P10","v":0.28078000000000003},0.28078000000000003,312.23403307503997,null,null,"Proposed Change",{"$f":"SUM(V8:V9)","v":6662.8948821759823}]
[null,null,null,"401% of Baseline - Summer",{"$f":"'Res Bill Impact'!F101","v":151.63255821328497},{"$f":"'Res Bill Impact'!F11","v":0.42351000000000005},{"$f":"F11/F$7*G$7","v":0.42351000000000005},64.217904728908323,null,null,null,null,null,"401% of Baseline - Summer",{"$f":"'Res Bill Impact'!M101","v":8.4770059659299992},{"$f":"'Res Bill Impact'!P11","v":0.28078000000000003},0.28078000000000003,2.3801737351138255,null,null,null,{"$f":"V10-SUM(H7:H15,R7:R15)","v":0}]
[null,null,null,"- Winter",{"$f":"'Res Bill Impact'!F102","v":262.89674742179903},{"$f":"'Res Bill Impact'!F12","v":0.42351000000000005},{"$f":"G11","v":0.42351000000000005},111.33940150060613,null,null,null,null,null,"- Winter",{"$f":"'Res Bill Impact'!M102","v":21.080184433099998},{"$f":"'Res Bill Impact'!P12","v":0.28078000000000003},0.28078000000000003,5.9188941851258177]
[]
[null,null,null,"Basic Charge - Single-Family Residence",{"$f":"'Res Bill Impact'!F104","v":18879671.950581908},{"$f":"'Res Bill Impact'!F14","v":0.79400000000000004},{"$f":"F14","v":0.79400000000000004},{"$f":"G14*E14*365/12/10^6","v":455.95981066651194},null,null,null,null,null,"Basic Charge - Single-Family Residence",{"$f":"'Res Bill Impact'!M104","v":6433922.1264425237},{"$f":"'Res Bill Impact'!P14","v":0.19699999999999998},{"$f":"P14","v":0.19699999999999998},{"$f":"Q14*O14*365/12/10^6","v":38.552597541820802}]
[null,null,null,"Basic Charge - Multi-Family Residence",{"$f":"'Res Bill Impact'!F105","v":8588406.5244109407},{"$f":"'Res Bill Impact'!F15","v":0.79400000000000004},{"$f":"F15","v":0.79400000000000004},{"$f":"G15*E15*365/12/10^6","v":207.41717456996128},null,null,null,null,null,"Basic Charge - Multi-Family Residence",{"$f":"'Res Bill Impact'!M105","v":5402078.3984754756},{"$f":"'Res Bill Impact'!P15","v":0.19699999999999998},{"$f":"P15","v":0.19699999999999998},{"$f":"Q15*O15*365/12/10^6","v":32.369703936864923}]
[]
[]
[]
[null,null,null,null,null,null,null,null,null,null,null,null,null,null,{"$f":"'Res Bill Impact'!O19","v":"2024 Recorded Data - Average Monthly Usage - kWh (Bundled / Basic Service Only)"},null,null,null,null,null,null,null,{"$f":"'Res Bill Impact'!W19","v":"2024 Recorded Data - Average Monthly Usage - kWh (Bundled / All Electric Only)"}]
[null,"SCHEDULE D RATES ($/kWh)",null,null,null,null,null,"MONTHLY BASELINE QUANTITIES ","BASIC",null,"ALL-ELECTRIC",null,null,null,"Climate Zone","Summer","Winter","Summer","Winter","Sample Population Weight",null,null,"Climate Zone","Summer","Winter","Summer","Winter","Sample Population Weight"]
[null,"Rates",{"$f":"'Res Bill Impact'!C21","v":"Jan 2025"},{"$f":"'Simple Bill Insert Calc (2)'!M3","v":"2025-11-15"},"Proposed",null,null,"Climate Zone","Summer","Winter","Summer","Winter",null,null,null,"Non-CARE",null,"CARE",null,"Non-CARE","CARE",null,null,"Non-CARE",null,"CARE",null,"Non-CARE","CARE"]
[null,"Tier 1",{"$f":"'Res Bill Impact'!C22","v":0.33307999999999999},{"$f":"F7","v":0.31901999999999997},{"$f":"G7","v":0.31901999999999997},null,null,"5 warm",517.08900000000006,559.67279999999994,511.00560000000007,821.25900000000001,null,null,"5 warm",{"$f":"'Res Bill Impact'!P22","v":395.55529958042644},{"$f":"'Res Bill Impact'!Q22","v":410.42554945678205},{"$f":"'Res Bill Impact'!R22","v":370.53825168728912},{"$f":"'Res Bill Impact'!S22","v":352.8129704971235},{"$f":"'Res Bill Impact'!T22","v":3.9155928697053841E-4},{"$f":"'Res Bill Impact'!U22","v":5.7807564213015281E-5},null,"5 warm",{"$f":"'Res Bill Impact'!X22","v":395.0513658458587},{"$f":"'Res Bill Impact'!Y22","v":472.35325238958472},{"$f":"'Res Bill Impact'!Z22","v":354.0301734758014},{"$f":"'Res Bill Impact'!AA22","v":430.04559863713803},{"$f":"'Res Bill Impact'!AB22","v":3.215327131817325E-4},{"$f":"'Res Bill Impact'!AC22","v":1.643349365119362E-4}]
[null,"Tier 2",{"$f":"'Res Bill Impact'!C23","v":0.42821000000000004},{"$f":"F9","v":0.42351000000000005},{"$f":"G9","v":0.42351000000000005},null,null,"6 cool",346.75380000000001,334.58699999999999,264.62790000000001,383.25420000000003,null,null,"6 cool",{"$f":"'Res Bill Impact'!P23","v":441.3631683257405},{"$f":"'Res Bill Impact'!Q23","v":378.59674258373866},{"$f":"'Res Bill Impact'!R23","v":403.43369325682596},{"$f":"'Res Bill Impact'!S23","v":346.7408462315413},{"$f":"'Res Bill Impact'!T23","v":0.17572854499831955},{"$f":"'Res Bill Impact'!U23","v":6.2419116029105173E-2},null,"6 cool",{"$f":"'Res Bill Impact'!X23","v":333.66647323508539},{"$f":"'Res Bill Impact'!Y23","v":330.28035093286309},{"$f":"'Res Bill Impact'!Z23","v":364.47932752853114},{"$f":"'Res Bill Impact'!AA23","v":373.63178411023063},{"$f":"'Res Bill Impact'!AB23","v":0.2756588648786491},{"$f":"'Res Bill Impact'!AC23","v":0.13365908169637478}]
[null,"HUC",{"$f":"'Res Bill Impact'!C24","v":0.42821000000000004},{"$f":"F11","v":0.42351000000000005},{"$f":"G11","v":0.42351000000000005},null,null,"8 cool",389.33760000000007,313.29510000000005,301.12830000000002,374.12910000000005,null,null,"8 cool",{"$f":"'Res Bill Impact'!P24","v":568.49757666034611},{"$f":"'Res Bill Impact'!Q24","v":397.6071314648305},{"$f":"'Res Bill Impact'!R24","v":503.08425275756883},{"$f":"'Res Bill Impact'!S24","v":372.82836323176218},{"$f":"'Res Bill Impact'!T24","v":0.22131365965449243},{"$f":"'Res Bill Impact'!U24","v":0.15534197836132338},null,"8 cool",{"$f":"'Res Bill Impact'!X24","v":395.58477080411035},{"$f":"'Res Bill Impact'!Y24","v":347.08625083905127},{"$f":"'Res Bill Impact'!Z24","v":414.41449435454166},{"$f":"'Res Bill Impact'!AA24","v":370.25346049642252},{"$f":"'Res Bill Impact'!AB24","v":0.23198030889315135},{"$f":"'Res Bill Impact'!AC24","v":0.1999079724355533}]
[null,"cust $ / Day",{"$f":"'Res Bill Impact'!C25","v":3.1E-2},null,null,null,null,"9 warm",514.04729999999995,365.00400000000002,380.21250000000003,422.79630000000003,null,null,"9 warm",{"$f":"'Res Bill Impact'!P25","v":736.18963415586904},{"$f":"'Res Bill Impact'!Q25","v":454.05427078978795},{"$f":"'Res Bill Impact'!R25","v":685.49662095013514},{"$f":"'Res Bill Impact'!S25","v":424.24463521296872},{"$f":"'Res Bill Impact'!T25","v":0.12758089234186171},{"$f":"'Res Bill Impact'!U25","v":9.4636576897113731E-2},null,"9 warm",{"$f":"'Res Bill Impact'!X25","v":530.82752326668151},{"$f":"'Res Bill Impact'!Y25","v":380.17639473286698},{"$f":"'Res Bill Impact'!Z25","v":510.01019392990275},{"$f":"'Res Bill Impact'!AA25","v":375.66630062664376},{"$f":"'Res Bill Impact'!AB25","v":8.053285731708669E-2},{"$f":"'Res Bill Impact'!AC25","v":8.2923408963923001E-2}]
[null,"SCHEDULE D-CARE RATES ($/kWh)",null,null,null,null,null,"10 hot (Sec 745)",587.04810000000009,368.04570000000001,483.63030000000003,498.83879999999999,null,null,"10 hot (Sec 745)",{"$f":"'Res Bill Impact'!P26","v":857.95266508501231},{"$f":"'Res Bill Impact'!Q26","v":482.03064366841272},{"$f":"'Res Bill Impact'!R26","v":918.40838713244773},{"$f":"'Res Bill Impact'!S26","v":499.65634147444479},{"$f":"'Res Bill Impact'!T26","v":0.3013940598280837},{"$f":"'Res Bill Impact'!U26","v":0.40756384006325269},null,"10 hot (Sec 745)",{"$f":"'Res Bill Impact'!X26","v":627.49530737764235},{"$f":"'Res Bill Impact'!Y26","v":427.10165059444233},{"$f":"'Res Bill Impact'!Z26","v":660.32599270553249},{"$f":"'Res Bill Impact'!AA26","v":426.1138274226762},{"$f":"'Res Bill Impact'!AB26","v":0.2614116394842172},{"$f":"'Res Bill Impact'!AC26","v":0.36724476045444088}]
[null,"Rates",{"$f":"C21","v":"Jan 2025"},{"$f":"D21","v":"2025-11-15"},"Proposed",null,null,"13 hot",675.25739999999996,371.0874,736.09140000000002,699.59100000000001,null,null,"13 hot",{"$f":"'Res Bill Impact'!P27","v":995.74128264417641},{"$f":"'Res Bill Impact'!Q27","v":488.35743854290962},{"$f":"'Res Bill Impact'!R27","v":1027.5349099558041},{"$f":"'Res Bill Impact'!S27","v":485.94231796326983},{"$f":"'Res Bill Impact'!T27","v":4.9594246688876777E-2},{"$f":"'Res Bill Impact'!U27","v":0.11295038619182414},null,"13 hot",{"$f":"'Res Bill Impact'!X27","v":965.98465049839115},{"$f":"'Res Bill Impact'!Y27","v":574.71502553014284},{"$f":"'Res Bill Impact'!Z27","v":962.90318583348392},{"$f":"'Res Bill Impact'!AA27","v":549.71683721023408},{"$f":"'Res Bill Impact'!AB27","v":3.1061168826849089E-2},{"$f":"'Res Bill Impact'!AC27","v":6.3783866691499505E-2}]
[null,"Tier 1",{"$f":"'Res Bill Impact'!C28","v":0.20878000000000002},{"$f":"P7","v":0.21024999999999999},{"$f":"Q7","v":0.21024999999999999},null,null,"14 hot",584.00639999999999,361.96230000000003,562.71450000000004,641.79870000000005,null,null,"14 hot",{"$f":"'Res Bill Impact'!P28","v":835.92203960332859},{"$f":"'Res Bill Impact'!Q28","v":473.45592997528871},{"$f":"'Res Bill Impact'!R28","v":933.15043284851527},{"$f":"'Res Bill Impact'!S28","v":527.57646017003469},{"$f":"'Res Bill Impact'!T28","v":6.2328624832907513E-2},{"$f":"'Res Bill Impact'!U28","v":0.1067631120608956},null,"14 hot",{"$f":"'Res Bill Impact'!X28","v":756.02111470919556},{"$f":"'Res Bill Impact'!Y28","v":556.70044270579149},{"$f":"'Res Bill Impact'!Z28","v":880.83999742829826},{"$f":"'Res Bill Impact'!AA28","v":657.7029793462965},{"$f":"'Res Bill Impact'!AB28","v":4.4371514419079085E-2},{"$f":"'Res Bill Impact'!AC28","v":7.0981736910722307E-2}]
[null,"Tier 2",{"$f":"'Res Bill Impact'!C29","v":0.27299000000000001},{"$f":"P9","v":0.28078000000000003},{"$f":"Q9","v":0.28078000000000003},null,null,"15 hot",1368.7650000000001,295.04489999999998,730.00800000000004,529.25580000000002,null,null,"15 hot",{"$f":"'Res Bill Impact'!P29","v":1219.3970032974962},{"$f":"'Res Bill Impact'!Q29","v":540.76602898777344},{"$f":"'Res Bill Impact'!R29","v":1360.5921700522649},{"$f":"'Res Bill Impact'!S29","v":535.57432934570591},{"$f":"'Res Bill Impact'!T29","v":3.2190524047722373E-2},{"$f":"'Res Bill Impact'!U29","v":3.5156322842192805E-2},null,"15 hot",{"$f":"'Res Bill Impact'!X29","v":924.96865072952824},{"$f":"'Res Bill Impact'!Y29","v":451.63651160207712},{"$f":"'Res Bill Impact'!Z29","v":1114.1968216909249},{"$f":"'Res Bill Impact'!AA29","v":520.30200944411388},{"$f":"'Res Bill Impact'!AB29","v":3.5080327741620745E-2},{"$f":"'Res Bill Impact'!AC29","v":5.0845229356793059E-2}]
[null,"HUC",{"$f":"'Res Bill Impact'!C30","v":0.27299000000000001},{"$f":"P11","v":0.28078000000000003},{"$f":"Q12","v":0.28078000000000003},null,null,"16 cool",447.12990000000002,377.17080000000004,410.62950000000001,705.67439999999999,null,null,"16 cool",{"$f":"'Res Bill Impact'!P30","v":565.1396541876444},{"$f":"'Res Bill Impact'!Q30","v":416.65972304105037},{"$f":"'Res Bill Impact'!R30","v":776.78834707242015},{"$f":"'Res Bill Impact'!S30","v":493.60376798148923},{"$f":"'Res Bill Impact'!T30","v":2.9477888320765366E-2},{"$f":"'Res Bill Impact'!U30","v":2.5110859990079476E-2},null,"16 cool",{"$f":"'Res Bill Impact'!X30","v":449.84711975668597},{"$f":"'Res Bill Impact'!Y30","v":538.66300522095594},{"$f":"'Res Bill Impact'!Z30","v":698.91873102585498},{"$f":"'Res Bill Impact'!AA30","v":570.11082737142226},{"$f":"'Res Bill Impact'!AB30","v":3.9581785726165004E-2},{"$f":"'Res Bill Impact'!AC30","v":3.048960855418123E-2}]
[null,"cust $ / Day",{"$f":"'Res Bill Impact'!C31","v":2.0999999999999998E-2}]
[null,null,null,null,null,null,null,null,null,null,null,null,null,"Daily to Monthly Conversion Factor",30.417000000000002]
[]
[null,null,"NON-CARE",null,null,null,null,null,null,null,"Essential Use (Basic) - Non-CARE",null,null,null,null,null,null,null,"Essential Use (Basic) - CARE"]
[null,null,{"$f":"C27","v":"Jan 2025"},null,{"$f":"D27","v":"2025-11-15"},null,{"$f":"E21","v":"Proposed"},null,null,null,{"$f":"C35","v":"Jan 2025"},null,{"$f":"E35","v":"2025-11-15"},null,{"$f":"G35","v":"Proposed"},null,null,null,{"$f":"K35","v":"Jan 2025"},null,{"$f":"M35","v":"2025-11-15"},null,{"$f":"O35","v":"Proposed"}]
[null,null,"Summer","Winter","Summer","Winter","Summer","Winter",null,null,"Summer","Winter","Summer","Winter","Summer","Winter",null,null,"Summer","Winter","Summer","Winter","Summer","Winter"]
[null,"5 warm",{"$f":"C$22*MIN(I22,P22)+IF(P22-I22>0,C$23*(P22-I22))+ROUND($C$25*365/12,2)+('Simple Bill Insert Calc (2)'!M17*2)/12","v":123.3582258509151},{"$f":"C$22*MIN(J22,Q22)+IF(Q22-J22>0,C$23*(Q22-J22))+ROUND($C$25*365/12,2)+('Simple Bill Insert Calc (2)'!M17*2)/12","v":128.31120867973161},{"$f":"D$22*MIN(I22,P22)+IF(P22-I22>0,D$23*(P22-I22))+ROUND($F$14*365/12,2)+('Simple Bill Insert Calc (2)'!M17*2)/12","v":141.0067183388143},{"$f":"D$22*MIN(J22,Q22)+IF(Q22-J22>0,D$23*(Q22-J22))+ROUND($F$14*365/12,2)+('Simple Bill Insert Calc (2)'!M17*2)/12","v":145.75062545436927},{"$f":"E$22*MIN(I22,P22)+IF(P22-I22>0,E$23*(P22-I22))+ROUND($F$14*365/12,2)+('Simple Bill Insert Calc (2)'!M17*2)/12","v":141.0067183388143},{"$f":"E$22*MIN(J22,Q22)+IF(Q22-J22>0,E$23*(Q22-J22))+ROUND($F$14*365/12,2)+('Simple Bill Insert Calc (2)'!M17*2)/12","v":145.75062545436927},null,"5 warm",{"$f":"C$22*I22+ROUND($C$25*365/12,2)+('Simple Bill Insert Calc (2)'!M17*2)/12","v":163.83867078666665},{"$f":"C$22*J22+ROUND($C$25*365/12,2)+('Simple Bill Insert Calc (2)'!M17*2)/12","v":178.02248289066662},{"$f":"D$22*I22+ROUND($F$14*365/12,2)+('Simple Bill Insert Calc (2)'!M17*2)/12","v":179.77839944666667},{"$f":"D$22*J22+ROUND($F$14*365/12,2)+('Simple Bill Insert Calc (2)'!M17*2)/12","v":193.36348332266664},{"$f":"E$22*I22+ROUND($F$14*365/12,2)+('Simple Bill Insert Calc (2)'!M17*2)/12","v":179.77839944666667},{"$f":"E$22*J22+ROUND($F$14*365/12,2)+('Simple Bill Insert Calc (2)'!M17*2)/12","v":193.36348332266664},null,"5 warm",{"$f":"C$28*I22+ROUND($C$31*365/12,2)+('Simple Bill Insert Calc (2)'!M17*2)/12","v":99.264508086666694},{"$f":"C$28*J22+ROUND($C$31*365/12,2)+('Simple Bill Insert Calc (2)'!M17*2)/12","v":108.15515385066666},{"$f":"D$28*I22+ROUND($P$14*365/12,2)+('Simple Bill Insert Calc (2)'!M17*2)/12","v":105.37462891666668},{"$f":"D$28*J22+ROUND($P$14*365/12,2)+('Simple Bill Insert Calc (2)'!M17*2)/12","v":114.32787286666665},{"$f":"E$28*I22+ROUND($P$14*365/12,2)+('Simple Bill Insert Calc (2)'!M17*2)/12","v":105.37462891666668},{"$f":"E$28*J22+ROUND($P$14*365/12,2)+('Simple Bill Insert Calc (2)'!M17*2)/12","v":114.32787286666665}]
[null,"6 cool",{"$f":"C$22*MIN(I23,P23)+IF(P23-I23>0,C$23*(P23-I23))+ROUND($C$25*365/12,2)+('Simple Bill Insert Calc (2)'!M17*2)/12","v":147.61609998143197},{"$f":"C$22*MIN(J23,Q23)+IF(Q23-J23>0,C$23*(Q23-J23))+ROUND($C$25*365/12,2)+('Simple Bill Insert Calc (2)'!M17*2)/12","v":121.89631649844939},{"$f":"D$22*MIN(I23,P23)+IF(P23-I23>0,D$23*(P23-I23))+ROUND($F$14*365/12,2)+('Simple Bill Insert Calc (2)'!M17*2)/12","v":165.50607752230101},{"$f":"D$22*MIN(J23,Q23)+IF(Q23-J23>0,D$23*(Q23-J23))+ROUND($F$14*365/12,2)+('Simple Bill Insert Calc (2)'!M17*2)/12","v":140.1951774883058},{"$f":"E$22*MIN(I23,P23)+IF(P23-I23>0,E$23*(P23-I23))+ROUND($F$14*365/12,2)+('Simple Bill Insert Calc (2)'!M17*2)/12","v":165.50607752230101},{"$f":"E$22*MIN(J23,Q23)+IF(Q23-J23>0,E$23*(Q23-J23))+ROUND($F$14*365/12,2)+('Simple Bill Insert Calc (2)'!M17*2)/12","v":140.1951774883058},null,"6 cool",{"$f":"C$22*I23+ROUND($C$25*365/12,2)+('Simple Bill Insert Calc (2)'!M17*2)/12","v":107.10342237066666},{"$f":"C$22*J23+ROUND($C$25*365/12,2)+('Simple Bill Insert Calc (2)'!M17*2)/12","v":103.05090462666666},{"$f":"D$22*I23+ROUND($F$14*365/12,2)+('Simple Bill Insert Calc (2)'!M17*2)/12","v":125.43806394266666},{"$f":"D$22*J23+ROUND($F$14*365/12,2)+('Simple Bill Insert Calc (2)'!M17*2)/12","v":121.55661140666665},{"$f":"E$22*I23+ROUND($F$14*365/12,2)+('Simple Bill Insert Calc (2)'!M17*2)/12","v":125.43806394266666},{"$f":"E$22*J23+ROUND($F$14*365/12,2)+('Simple Bill Insert Calc (2)'!M17*2)/12","v":121.55661140666665},null,"6 cool",{"$f":"C$28*I23+ROUND($C$31*365/12,2)+('Simple Bill Insert Calc (2)'!M17*2)/12","v":63.701925030666679},{"$f":"C$28*J23+ROUND($C$31*365/12,2)+('Simple Bill Insert Calc (2)'!M17*2)/12","v":61.161740526666669},{"$f":"D$28*I23+ROUND($P$14*365/12,2)+('Simple Bill Insert Calc (2)'!M17*2)/12","v":69.561653116666662},{"$f":"D$28*J23+ROUND($P$14*365/12,2)+('Simple Bill Insert Calc (2)'!M17*2)/12","v":67.003583416666658},{"$f":"E$28*I23+ROUND($P$14*365/12,2)+('Simple Bill Insert Calc (2)'!M17*2)/12","v":69.561653116666662},{"$f":"E$28*J23+ROUND($P$14*365/12,2)+('Simple Bill Insert Calc (2)'!M17*2)/12","v":67.003583416666658}]
[null,"8 cool",{"$f":"C$22*MIN(I24,P24)+IF(P24-I24>0,C$23*(P24-I24))+ROUND($C$25*365/12,2)+('Simple Bill Insert Calc (2)'!M17*2)/12","v":198.00532808039347},{"$f":"C$22*MIN(J24,Q24)+IF(Q24-J24>0,C$23*(Q24-J24))+ROUND($C$25*365/12,2)+('Simple Bill Insert Calc (2)'!M17*2)/12","v":132.06225356822173},{"$f":"D$22*MIN(I24,P24)+IF(P24-I24>0,D$23*(P24-I24))+ROUND($F$14*365/12,2)+('Simple Bill Insert Calc (2)'!M17*2)/12","v":214.89918953408983},{"$f":"D$22*MIN(J24,Q24)+IF(Q24-J24>0,D$23*(Q24-J24))+ROUND($F$14*365/12,2)+('Simple Bill Insert Calc (2)'!M17*2)/12","v":150.471057914337},{"$f":"E$22*MIN(I24,P24)+IF(P24-I24>0,E$23*(P24-I24))+ROUND($F$14*365/12,2)+('Simple Bill Insert Calc (2)'!M17*2)/12","v":214.89918953408983},{"$f":"E$22*MIN(J24,Q24)+IF(Q24-J24>0,E$23*(Q24-J24))+ROUND($F$14*365/12,2)+('Simple Bill Insert Calc (2)'!M17*2)/12","v":150.471057914337},null,"8 cool",{"$f":"C$22*I24+ROUND($C$25*365/12,2)+('Simple Bill Insert Calc (2)'!M17*2)/12","v":121.28723447466668},{"$f":"C$22*J24+ROUND($C$25*365/12,2)+('Simple Bill Insert Calc (2)'!M17*2)/12","v":95.95899857466668},{"$f":"D$22*I24+ROUND($F$14*365/12,2)+('Simple Bill Insert Calc (2)'!M17*2)/12","v":139.02314781866667},{"$f":"D$22*J24+ROUND($F$14*365/12,2)+('Simple Bill Insert Calc (2)'!M17*2)/12","v":114.76406946866668},{"$f":"E$22*I24+ROUND($F$14*365/12,2)+('Simple Bill Insert Calc (2)'!M17*2)/12","v":139.02314781866667},{"$f":"E$22*J24+ROUND($F$14*365/12,2)+('Simple Bill Insert Calc (2)'!M17*2)/12","v":114.76406946866668},null,"8 cool",{"$f":"C$28*I24+ROUND($C$31*365/12,2)+('Simple Bill Insert Calc (2)'!M17*2)/12","v":72.592570794666699},{"$f":"C$28*J24+ROUND($C$31*365/12,2)+('Simple Bill Insert Calc (2)'!M17*2)/12","v":56.716417644666684},{"$f":"D$28*I24+ROUND($P$14*365/12,2)+('Simple Bill Insert Calc (2)'!M17*2)/12","v":78.514897066666677},{"$f":"D$28*J24+ROUND($P$14*365/12,2)+('Simple Bill Insert Calc (2)'!M17*2)/12","v":62.526961441666664},{"$f":"E$28*I24+ROUND($P$14*365/12,2)+('Simple Bill Insert Calc (2)'!M17*2)/12","v":78.514897066666677},{"$f":"E$28*J24+ROUND($P$14*365/12,2)+('Simple Bill Insert Calc (2)'!M17*2)/12","v":62.526961441666664}]
[null,"9 warm",{"$f":"C$22*MIN(I25,P25)+IF(P25-I25>0,C$23*(P25-I25))+ROUND($C$25*365/12,2)+('Simple Bill Insert Calc (2)'!M17*2)/12","v":257.94911025955139},{"$f":"C$22*MIN(J25,Q25)+IF(Q25-J25>0,C$23*(Q25-J25))+ROUND($C$25*365/12,2)+('Simple Bill Insert Calc (2)'!M17*2)/12","v":151.31441544156175},{"$f":"D$22*MIN(I25,P25)+IF(P25-I25>0,D$23*(P25-I25))+ROUND($F$14*365/12,2)+('Simple Bill Insert Calc (2)'!M17*2)/12","v":272.88753625101879},{"$f":"D$22*MIN(J25,Q25)+IF(Q25-J25>0,D$23*(Q25-J25))+ROUND($F$14*365/12,2)+('Simple Bill Insert Calc (2)'!M17*2)/12","v":168.97392292884976},{"$f":"E$22*MIN(I25,P25)+IF(P25-I25>0,E$23*(P25-I25))+ROUND($F$14*365/12,2)+('Simple Bill Insert Calc (2)'!M17*2)/12","v":272.88753625101879},{"$f":"E$22*MIN(J25,Q25)+IF(Q25-J25>0,E$23*(Q25-J25))+ROUND($F$14*365/12,2)+('Simple Bill Insert Calc (2)'!M17*2)/12","v":168.97392292884976},null,"9 warm",{"$f":"C$22*I25+ROUND($C$25*365/12,2)+('Simple Bill Insert Calc (2)'!M17*2)/12","v":162.82554135066664},{"$f":"C$22*J25+ROUND($C$25*365/12,2)+('Simple Bill Insert Calc (2)'!M17*2)/12","v":113.18219898666668},{"$f":"D$22*I25+ROUND($F$14*365/12,2)+('Simple Bill Insert Calc (2)'!M17*2)/12","v":178.80803631266664},{"$f":"D$22*J25+ROUND($F$14*365/12,2)+('Simple Bill Insert Calc (2)'!M17*2)/12","v":131.26024274666665},{"$f":"E$22*I25+ROUND($F$14*365/12,2)+('Simple Bill Insert Calc (2)'!M17*2)/12","v":178.80803631266664},{"$f":"E$22*J25+ROUND($F$14*365/12,2)+('Simple Bill Insert Calc (2)'!M17*2)/12","v":131.26024274666665},null,"9 warm",{"$f":"C$28*I25+ROUND($C$31*365/12,2)+('Simple Bill Insert Calc (2)'!M17*2)/12","v":98.629461960666674},{"$f":"C$28*J25+ROUND($C$31*365/12,2)+('Simple Bill Insert Calc (2)'!M17*2)/12","v":67.512201786666679},{"$f":"D$28*I25+ROUND($P$14*365/12,2)+('Simple Bill Insert Calc (2)'!M17*2)/12","v":104.73511149166666},{"$f":"D$28*J25+ROUND($P$14*365/12,2)+('Simple Bill Insert Calc (2)'!M17*2)/12","v":73.398757666666668},{"$f":"E$28*I25+ROUND($P$14*365/12,2)+('Simple Bill Insert Calc (2)'!M17*2)/12","v":104.73511149166666},{"$f":"E$28*J25+ROUND($P$14*365/12,2)+('Simple Bill Insert Calc (2)'!M17*2)/12","v":73.398757666666668}]
[null,"10 hot (Sec 745)",{"$f":"C$22*MIN(I26,P26)+IF(P26-I26>0,C$23*(P26-I26))+ROUND($C$25*365/12,2)+('Simple Bill Insert Calc (2)'!M17*2)/12","v":303.14469162971977},{"$f":"C$22*MIN(J26,Q26)+IF(Q26-J26>0,C$23*(Q26-J26))+ROUND($C$25*365/12,2)+('Simple Bill Insert Calc (2)'!M17*2)/12","v":163.00482115091765},{"$f":"D$22*MIN(I26,P26)+IF(P26-I26>0,D$23*(P26-I26))+ROUND($F$14*365/12,2)+('Simple Bill Insert Calc (2)'!M17*2)/12","v":316.82754388782024},{"$f":"D$22*MIN(J26,Q26)+IF(Q26-J26>0,D$23*(Q26-J26))+ROUND($F$14*365/12,2)+('Simple Bill Insert Calc (2)'!M17*2)/12","v":180.50436937367613},{"$f":"E$22*MIN(I26,P26)+IF(P26-I26>0,E$23*(P26-I26))+ROUND($F$14*365/12,2)+('Simple Bill Insert Calc (2)'!M17*2)/12","v":316.82754388782024},{"$f":"E$22*MIN(J26,Q26)+IF(Q26-J26>0,E$23*(Q26-J26))+ROUND($F$14*365/12,2)+('Simple Bill Insert Calc (2)'!M17*2)/12","v":180.50436937367613},null,"10 hot (Sec 745)",{"$f":"C$22*I26+ROUND($C$25*365/12,2)+('Simple Bill Insert Calc (2)'!M17*2)/12","v":187.14064781466666},{"$f":"C$22*J26+ROUND($C$25*365/12,2)+('Simple Bill Insert Calc (2)'!M17*2)/12","v":114.19532842266666},{"$f":"D$22*I26+ROUND($F$14*365/12,2)+('Simple Bill Insert Calc (2)'!M17*2)/12","v":202.09675152866669},{"$f":"D$22*J26+ROUND($F$14*365/12,2)+('Simple Bill Insert Calc (2)'!M17*2)/12","v":132.23060588066664},{"$f":"E$22*I26+ROUND($F$14*365/12,2)+('Simple Bill Insert Calc (2)'!M17*2)/12","v":202.09675152866669},{"$f":"E$22*J26+ROUND($F$14*365/12,2)+('Simple Bill Insert Calc (2)'!M17*2)/12","v":132.23060588066664},null,"10 hot (Sec 745)",{"$f":"C$28*I26+ROUND($C$31*365/12,2)+('Simple Bill Insert Calc (2)'!M17*2)/12","v":113.8705689846667},{"$f":"C$28*J26+ROUND($C$31*365/12,2)+('Simple Bill Insert Calc (2)'!M17*2)/12","v":68.147247912666685},{"$f":"D$28*I26+ROUND($P$14*365/12,2)+('Simple Bill Insert Calc (2)'!M17*2)/12","v":120.0835296916667},{"$f":"D$28*J26+ROUND($P$14*365/12,2)+('Simple Bill Insert Calc (2)'!M17*2)/12","v":74.038275091666662},{"$f":"E$28*I26+ROUND($P$14*365/12,2)+('Simple Bill Insert Calc (2)'!M17*2)/12","v":120.0835296916667},{"$f":"E$28*J26+ROUND($P$14*365/12,2)+('Simple Bill Insert Calc (2)'!M17*2)/12","v":74.038275091666662}]
[null,"13 hot",{"$f":"C$22*MIN(I27,P27)+IF(P27-I27>0,C$23*(P27-I27))+ROUND($C$25*365/12,2)+('Simple Bill Insert Calc (2)'!M17*2)/12","v":353.75580484572947},{"$f":"C$22*MIN(J27,Q27)+IF(Q27-J27>0,C$23*(Q27-J27))+ROUND($C$25*365/12,2)+('Simple Bill Insert Calc (2)'!M17*2)/12","v":165.42466106312597},{"$f":"D$22*MIN(I27,P27)+IF(P27-I27>0,D$23*(P27-I27))+ROUND($F$14*365/12,2)+('Simple Bill Insert Calc (2)'!M17*2)/12","v":365.96541155330181},{"$f":"D$22*MIN(J27,Q27)+IF(Q27-J27>0,D$23*(Q27-J27))+ROUND($F$14*365/12,2)+('Simple Bill Insert Calc (2)'!M17*2)/12","v":182.86600303797431},{"$f":"E$22*MIN(I27,P27)+IF(P27-I27>0,E$23*(P27-I27))+ROUND($F$14*365/12,2)+('Simple Bill Insert Calc (2)'!M17*2)/12","v":365.96541155330181},{"$f":"E$22*MIN(J27,Q27)+IF(Q27-J27>0,E$23*(Q27-J27))+ROUND($F$14*365/12,2)+('Simple Bill Insert Calc (2)'!M17*2)/12","v":182.86600303797431},null,"13 hot",{"$f":"C$22*I27+ROUND($C$25*365/12,2)+('Simple Bill Insert Calc (2)'!M17*2)/12","v":216.52140145866665},{"$f":"C$22*J27+ROUND($C$25*365/12,2)+('Simple Bill Insert Calc (2)'!M17*2)/12","v":115.20845785866666},{"$f":"D$22*I27+ROUND($F$14*365/12,2)+('Simple Bill Insert Calc (2)'!M17*2)/12","v":230.23728241466662},{"$f":"D$22*J27+ROUND($F$14*365/12,2)+('Simple Bill Insert Calc (2)'!M17*2)/12","v":133.20096901466664},{"$f":"E$22*I27+ROUND($F$14*365/12,2)+('Simple Bill Insert Calc (2)'!M17*2)/12","v":230.23728241466662},{"$f":"E$22*J27+ROUND($F$14*365/12,2)+('Simple Bill Insert Calc (2)'!M17*2)/12","v":133.20096901466664},null,"13 hot",{"$f":"C$28*I27+ROUND($C$31*365/12,2)+('Simple Bill Insert Calc (2)'!M17*2)/12","v":132.28690663866664},{"$f":"C$28*J27+ROUND($C$31*365/12,2)+('Simple Bill Insert Calc (2)'!M17*2)/12","v":68.782294038666677},{"$f":"D$28*I27+ROUND($P$14*365/12,2)+('Simple Bill Insert Calc (2)'!M17*2)/12","v":138.62953501666667},{"$f":"D$28*J27+ROUND($P$14*365/12,2)+('Simple Bill Insert Calc (2)'!M17*2)/12","v":74.677792516666671},{"$f":"E$28*I27+ROUND($P$14*365/12,2)+('Simple Bill Insert Calc (2)'!M17*2)/12","v":138.62953501666667},{"$f":"E$28*J27+ROUND($P$14*365/12,2)+('Simple Bill Insert Calc (2)'!M17*2)/12","v":74.677792516666671}]
[null,"14 hot",{"$f":"C$22*MIN(I28,P28)+IF(P28-I28>0,C$23*(P28-I28))+ROUND($C$25*365/12,2)+('Simple Bill Insert Calc (2)'!M17*2)/12","v":294.000314413208},{"$f":"C$22*MIN(J28,Q28)+IF(Q28-J28>0,C$23*(Q28-J28))+ROUND($C$25*365/12,2)+('Simple Bill Insert Calc (2)'!M17*2)/12","v":159.91175684238502},{"$f":"D$22*MIN(I28,P28)+IF(P28-I28>0,D$23*(P28-I28))+ROUND($F$14*365/12,2)+('Simple Bill Insert Calc (2)'!M17*2)/12","v":307.81518092307232},{"$f":"D$22*MIN(J28,Q28)+IF(Q28-J28>0,D$23*(Q28-J28))+ROUND($F$14*365/12,2)+('Simple Bill Insert Calc (2)'!M17*2)/12","v":177.50854684350119},{"$f":"E$22*MIN(I28,P28)+IF(P28-I28>0,E$23*(P28-I28))+ROUND($F$14*365/12,2)+('Simple Bill Insert Calc (2)'!M17*2)/12","v":307.81518092307232},{"$f":"E$22*MIN(J28,Q28)+IF(Q28-J28>0,E$23*(Q28-J28))+ROUND($F$14*365/12,2)+('Simple Bill Insert Calc (2)'!M17*2)/12","v":177.50854684350119},null,"14 hot",{"$f":"C$22*I28+ROUND($C$25*365/12,2)+('Simple Bill Insert Calc (2)'!M17*2)/12","v":186.12751837866665},{"$f":"C$22*J28+ROUND($C$25*365/12,2)+('Simple Bill Insert Calc (2)'!M17*2)/12","v":112.16906955066668},{"$f":"D$22*I28+ROUND($F$14*365/12,2)+('Simple Bill Insert Calc (2)'!M17*2)/12","v":201.12638839466663},{"$f":"D$22*J28+ROUND($F$14*365/12,2)+('Simple Bill Insert Calc (2)'!M17*2)/12","v":130.28987961266665},{"$f":"E$22*I28+ROUND($F$14*365/12,2)+('Simple Bill Insert Calc (2)'!M17*2)/12","v":201.12638839466663},{"$f":"E$22*J28+ROUND($F$14*365/12,2)+('Simple Bill Insert Calc (2)'!M17*2)/12","v":130.28987961266665},null,"14 hot",{"$f":"C$28*I28+ROUND($C$31*365/12,2)+('Simple Bill Insert Calc (2)'!M17*2)/12","v":113.23552285866668},{"$f":"C$28*J28+ROUND($C$31*365/12,2)+('Simple Bill Insert Calc (2)'!M17*2)/12","v":66.877155660666688},{"$f":"D$28*I28+ROUND($P$14*365/12,2)+('Simple Bill Insert Calc (2)'!M17*2)/12","v":119.44401226666666},{"$f":"D$28*J28+ROUND($P$14*365/12,2)+('Simple Bill Insert Calc (2)'!M17*2)/12","v":72.759240241666674},{"$f":"E$28*I28+ROUND($P$14*365/12,2)+('Simple Bill Insert Calc (2)'!M17*2)/12","v":119.44401226666666},{"$f":"E$28*J28+ROUND($P$14*365/12,2)+('Simple Bill Insert Calc (2)'!M17*2)/12","v":72.759240241666674}]
[null,"15 hot",{"$f":"C$22*MIN(I29,P29)+IF(P29-I29>0,C$23*(P29-I29))+ROUND($C$25*365/12,2)+('Simple Bill Insert Calc (2)'!M17*2)/12","v":397.76342052499672},{"$f":"C$22*MIN(J29,Q29)+IF(Q29-J29>0,C$23*(Q29-J29))+ROUND($C$25*365/12,2)+('Simple Bill Insert Calc (2)'!M17*2)/12","v":195.10046660252115},{"$f":"D$22*MIN(I29,P29)+IF(P29-I29>0,D$23*(P29-I29))+ROUND($F$14*365/12,2)+('Simple Bill Insert Calc (2)'!M17*2)/12","v":403.82869865863387},{"$f":"D$22*MIN(J29,Q29)+IF(Q29-J29>0,D$23*(Q29-J29))+ROUND($F$14*365/12,2)+('Simple Bill Insert Calc (2)'!M17*2)/12","v":213.00724600227858},{"$f":"E$22*MIN(I29,P29)+IF(P29-I29>0,E$23*(P29-I29))+ROUND($F$14*365/12,2)+('Simple Bill Insert Calc (2)'!M17*2)/12","v":403.82869865863387},{"$f":"E$22*MIN(J29,Q29)+IF(Q29-J29>0,E$23*(Q29-J29))+ROUND($F$14*365/12,2)+('Simple Bill Insert Calc (2)'!M17*2)/12","v":213.00724600227858},null,"15 hot",{"$f":"C$22*I29+ROUND($C$25*365/12,2)+('Simple Bill Insert Calc (2)'!M17*2)/12","v":447.51491286666669},{"$f":"C$22*J29+ROUND($C$25*365/12,2)+('Simple Bill Insert Calc (2)'!M17*2)/12","v":89.880221958666667},{"$f":"D$22*I29+ROUND($F$14*365/12,2)+('Simple Bill Insert Calc (2)'!M17*2)/12","v":451.48007696666667},{"$f":"D$22*J29+ROUND($F$14*365/12,2)+('Simple Bill Insert Calc (2)'!M17*2)/12","v":108.94189066466664},{"$f":"E$22*I29+ROUND($F$14*365/12,2)+('Simple Bill Insert Calc (2)'!M17*2)/12","v":451.48007696666667},{"$f":"E$22*J29+ROUND($F$14*365/12,2)+('Simple Bill Insert Calc (2)'!M17*2)/12","v":108.94189066466664},null,"15 hot",{"$f":"C$28*I29+ROUND($C$31*365/12,2)+('Simple Bill Insert Calc (2)'!M17*2)/12","v":277.07742336666672},{"$f":"C$28*J29+ROUND($C$31*365/12,2)+('Simple Bill Insert Calc (2)'!M17*2)/12","v":52.90614088866667},{"$f":"D$28*I29+ROUND($P$14*365/12,2)+('Simple Bill Insert Calc (2)'!M17*2)/12","v":284.43950791666668},{"$f":"D$28*J29+ROUND($P$14*365/12,2)+('Simple Bill Insert Calc (2)'!M17*2)/12","v":58.689856891666658},{"$f":"E$28*I29+ROUND($P$14*365/12,2)+('Simple Bill Insert Calc (2)'!M17*2)/12","v":284.43950791666668},{"$f":"E$28*J29+ROUND($P$14*365/12,2)+('Simple Bill Insert Calc (2)'!M17*2)/12","v":58.689856891666658}]
[null,"16 cool",{"$f":"C$22*MIN(I30,P30)+IF(P30-I30>0,C$23*(P30-I30))+ROUND($C$25*365/12,2)+('Simple Bill Insert Calc (2)'!M17*2)/12","v":191.06965059935786},{"$f":"C$22*MIN(J30,Q30)+IF(Q30-J30>0,C$23*(Q30-J30))+ROUND($C$25*365/12,2)+('Simple Bill Insert Calc (2)'!M17*2)/12","v":134.14426846607483},{"$f":"D$22*MIN(I30,P30)+IF(P30-I30>0,D$23*(P30-I30))+ROUND($F$14*365/12,2)+('Simple Bill Insert Calc (2)'!M17*2)/12","v":207.43835836067592},{"$f":"D$22*MIN(J30,Q30)+IF(Q30-J30>0,D$23*(Q30-J30))+ROUND($F$14*365/12,2)+('Simple Bill Insert Calc (2)'!M17*2)/12","v":151.86564907978189},{"$f":"E$22*MIN(I30,P30)+IF(P30-I30>0,E$23*(P30-I30))+ROUND($F$14*365/12,2)+('Simple Bill Insert Calc (2)'!M17*2)/12","v":207.43835836067592},{"$f":"E$22*MIN(J30,Q30)+IF(Q30-J30>0,E$23*(Q30-J30))+ROUND($F$14*365/12,2)+('Simple Bill Insert Calc (2)'!M17*2)/12","v":151.86564907978189},null,"16 cool",{"$f":"C$22*I30+ROUND($C$25*365/12,2)+('Simple Bill Insert Calc (2)'!M17*2)/12","v":140.53669375866664},{"$f":"C$22*J30+ROUND($C$25*365/12,2)+('Simple Bill Insert Calc (2)'!M17*2)/12","v":117.23471673066668},{"$f":"D$22*I30+ROUND($F$14*365/12,2)+('Simple Bill Insert Calc (2)'!M17*2)/12","v":157.46004736466665},{"$f":"D$22*J30+ROUND($F$14*365/12,2)+('Simple Bill Insert Calc (2)'!M17*2)/12","v":135.14169528266666},{"$f":"E$22*I30+ROUND($F$14*365/12,2)+('Simple Bill Insert Calc (2)'!M17*2)/12","v":157.46004736466665},{"$f":"E$22*J30+ROUND($F$14*365/12,2)+('Simple Bill Insert Calc (2)'!M17*2)/12","v":135.14169528266666},null,"16 cool",{"$f":"C$28*I30+ROUND($C$31*365/12,2)+('Simple Bill Insert Calc (2)'!M17*2)/12","v":84.658447188666685},{"$f":"C$28*J30+ROUND($C$31*365/12,2)+('Simple Bill Insert Calc (2)'!M17*2)/12","v":70.052386290666689},{"$f":"D$28*I30+ROUND($P$14*365/12,2)+('Simple Bill Insert Calc (2)'!M17*2)/12","v":90.665728141666662},{"$f":"D$28*J30+ROUND($P$14*365/12,2)+('Simple Bill Insert Calc (2)'!M17*2)/12","v":75.956827366666673},{"$f":"E$28*I30+ROUND($P$14*365/12,2)+('Simple Bill Insert Calc (2)'!M17*2)/12","v":90.665728141666662},{"$f":"E$28*J30+ROUND($P$14*365/12,2)+('Simple Bill Insert Calc (2)'!M17*2)/12","v":75.956827366666673}]
[null,"ALL",{"$f":"SUMPRODUCT(C37:C45,$T$22:$T$30)","v":248.39076603342522},147.53746476255091,263.45443390195385,165.42191244251964,263.45443390195385,165.42191244251964,null,"ALL",{"$f":"SUMPRODUCT(K37:K45,$T$22:$T$30)","v":163.79206291629771},107.32755249629763,179.73375899150545,125.65273306923918,179.73375899150545,125.65273306923918,null,"ALL",{"$f":"SUMPRODUCT(S37:S45,$U$22:$U$30)","v":109.90021444919638},{"$f":"SUMPRODUCT(T37:T45,$U$22:$U$30)","v":65.325893184346199},116.08522026987039,71.197055474704385,116.08522026987039,71.197055474704385]
[]
[]
[null,null,"CARE",null,null,null,null,null,null,null,"Essential Use (All-Electric) - Non-CARE",null,null,null,null,null,null,null,"Essential Use (All-Electric) - CARE"]
[null,null,{"$f":"C27","v":"Jan 2025"},null,{"$f":"D27","v":"2025-11-15"},null,{"$f":"E27","v":"Proposed"},null,null,null,{"$f":"C50","v":"Jan 2025"},null,{"$f":"E50","v":"2025-11-15"},null,{"$f":"G50","v":"Proposed"},null,null,null,{"$f":"K50","v":"Jan 2025"},null,{"$f":"M50","v":"2025-11-15"},null,{"$f":"O50","v":"Proposed"}]
[null,null,"Summer","Winter","Summer","Winter","Summer","Winter",null,null,"Summer","Winter","Summer","Winter","Summer","Winter",null,null,"Summer","Winter","Summer","Winter","Summer","Winter"]
[null,"5 warm",{"$f":"C$28*MIN(I22,R22)+IF(R22-I22>0,C$29*(R22-I22))+ROUND($C$31*365/12,2)+('Simple Bill Insert Calc (2)'!M17*2)/12","v":68.667642853938901},{"$f":"C$28*MIN(J22,S22)+IF(S22-J22>0,C$29*(S22-J22))+ROUND($C$31*365/12,2)+('Simple Bill Insert Calc (2)'!M17*2)/12","v":64.966958647056117},{"$f":"D$28*MIN(I22,R22)+IF(R22-I22>0,D$29*(R22-I22))+ROUND($P$14*365/12,2)+('Simple Bill Insert Calc (2)'!M17*2)/12","v":74.562334083919197},{"$f":"D$28*MIN(J22,S22)+IF(S22-J22>0,D$29*(S22-J22))+ROUND($P$14*365/12,2)+('Simple Bill Insert Calc (2)'!M17*2)/12","v":70.835593713686876},{"$f":"E$28*MIN(I22,R22)+IF(R22-I22>0,E$29*(R22-I22))+ROUND($P$14*365/12,2)+('Simple Bill Insert Calc (2)'!M17*2)/12","v":74.562334083919197},{"$f":"E$28*MIN(J22,S22)+IF(S22-J22>0,E$29*(S22-J22))+ROUND($P$14*365/12,2)+('Simple Bill Insert Calc (2)'!M17*2)/12","v":70.835593713686876},null,"5 warm",{"$f":"C$22*K22+ROUND($C$25*365/12,2)+('Simple Bill Insert Calc (2)'!M17*2)/12","v":161.81241191466668},{"$f":"C$22*L22+ROUND($C$25*365/12,2)+('Simple Bill Insert Calc (2)'!M17*2)/12","v":265.15161438666667},{"$f":"D$22*K22+ROUND($F$14*365/12,2)+('Simple Bill Insert Calc (2)'!M17*2)/12","v":177.83767317866668},{"$f":"D$22*L22+ROUND($F$14*365/12,2)+('Simple Bill Insert Calc (2)'!M17*2)/12","v":276.81471284666662},{"$f":"E$22*K22+ROUND($F$14*365/12,2)+('Simple Bill Insert Calc (2)'!M17*2)/12","v":177.83767317866668},{"$f":"E$22*L22+ROUND($F$14*365/12,2)+('Simple Bill Insert Calc (2)'!M17*2)/12","v":276.81471284666662},null,"5 warm",{"$f":"C$28*K22+ROUND($C$31*365/12,2)+('Simple Bill Insert Calc (2)'!M17*2)/12","v":97.994415834666697},{"$f":"C$28*L22+ROUND($C$31*365/12,2)+('Simple Bill Insert Calc (2)'!M17*2)/12","v":162.76912068666667},{"$f":"D$28*K22+ROUND($P$14*365/12,2)+('Simple Bill Insert Calc (2)'!M17*2)/12","v":104.09559406666668},{"$f":"D$28*L22+ROUND($P$14*365/12,2)+('Simple Bill Insert Calc (2)'!M17*2)/12","v":169.32637141666666},{"$f":"E$28*K22+ROUND($P$14*365/12,2)+('Simple Bill Insert Calc (2)'!M17*2)/12","v":104.09559406666668},{"$f":"E$28*L22+ROUND($P$14*365/12,2)+('Simple Bill Insert Calc (2)'!M17*2)/12","v":169.32637141666666}]
[null,"6 cool",{"$f":"C$28*MIN(I23,R23)+IF(R23-I23>0,C$29*(R23-I23))+ROUND($C$31*365/12,2)+('Simple Bill Insert Calc (2)'!M17*2)/12","v":79.174969090847597},{"$f":"C$28*MIN(J23,S23)+IF(S23-J23>0,C$29*(S23-J23))+ROUND($C$31*365/12,2)+('Simple Bill Insert Calc (2)'!M17*2)/12","v":64.479619009415131},{"$f":"D$28*MIN(I23,R23)+IF(R23-I23>0,D$29*(R23-I23))+ROUND($P$14*365/12,2)+('Simple Bill Insert Calc (2)'!M17*2)/12","v":85.476233545318252},{"$f":"D$28*MIN(J23,S23)+IF(S23-J23>0,D$29*(S23-J23))+ROUND($P$14*365/12,2)+('Simple Bill Insert Calc (2)'!M17*2)/12","v":70.416140361558831},{"$f":"E$28*MIN(I23,R23)+IF(R23-I23>0,E$29*(R23-I23))+ROUND($P$14*365/12,2)+('Simple Bill Insert Calc (2)'!M17*2)/12","v":85.476233545318252},{"$f":"E$28*MIN(J23,S23)+IF(S23-J23>0,E$29*(S23-J23))+ROUND($P$14*365/12,2)+('Simple Bill Insert Calc (2)'!M17*2)/12","v":70.416140361558831},null,"6 cool",{"$f":"C$22*K23+ROUND($C$25*365/12,2)+('Simple Bill Insert Calc (2)'!M17*2)/12","v":79.748927598666668},{"$f":"C$22*L23+ROUND($C$25*365/12,2)+('Simple Bill Insert Calc (2)'!M17*2)/12","v":119.26097560266668},{"$f":"D$22*K23+ROUND($F$14*365/12,2)+('Simple Bill Insert Calc (2)'!M17*2)/12","v":99.238259324666657},{"$f":"D$22*L23+ROUND($F$14*365/12,2)+('Simple Bill Insert Calc (2)'!M17*2)/12","v":137.08242155066665},{"$f":"E$22*K23+ROUND($F$14*365/12,2)+('Simple Bill Insert Calc (2)'!M17*2)/12","v":99.238259324666657},{"$f":"E$22*L23+ROUND($F$14*365/12,2)+('Simple Bill Insert Calc (2)'!M17*2)/12","v":137.08242155066665},null,"6 cool",{"$f":"C$28*K23+ROUND($C$31*365/12,2)+('Simple Bill Insert Calc (2)'!M17*2)/12","v":46.555679628666674},{"$f":"C$28*L23+ROUND($C$31*365/12,2)+('Simple Bill Insert Calc (2)'!M17*2)/12","v":71.322478542666687},{"$f":"D$28*K23+ROUND($P$14*365/12,2)+('Simple Bill Insert Calc (2)'!M17*2)/12","v":52.294682641666668},{"$f":"D$28*L23+ROUND($P$14*365/12,2)+('Simple Bill Insert Calc (2)'!M17*2)/12","v":77.235862216666675},{"$f":"E$28*K23+ROUND($P$14*365/12,2)+('Simple Bill Insert Calc (2)'!M17*2)/12","v":52.294682641666668},{"$f":"E$28*L23+ROUND($P$14*365/12,2)+('Simple Bill Insert Calc (2)'!M17*2)/12","v":77.235862216666675}]
[null,"8 cool",{"$f":"C$28*MIN(I24,R24)+IF(R24-I24>0,C$29*(R24-I24))+ROUND($C$31*365/12,2)+('Simple Bill Insert Calc (2)'!M17*2)/12","v":103.6442695309554},{"$f":"C$28*MIN(J24,S24)+IF(S24-J24>0,C$29*(S24-J24))+ROUND($C$31*365/12,2)+('Simple Bill Insert Calc (2)'!M17*2)/12","v":72.968403174305436},{"$f":"D$28*MIN(I24,R24)+IF(R24-I24>0,D$29*(R24-I24))+ROUND($P$14*365/12,2)+('Simple Bill Insert Calc (2)'!M17*2)/12","v":110.45268222793683},{"$f":"D$28*MIN(J24,S24)+IF(S24-J24>0,D$29*(S24-J24))+ROUND($P$14*365/12,2)+('Simple Bill Insert Calc (2)'!M17*2)/12","v":79.242711091880849},{"$f":"E$28*MIN(I24,R24)+IF(R24-I24>0,E$29*(R24-I24))+ROUND($P$14*365/12,2)+('Simple Bill Insert Calc (2)'!M17*2)/12","v":110.45268222793683},{"$f":"E$28*MIN(J24,S24)+IF(S24-J24>0,E$29*(S24-J24))+ROUND($P$14*365/12,2)+('Simple Bill Insert Calc (2)'!M17*2)/12","v":79.242711091880849},null,"8 cool",{"$f":"C$22*K24+ROUND($C$25*365/12,2)+('Simple Bill Insert Calc (2)'!M17*2)/12","v":91.906480830666666},{"$f":"C$22*L24+ROUND($C$25*365/12,2)+('Simple Bill Insert Calc (2)'!M17*2)/12","v":116.22158729466668},{"$f":"D$22*K24+ROUND($F$14*365/12,2)+('Simple Bill Insert Calc (2)'!M17*2)/12","v":110.88261693266666},{"$f":"D$22*L24+ROUND($F$14*365/12,2)+('Simple Bill Insert Calc (2)'!M17*2)/12","v":134.17133214866666},{"$f":"E$22*K24+ROUND($F$14*365/12,2)+('Simple Bill Insert Calc (2)'!M17*2)/12","v":110.88261693266666},{"$f":"E$22*L24+ROUND($F$14*365/12,2)+('Simple Bill Insert Calc (2)'!M17*2)/12","v":134.17133214866666},null,"8 cool",{"$f":"C$28*K24+ROUND($C$31*365/12,2)+('Simple Bill Insert Calc (2)'!M17*2)/12","v":54.176233140666675},{"$f":"C$28*L24+ROUND($C$31*365/12,2)+('Simple Bill Insert Calc (2)'!M17*2)/12","v":69.417340164666697},{"$f":"D$28*K24+ROUND($P$14*365/12,2)+('Simple Bill Insert Calc (2)'!M17*2)/12","v":59.96889174166666},{"$f":"D$28*L24+ROUND($P$14*365/12,2)+('Simple Bill Insert Calc (2)'!M17*2)/12","v":75.317309941666679},{"$f":"E$28*K24+ROUND($P$14*365/12,2)+('Simple Bill Insert Calc (2)'!M17*2)/12","v":59.96889174166666},{"$f":"E$28*L24+ROUND($P$14*365/12,2)+('Simple Bill Insert Calc (2)'!M17*2)/12","v":75.317309941666679}]
[null,"9 warm",{"$f":"C$28*MIN(I25,R25)+IF(R25-I25>0,C$29*(R25-I25))+ROUND($C$31*365/12,2)+('Simple Bill Insert Calc (2)'!M17*2)/12","v":145.43341208684404},{"$f":"C$28*MIN(J25,S25)+IF(S25-J25>0,C$29*(S25-J25))+ROUND($C$31*365/12,2)+('Simple Bill Insert Calc (2)'!M17*2)/12","v":83.684302793455004},{"$f":"D$28*MIN(I25,R25)+IF(R25-I25>0,D$29*(R25-I25))+ROUND($P$14*365/12,2)+('Simple Bill Insert Calc (2)'!M17*2)/12","v":152.87465182804561},{"$f":"D$28*MIN(J25,S25)+IF(S25-J25>0,D$29*(S25-J25))+ROUND($P$14*365/12,2)+('Simple Bill Insert Calc (2)'!M17*2)/12","v":90.032343221764023},{"$f":"E$28*MIN(I25,R25)+IF(R25-I25>0,E$29*(R25-I25))+ROUND($P$14*365/12,2)+('Simple Bill Insert Calc (2)'!M17*2)/12","v":152.87465182804561},{"$f":"E$28*MIN(J25,S25)+IF(S25-J25>0,E$29*(S25-J25))+ROUND($P$14*365/12,2)+('Simple Bill Insert Calc (2)'!M17*2)/12","v":90.032343221764023},null,"9 warm",{"$f":"C$22*K25+ROUND($C$25*365/12,2)+('Simple Bill Insert Calc (2)'!M17*2)/12","v":118.24784616666668},{"$f":"C$22*L25+ROUND($C$25*365/12,2)+('Simple Bill Insert Calc (2)'!M17*2)/12","v":132.43165827066667},{"$f":"D$22*K25+ROUND($F$14*365/12,2)+('Simple Bill Insert Calc (2)'!M17*2)/12","v":136.11205841666666},{"$f":"D$22*L25+ROUND($F$14*365/12,2)+('Simple Bill Insert Calc (2)'!M17*2)/12","v":149.69714229266665},{"$f":"E$22*K25+ROUND($F$14*365/12,2)+('Simple Bill Insert Calc (2)'!M17*2)/12","v":136.11205841666666},{"$f":"E$22*L25+ROUND($F$14*365/12,2)+('Simple Bill Insert Calc (2)'!M17*2)/12","v":149.69714229266665},null,"9 warm",{"$f":"C$28*K25+ROUND($C$31*365/12,2)+('Simple Bill Insert Calc (2)'!M17*2)/12","v":70.687432416666681},{"$f":"C$28*L25+ROUND($C$31*365/12,2)+('Simple Bill Insert Calc (2)'!M17*2)/12","v":79.578078180666694},{"$f":"D$28*K25+ROUND($P$14*365/12,2)+('Simple Bill Insert Calc (2)'!M17*2)/12","v":76.596344791666667},{"$f":"D$28*L25+ROUND($P$14*365/12,2)+('Simple Bill Insert Calc (2)'!M17*2)/12","v":85.549588741666668},{"$f":"E$28*K25+ROUND($P$14*365/12,2)+('Simple Bill Insert Calc (2)'!M17*2)/12","v":76.596344791666667},{"$f":"E$28*L25+ROUND($P$14*365/12,2)+('Simple Bill Insert Calc (2)'!M17*2)/12","v":85.549588741666668}]
[null,"10 hot (Sec 745)",{"$f":"C$28*MIN(I26,R26)+IF(R26-I26>0,C$29*(R26-I26))+ROUND($C$31*365/12,2)+('Simple Bill Insert Calc (2)'!M17*2)/12","v":204.32861376895355},{"$f":"C$28*MIN(J26,S26)+IF(S26-J26>0,C$29*(S26-J26))+ROUND($C$31*365/12,2)+('Simple Bill Insert Calc (2)'!M17*2)/12","v":104.07563692877537},{"$f":"D$28*MIN(I26,R26)+IF(R26-I26>0,D$29*(R26-I26))+ROUND($P$14*365/12,2)+('Simple Bill Insert Calc (2)'!M17*2)/12","v":213.12287111271533},{"$f":"D$28*MIN(J26,S26)+IF(S26-J26>0,D$29*(S26-J26))+ROUND($P$14*365/12,2)+('Simple Bill Insert Calc (2)'!M17*2)/12","v":110.99191100486127},{"$f":"E$28*MIN(I26,R26)+IF(R26-I26>0,E$29*(R26-I26))+ROUND($P$14*365/12,2)+('Simple Bill Insert Calc (2)'!M17*2)/12","v":213.12287111271533},{"$f":"E$28*MIN(J26,S26)+IF(S26-J26>0,E$29*(S26-J26))+ROUND($P$14*365/12,2)+('Simple Bill Insert Calc (2)'!M17*2)/12","v":110.99191100486127},null,"10 hot (Sec 745)",{"$f":"C$22*K26+ROUND($C$25*365/12,2)+('Simple Bill Insert Calc (2)'!M17*2)/12","v":152.69424699066667},{"$f":"C$22*L26+ROUND($C$25*365/12,2)+('Simple Bill Insert Calc (2)'!M17*2)/12","v":157.75989417066666},{"$f":"D$22*K26+ROUND($F$14*365/12,2)+('Simple Bill Insert Calc (2)'!M17*2)/12","v":169.10440497266666},{"$f":"D$22*L26+ROUND($F$14*365/12,2)+('Simple Bill Insert Calc (2)'!M17*2)/12","v":173.95622064266664},{"$f":"E$22*K26+ROUND($F$14*365/12,2)+('Simple Bill Insert Calc (2)'!M17*2)/12","v":169.10440497266666},{"$f":"E$22*L26+ROUND($F$14*365/12,2)+('Simple Bill Insert Calc (2)'!M17*2)/12","v":173.95622064266664},null,"10 hot (Sec 745)",{"$f":"C$28*K26+ROUND($C$31*365/12,2)+('Simple Bill Insert Calc (2)'!M17*2)/12","v":92.279000700666685},{"$f":"C$28*L26+ROUND($C$31*365/12,2)+('Simple Bill Insert Calc (2)'!M17*2)/12","v":95.454231330666687},{"$f":"D$28*K26+ROUND($P$14*365/12,2)+('Simple Bill Insert Calc (2)'!M17*2)/12","v":98.339937241666675},{"$f":"D$28*L26+ROUND($P$14*365/12,2)+('Simple Bill Insert Calc (2)'!M17*2)/12","v":101.53752436666666},{"$f":"E$28*K26+ROUND($P$14*365/12,2)+('Simple Bill Insert Calc (2)'!M17*2)/12","v":98.339937241666675},{"$f":"E$28*L26+ROUND($P$14*365/12,2)+('Simple Bill Insert Calc (2)'!M17*2)/12","v":101.53752436666666}]
[null,"13 hot",{"$f":"C$28*MIN(I27,R27)+IF(R27-I27>0,C$29*(R27-I27))+ROUND($C$31*365/12,2)+('Simple Bill Insert Calc (2)'!M17*2)/12","v":228.45514408150163},{"$f":"C$28*MIN(J27,S27)+IF(S27-J27>0,C$29*(S27-J27))+ROUND($C$31*365/12,2)+('Simple Bill Insert Calc (2)'!M17*2)/12","v":100.13653809345971},{"$f":"D$28*MIN(I27,R27)+IF(R27-I27>0,D$29*(R27-I27))+ROUND($P$14*365/12,2)+('Simple Bill Insert Calc (2)'!M17*2)/12","v":237.54201426205736},{"$f":"D$28*MIN(J27,S27)+IF(S27-J27>0,D$29*(S27-J27))+ROUND($P$14*365/12,2)+('Simple Bill Insert Calc (2)'!M17*2)/12","v":106.92675638239358},{"$f":"E$28*MIN(I27,R27)+IF(R27-I27>0,E$29*(R27-I27))+ROUND($P$14*365/12,2)+('Simple Bill Insert Calc (2)'!M17*2)/12","v":237.54201426205736},{"$f":"E$28*MIN(J27,S27)+IF(S27-J27>0,E$29*(S27-J27))+ROUND($P$14*365/12,2)+('Simple Bill Insert Calc (2)'!M17*2)/12","v":106.92675638239358},null,"13 hot",{"$f":"C$22*K27+ROUND($C$25*365/12,2)+('Simple Bill Insert Calc (2)'!M17*2)/12","v":236.78399017866664},{"$f":"C$22*L27+ROUND($C$25*365/12,2)+('Simple Bill Insert Calc (2)'!M17*2)/12","v":224.62643694666664},{"$f":"D$22*K27+ROUND($F$14*365/12,2)+('Simple Bill Insert Calc (2)'!M17*2)/12","v":249.64454509466665},{"$f":"D$22*L27+ROUND($F$14*365/12,2)+('Simple Bill Insert Calc (2)'!M17*2)/12","v":238.00018748666665},{"$f":"E$22*K27+ROUND($F$14*365/12,2)+('Simple Bill Insert Calc (2)'!M17*2)/12","v":249.64454509466665},{"$f":"E$22*L27+ROUND($F$14*365/12,2)+('Simple Bill Insert Calc (2)'!M17*2)/12","v":238.00018748666665},null,"13 hot",{"$f":"C$28*K27+ROUND($C$31*365/12,2)+('Simple Bill Insert Calc (2)'!M17*2)/12","v":144.98782915866667},{"$f":"C$28*L27+ROUND($C$31*365/12,2)+('Simple Bill Insert Calc (2)'!M17*2)/12","v":137.36727564666666},{"$f":"D$28*K27+ROUND($P$14*365/12,2)+('Simple Bill Insert Calc (2)'!M17*2)/12","v":151.41988351666666},{"$f":"D$28*L27+ROUND($P$14*365/12,2)+('Simple Bill Insert Calc (2)'!M17*2)/12","v":143.74567441666667},{"$f":"E$28*K27+ROUND($P$14*365/12,2)+('Simple Bill Insert Calc (2)'!M17*2)/12","v":151.41988351666666},{"$f":"E$28*L27+ROUND($P$14*365/12,2)+('Simple Bill Insert Calc (2)'!M17*2)/12","v":143.74567441666667}]
[null,"14 hot",{"$f":"C$28*MIN(I28,R28)+IF(R28-I28>0,C$29*(R28-I28))+ROUND($C$31*365/12,2)+('Simple Bill Insert Calc (2)'!M17*2)/12","v":208.54835238598284},{"$f":"C$28*MIN(J28,S28)+IF(S28-J28>0,C$29*(S28-J28))+ROUND($C$31*365/12,2)+('Simple Bill Insert Calc (2)'!M17*2)/12","v":112.08816524548445},{"$f":"D$28*MIN(I28,R28)+IF(R28-I28>0,D$29*(R28-I28))+ROUND($P$14*365/12,2)+('Simple Bill Insert Calc (2)'!M17*2)/12","v":217.47667380987278},{"$f":"D$28*MIN(J28,S28)+IF(S28-J28>0,D$29*(S28-J28))+ROUND($P$14*365/12,2)+('Simple Bill Insert Calc (2)'!M17*2)/12","v":119.26038413420902},{"$f":"E$28*MIN(I28,R28)+IF(R28-I28>0,E$29*(R28-I28))+ROUND($P$14*365/12,2)+('Simple Bill Insert Calc (2)'!M17*2)/12","v":217.47667380987278},{"$f":"E$28*MIN(J28,S28)+IF(S28-J28>0,E$29*(S28-J28))+ROUND($P$14*365/12,2)+('Simple Bill Insert Calc (2)'!M17*2)/12","v":119.26038413420902},null,"14 hot",{"$f":"C$22*K28+ROUND($C$25*365/12,2)+('Simple Bill Insert Calc (2)'!M17*2)/12","v":179.03561232666667},{"$f":"C$22*L28+ROUND($C$25*365/12,2)+('Simple Bill Insert Calc (2)'!M17*2)/12","v":205.37697766266666},{"$f":"D$22*K28+ROUND($F$14*365/12,2)+('Simple Bill Insert Calc (2)'!M17*2)/12","v":194.33384645666666},{"$f":"D$22*L28+ROUND($F$14*365/12,2)+('Simple Bill Insert Calc (2)'!M17*2)/12","v":219.56328794066667},{"$f":"E$22*K28+ROUND($F$14*365/12,2)+('Simple Bill Insert Calc (2)'!M17*2)/12","v":194.33384645666666},{"$f":"E$22*L28+ROUND($F$14*365/12,2)+('Simple Bill Insert Calc (2)'!M17*2)/12","v":219.56328794066667},null,"14 hot",{"$f":"C$28*K28+ROUND($C$31*365/12,2)+('Simple Bill Insert Calc (2)'!M17*2)/12","v":108.7901999766667},{"$f":"C$28*L28+ROUND($C$31*365/12,2)+('Simple Bill Insert Calc (2)'!M17*2)/12","v":125.30139925266668},{"$f":"D$28*K28+ROUND($P$14*365/12,2)+('Simple Bill Insert Calc (2)'!M17*2)/12","v":114.96739029166667},{"$f":"D$28*L28+ROUND($P$14*365/12,2)+('Simple Bill Insert Calc (2)'!M17*2)/12","v":131.59484334166666},{"$f":"E$28*K28+ROUND($P$14*365/12,2)+('Simple Bill Insert Calc (2)'!M17*2)/12","v":114.96739029166667},{"$f":"E$28*L28+ROUND($P$14*365/12,2)+('Simple Bill Insert Calc (2)'!M17*2)/12","v":131.59484334166666}]
[null,"15 hot",{"$f":"C$28*MIN(I29,R29)+IF(R29-I29>0,C$29*(R29-I29))+ROUND($C$31*365/12,2)+('Simple Bill Insert Calc (2)'!M17*2)/12","v":275.37109993017856},{"$f":"C$28*MIN(J29,S29)+IF(S29-J29>0,C$29*(S29-J29))+ROUND($C$31*365/12,2)+('Simple Bill Insert Calc (2)'!M17*2)/12","v":118.56826980575093},{"$f":"D$28*MIN(I29,R29)+IF(R29-I29>0,D$29*(R29-I29))+ROUND($P$14*365/12,2)+('Simple Bill Insert Calc (2)'!M17*2)/12","v":282.72117042015537},{"$f":"D$28*MIN(J29,S29)+IF(S29-J29>0,D$29*(S29-J29))+ROUND($P$14*365/12,2)+('Simple Bill Insert Calc (2)'!M17*2)/12","v":126.22571006335399},{"$f":"E$28*MIN(I29,R29)+IF(R29-I29>0,E$29*(R29-I29))+ROUND($P$14*365/12,2)+('Simple Bill Insert Calc (2)'!M17*2)/12","v":282.72117042015537},{"$f":"E$28*MIN(J29,S29)+IF(S29-J29>0,E$29*(S29-J29))+ROUND($P$14*365/12,2)+('Simple Bill Insert Calc (2)'!M17*2)/12","v":126.22571006335399},null,"15 hot",{"$f":"C$22*K29+ROUND($C$25*365/12,2)+('Simple Bill Insert Calc (2)'!M17*2)/12","v":234.75773130666667},{"$f":"C$22*L29+ROUND($C$25*365/12,2)+('Simple Bill Insert Calc (2)'!M17*2)/12","v":167.89118853066665},{"$f":"D$22*K29+ROUND($F$14*365/12,2)+('Simple Bill Insert Calc (2)'!M17*2)/12","v":247.70381882666666},{"$f":"D$22*L29+ROUND($F$14*365/12,2)+('Simple Bill Insert Calc (2)'!M17*2)/12","v":183.65985198266665},{"$f":"E$22*K29+ROUND($F$14*365/12,2)+('Simple Bill Insert Calc (2)'!M17*2)/12","v":247.70381882666666},{"$f":"E$22*L29+ROUND($F$14*365/12,2)+('Simple Bill Insert Calc (2)'!M17*2)/12","v":183.65985198266665},null,"15 hot",{"$f":"C$28*K29+ROUND($C$31*365/12,2)+('Simple Bill Insert Calc (2)'!M17*2)/12","v":143.71773690666666},{"$f":"C$28*L29+ROUND($C$31*365/12,2)+('Simple Bill Insert Calc (2)'!M17*2)/12","v":101.80469259066669},{"$f":"D$28*K29+ROUND($P$14*365/12,2)+('Simple Bill Insert Calc (2)'!M17*2)/12","v":150.14084866666667},{"$f":"D$28*L29+ROUND($P$14*365/12,2)+('Simple Bill Insert Calc (2)'!M17*2)/12","v":107.93269861666667},{"$f":"E$28*K29+ROUND($P$14*365/12,2)+('Simple Bill Insert Calc (2)'!M17*2)/12","v":150.14084866666667},{"$f":"E$28*L29+ROUND($P$14*365/12,2)+('Simple Bill Insert Calc (2)'!M17*2)/12","v":107.93269861666667}]
[null,"16 cool",{"$f":"C$28*MIN(I30,R30)+IF(R30-I30>0,C$29*(R30-I30))+ROUND($C$31*365/12,2)+('Simple Bill Insert Calc (2)'!M17*2)/12","v":174.65190665496664},{"$f":"C$28*MIN(J30,S30)+IF(S30-J30>0,C$29*(S30-J30))+ROUND($C$31*365/12,2)+('Simple Bill Insert Calc (2)'!M17*2)/12","v":101.83742221993342},{"$f":"D$28*MIN(I30,R30)+IF(R30-I30>0,D$29*(R30-I30))+ROUND($P$14*365/12,2)+('Simple Bill Insert Calc (2)'!M17*2)/12","v":183.22722691066079},{"$f":"D$28*MIN(J30,S30)+IF(S30-J30>0,D$29*(S30-J30))+ROUND($P$14*365/12,2)+('Simple Bill Insert Calc (2)'!M17*2)/12","v":108.6488761165092},{"$f":"E$28*MIN(I30,R30)+IF(R30-I30>0,E$29*(R30-I30))+ROUND($P$14*365/12,2)+('Simple Bill Insert Calc (2)'!M17*2)/12","v":183.22722691066079},{"$f":"E$28*MIN(J30,S30)+IF(S30-J30>0,E$29*(S30-J30))+ROUND($P$14*365/12,2)+('Simple Bill Insert Calc (2)'!M17*2)/12","v":108.6488761165092},null,"16 cool",{"$f":"C$22*K30+ROUND($C$25*365/12,2)+('Simple Bill Insert Calc (2)'!M17*2)/12","v":128.37914052666665},{"$f":"C$22*L30+ROUND($C$25*365/12,2)+('Simple Bill Insert Calc (2)'!M17*2)/12","v":226.65269581866664},{"$f":"D$22*K30+ROUND($F$14*365/12,2)+('Simple Bill Insert Calc (2)'!M17*2)/12","v":145.81568975666664},{"$f":"D$22*L30+ROUND($F$14*365/12,2)+('Simple Bill Insert Calc (2)'!M17*2)/12","v":239.94091375466664},{"$f":"E$22*K30+ROUND($F$14*365/12,2)+('Simple Bill Insert Calc (2)'!M17*2)/12","v":145.81568975666664},{"$f":"E$22*L30+ROUND($F$14*365/12,2)+('Simple Bill Insert Calc (2)'!M17*2)/12","v":239.94091375466664},null,"16 cool",{"$f":"C$28*K30+ROUND($C$31*365/12,2)+('Simple Bill Insert Calc (2)'!M17*2)/12","v":77.037893676666684},{"$f":"C$28*L30+ROUND($C$31*365/12,2)+('Simple Bill Insert Calc (2)'!M17*2)/12","v":138.63736789866667},{"$f":"D$28*K30+ROUND($P$14*365/12,2)+('Simple Bill Insert Calc (2)'!M17*2)/12","v":82.991519041666663},{"$f":"D$28*L30+ROUND($P$14*365/12,2)+('Simple Bill Insert Calc (2)'!M17*2)/12","v":145.02470926666666},{"$f":"E$28*K30+ROUND($P$14*365/12,2)+('Simple Bill Insert Calc (2)'!M17*2)/12","v":82.991519041666663},{"$f":"E$28*L30+ROUND($P$14*365/12,2)+('Simple Bill Insert Calc (2)'!M17*2)/12","v":145.02470926666666}]
[null,"ALL",{"$f":"SUMPRODUCT(C52:C60,$U$22:$U$30)","v":180.22264444803372},95.703626328791856,188.41568760547727,102.44169653163338,188.41568760547727,102.44169653163338,null,"ALL",{"$f":"SUMPRODUCT(K52:K60,$T$22:$T$30)","v":129.76847402319129},147.25324094204134,147.14637659484751,163.89307511307604,147.14637659484751,163.89307511307604,null,"ALL",{"$f":"SUMPRODUCT(S52:S60,$U$22:$U$30)","v":90.60495946630688},{"$f":"SUMPRODUCT(T52:T60,$U$22:$U$30)","v":97.633048628749549},96.654109243179491,103.73168250883511,96.654109243179491,103.73168250883511]
[]
[]
[null,null,"All-Electric - Non-CARE",null,null,null,null,null,null,{"$f":"'Simple Bill Insert Calc (2)'!D5","v":500},{"$f":"J64&\" kWh Monthly - Non-CARE\"","v":"500 kWh Monthly - Non-CARE"},null,null,null,null,null,null,null,{"$f":"J64&\" kWh Monthly - CARE\"","v":"500 kWh Monthly - CARE"}]
[null,null,{"$f":"C27","v":"Jan 2025"},null,{"$f":"D27","v":"2025-11-15"},null,{"$f":"E21","v":"Proposed"},null,null,null,{"$f":"K50","v":"Jan 2025"},null,{"$f":"M50","v":"2025-11-15"},null,{"$f":"O50","v":"Proposed"},null,null,null,{"$f":"S50","v":"Jan 2025"},null,{"$f":"U50","v":"2025-11-15"},null,{"$f":"W50","v":"Proposed"}]
[null,null,"Summer","Winter","Summer","Winter","Summer","Winter",null,null,"Summer","Winter","Summer","Winter","Summer","Winter",null,null,"Summer","Winter","Summer","Winter","Summer","Winter"]
[null,"5 warm",{"$f":"C$22*MIN(K22,X22)+IF(X22-K22>0,C$23*(X22-K22))+ROUND($C$25*365/12,2)+('Simple Bill Insert Calc (2)'!M17*2)/12","v":123.19037560260527},{"$f":"C$22*MIN(L22,Y22)+IF(Y22-L22>0,C$23*(Y22-L22))+ROUND($C$25*365/12,2)+('Simple Bill Insert Calc (2)'!M17*2)/12","v":148.93808797258953},{"$f":"D$22*MIN(K22,X22)+IF(X22-K22>0,D$23*(X22-K22))+ROUND($F$14*365/12,2)+('Simple Bill Insert Calc (2)'!M17*2)/12","v":140.8459533988125},{"$f":"D$22*MIN(L22,Y22)+IF(Y22-L22>0,D$23*(Y22-L22))+ROUND($F$14*365/12,2)+('Simple Bill Insert Calc (2)'!M17*2)/12","v":165.50680124399196},{"$f":"E$22*MIN(K22,X22)+IF(X22-K22>0,E$23*(X22-K22))+ROUND($F$14*365/12,2)+('Simple Bill Insert Calc (2)'!M17*2)/12","v":140.8459533988125},{"$f":"E$22*MIN(L22,Y22)+IF(Y22-L22>0,E$23*(Y22-L22))+ROUND($F$14*365/12,2)+('Simple Bill Insert Calc (2)'!M17*2)/12","v":165.50680124399196},null,"5 warm",{"$f":"C$22*MIN(I22,$J$64)+IF($J$64-I22>0,C$23*($J$64-I22))+ROUND($C$25*365/12,2)+('Simple Bill Insert Calc (2)'!M17*2)/12","v":158.14666666666665},{"$f":"C$22*MIN(J22,$J$64)+IF($J$64-J22>0,C$23*($J$64-J22))+ROUND($C$25*365/12,2)+('Simple Bill Insert Calc (2)'!M17*2)/12","v":158.14666666666665},{"$f":"D$22*MIN(I22,$J$64)+IF($J$64-I22>0,D$23*($J$64-I22))+ROUND($F$14*365/12,2)+('Simple Bill Insert Calc (2)'!M17*2)/12","v":174.32666666666665},{"$f":"D$22*MIN(J22,$J$64)+IF($J$64-J22>0,D$23*($J$64-J22))+ROUND($F$14*365/12,2)+('Simple Bill Insert Calc (2)'!M17*2)/12","v":174.32666666666665},{"$f":"E$22*MIN(I22,$J$64)+IF($J$64-I22>0,E$23*($J$64-I22))+ROUND($F$14*365/12,2)+('Simple Bill Insert Calc (2)'!M17*2)/12","v":174.32666666666665},{"$f":"E$22*MIN(J22,$J$64)+IF($J$64-J22>0,E$23*($J$64-J22))+ROUND($F$14*365/12,2)+('Simple Bill Insert Calc (2)'!M17*2)/12","v":174.32666666666665},null,"5 warm",{"$f":"C$28*MIN(I22,$J$64)+IF($J$64-I22>0,C$29*($J$64-I22))+ROUND($C$31*365/12,2)+('Simple Bill Insert Calc (2)'!M17*2)/12","v":95.696666666666687},{"$f":"C$28*MIN(J22,$J$64)+IF($J$64-J22>0,C$29*($J$64-J22))+ROUND($C$31*365/12,2)+('Simple Bill Insert Calc (2)'!M17*2)/12","v":95.696666666666687},{"$f":"D$28*MIN(I22,$J$64)+IF($J$64-I22>0,D$29*($J$64-I22))+ROUND($P$14*365/12,2)+('Simple Bill Insert Calc (2)'!M17*2)/12","v":101.78166666666667},{"$f":"D$28*MIN(J22,$J$64)+IF($J$64-J22>0,D$29*($J$64-J22))+ROUND($P$14*365/12,2)+('Simple Bill Insert Calc (2)'!M17*2)/12","v":101.78166666666667},{"$f":"E$28*MIN(I22,$J$64)+IF($J$64-I22>0,E$29*($J$64-I22))+ROUND($P$14*365/12,2)+('Simple Bill Insert Calc (2)'!M17*2)/12","v":101.78166666666667},{"$f":"E$28*MIN(J22,$J$64)+IF($J$64-J22>0,E$29*($J$64-J22))+ROUND($P$14*365/12,2)+('Simple Bill Insert Calc (2)'!M17*2)/12","v":101.78166666666667}]
[null,"6 cool",{"$f":"C$22*MIN(K23,X23)+IF(X23-K23>0,C$23*(X23-K23))+ROUND($C$25*365/12,2)+('Simple Bill Insert Calc (2)'!M17*2)/12","v":109.31193504366259},{"$f":"C$22*MIN(L23,Y23)+IF(Y23-L23>0,C$23*(Y23-L23))+ROUND($C$25*365/12,2)+('Simple Bill Insert Calc (2)'!M17*2)/12","v":101.61644595538471},{"$f":"D$22*MIN(K23,X23)+IF(X23-K23>0,D$23*(X23-K23))+ROUND($F$14*365/12,2)+('Simple Bill Insert Calc (2)'!M17*2)/12","v":128.47678547545766},{"$f":"D$22*MIN(L23,Y23)+IF(Y23-L23>0,D$23*(Y23-L23))+ROUND($F$14*365/12,2)+('Simple Bill Insert Calc (2)'!M17*2)/12","v":120.18270422126865},{"$f":"E$22*MIN(K23,X23)+IF(X23-K23>0,E$23*(X23-K23))+ROUND($F$14*365/12,2)+('Simple Bill Insert Calc (2)'!M17*2)/12","v":128.47678547545766},{"$f":"E$22*MIN(L23,Y23)+IF(Y23-L23>0,E$23*(Y23-L23))+ROUND($F$14*365/12,2)+('Simple Bill Insert Calc (2)'!M17*2)/12","v":120.18270422126865},null,"6 cool",{"$f":"C$22*MIN(I23,$J$64)+IF($J$64-I23>0,C$23*($J$64-I23))+ROUND($C$25*365/12,2)+('Simple Bill Insert Calc (2)'!M17*2)/12","v":172.72497767266665},{"$f":"C$22*MIN(J23,$J$64)+IF($J$64-J23>0,C$23*($J$64-J23))+ROUND($C$25*365/12,2)+('Simple Bill Insert Calc (2)'!M17*2)/12","v":173.88240535666668},{"$f":"D$22*MIN(I23,$J$64)+IF($J$64-I23>0,D$23*($J$64-I23))+ROUND($F$14*365/12,2)+('Simple Bill Insert Calc (2)'!M17*2)/12","v":190.33936210466666},{"$f":"D$22*MIN(J23,$J$64)+IF($J$64-J23>0,D$23*($J$64-J23))+ROUND($F$14*365/12,2)+('Simple Bill Insert Calc (2)'!M17*2)/12","v":191.61067103666664},{"$f":"E$22*MIN(I23,$J$64)+IF($J$64-I23>0,E$23*($J$64-I23))+ROUND($F$14*365/12,2)+('Simple Bill Insert Calc (2)'!M17*2)/12","v":190.33936210466666},{"$f":"E$22*MIN(J23,$J$64)+IF($J$64-J23>0,E$23*($J$64-J23))+ROUND($F$14*365/12,2)+('Simple Bill Insert Calc (2)'!M17*2)/12","v":191.61067103666664},null,"6 cool",{"$f":"C$28*MIN(I23,$J$64)+IF($J$64-I23>0,C$29*($J$64-I23))+ROUND($C$31*365/12,2)+('Simple Bill Insert Calc (2)'!M17*2)/12","v":105.53660516866668},{"$f":"C$28*MIN(J23,$J$64)+IF($J$64-J23>0,C$29*($J$64-J23))+ROUND($C$31*365/12,2)+('Simple Bill Insert Calc (2)'!M17*2)/12","v":106.31783539666668},{"$f":"D$28*MIN(I23,$J$64)+IF($J$64-I23>0,D$29*($J$64-I23))+ROUND($P$14*365/12,2)+('Simple Bill Insert Calc (2)'!M17*2)/12","v":112.59012115266665},{"$f":"D$28*MIN(J23,$J$64)+IF($J$64-J23>0,D$29*($J$64-J23))+ROUND($P$14*365/12,2)+('Simple Bill Insert Calc (2)'!M17*2)/12","v":113.44824555666666},{"$f":"E$28*MIN(I23,$J$64)+IF($J$64-I23>0,E$29*($J$64-I23))+ROUND($P$14*365/12,2)+('Simple Bill Insert Calc (2)'!M17*2)/12","v":112.59012115266665},{"$f":"E$28*MIN(J23,$J$64)+IF($J$64-J23>0,E$29*($J$64-J23))+ROUND($P$14*365/12,2)+('Simple Bill Insert Calc (2)'!M17*2)/12","v":113.44824555666666}]
[null,"8 cool",{"$f":"C$22*MIN(K24,X24)+IF(X24-K24>0,C$23*(X24-K24))+ROUND($C$25*365/12,2)+('Simple Bill Insert Calc (2)'!M17*2)/12","v":132.35368619369473},{"$f":"C$22*MIN(L24,Y24)+IF(Y24-L24>0,C$23*(Y24-L24))+ROUND($C$25*365/12,2)+('Simple Bill Insert Calc (2)'!M17*2)/12","v":107.21415509613786},{"$f":"D$22*MIN(K24,X24)+IF(X24-K24>0,D$23*(X24-K24))+ROUND($F$14*365/12,2)+('Simple Bill Insert Calc (2)'!M17*2)/12","v":150.88587688291543},{"$f":"D$22*MIN(L24,Y24)+IF(Y24-L24>0,D$23*(Y24-L24))+ROUND($F$14*365/12,2)+('Simple Bill Insert Calc (2)'!M17*2)/12","v":125.5441224093408},{"$f":"E$22*MIN(K24,X24)+IF(X24-K24>0,E$23*(X24-K24))+ROUND($F$14*365/12,2)+('Simple Bill Insert Calc (2)'!M17*2)/12","v":150.88587688291543},{"$f":"E$22*MIN(L24,Y24)+IF(Y24-L24>0,E$23*(Y24-L24))+ROUND($F$14*365/12,2)+('Simple Bill Insert Calc (2)'!M17*2)/12","v":125.5441224093408},null,"8 cool",{"$f":"C$22*MIN(I24,$J$64)+IF($J$64-I24>0,C$23*($J$64-I24))+ROUND($C$25*365/12,2)+('Simple Bill Insert Calc (2)'!M17*2)/12","v":168.67398077866665},{"$f":"C$22*MIN(J24,$J$64)+IF($J$64-J24>0,C$23*($J$64-J24))+ROUND($C$25*365/12,2)+('Simple Bill Insert Calc (2)'!M17*2)/12","v":175.90790380366664},{"$f":"D$22*MIN(I24,$J$64)+IF($J$64-I24>0,D$23*($J$64-I24))+ROUND($F$14*365/12,2)+('Simple Bill Insert Calc (2)'!M17*2)/12","v":185.88978084266665},{"$f":"D$22*MIN(J24,$J$64)+IF($J$64-J24>0,D$23*($J$64-J24))+ROUND($F$14*365/12,2)+('Simple Bill Insert Calc (2)'!M17*2)/12","v":193.83546166766666},{"$f":"E$22*MIN(I24,$J$64)+IF($J$64-I24>0,E$23*($J$64-I24))+ROUND($F$14*365/12,2)+('Simple Bill Insert Calc (2)'!M17*2)/12","v":185.88978084266665},{"$f":"E$22*MIN(J24,$J$64)+IF($J$64-J24>0,E$23*($J$64-J24))+ROUND($F$14*365/12,2)+('Simple Bill Insert Calc (2)'!M17*2)/12","v":193.83546166766666},null,"8 cool",{"$f":"C$28*MIN(I24,$J$64)+IF($J$64-I24>0,C$29*($J$64-I24))+ROUND($C$31*365/12,2)+('Simple Bill Insert Calc (2)'!M17*2)/12","v":102.80229937066667},{"$f":"C$28*MIN(J24,$J$64)+IF($J$64-J24>0,C$29*($J$64-J24))+ROUND($C$31*365/12,2)+('Simple Bill Insert Calc (2)'!M17*2)/12","v":107.68498829566667},{"$f":"D$28*MIN(I24,$J$64)+IF($J$64-I24>0,D$29*($J$64-I24))+ROUND($P$14*365/12,2)+('Simple Bill Insert Calc (2)'!M17*2)/12","v":109.58668573866666},{"$f":"D$28*MIN(J24,$J$64)+IF($J$64-J24>0,D$29*($J$64-J24))+ROUND($P$14*365/12,2)+('Simple Bill Insert Calc (2)'!M17*2)/12","v":114.94996326366666},{"$f":"E$28*MIN(I24,$J$64)+IF($J$64-I24>0,E$29*($J$64-I24))+ROUND($P$14*365/12,2)+('Simple Bill Insert Calc (2)'!M17*2)/12","v":109.58668573866666},{"$f":"E$28*MIN(J24,$J$64)+IF($J$64-J24>0,E$29*($J$64-J24))+ROUND($P$14*365/12,2)+('Simple Bill Insert Calc (2)'!M17*2)/12","v":114.94996326366666}]
[null,"9 warm",{"$f":"C$22*MIN(K25,X25)+IF(X25-K25>0,C$23*(X25-K25))+ROUND($C$25*365/12,2)+('Simple Bill Insert Calc (2)'!M17*2)/12","v":182.74270527969233},{"$f":"C$22*MIN(L25,Y25)+IF(Y25-L25>0,C$23*(Y25-L25))+ROUND($C$25*365/12,2)+('Simple Bill Insert Calc (2)'!M17*2)/12","v":118.23582022428999},{"$f":"D$22*MIN(K25,X25)+IF(X25-K25>0,D$23*(X25-K25))+ROUND($F$14*365/12,2)+('Simple Bill Insert Calc (2)'!M17*2)/12","v":199.89902692033894},{"$f":"D$22*MIN(L25,Y25)+IF(Y25-L25>0,D$23*(Y25-L25))+ROUND($F$14*365/12,2)+('Simple Bill Insert Calc (2)'!M17*2)/12","v":136.10054011434588},{"$f":"E$22*MIN(K25,X25)+IF(X25-K25>0,E$23*(X25-K25))+ROUND($F$14*365/12,2)+('Simple Bill Insert Calc (2)'!M17*2)/12","v":199.89902692033894},{"$f":"E$22*MIN(L25,Y25)+IF(Y25-L25>0,E$23*(Y25-L25))+ROUND($F$14*365/12,2)+('Simple Bill Insert Calc (2)'!M17*2)/12","v":136.10054011434588},null,"9 warm",{"$f":"C$22*MIN(I25,$J$64)+IF($J$64-I25>0,C$23*($J$64-I25))+ROUND($C$25*365/12,2)+('Simple Bill Insert Calc (2)'!M17*2)/12","v":158.14666666666665},{"$f":"C$22*MIN(J25,$J$64)+IF($J$64-J25>0,C$23*($J$64-J25))+ROUND($C$25*365/12,2)+('Simple Bill Insert Calc (2)'!M17*2)/12","v":170.98883614666667},{"$f":"D$22*MIN(I25,$J$64)+IF($J$64-I25>0,D$23*($J$64-I25))+ROUND($F$14*365/12,2)+('Simple Bill Insert Calc (2)'!M17*2)/12","v":174.32666666666665},{"$f":"D$22*MIN(J25,$J$64)+IF($J$64-J25>0,D$23*($J$64-J25))+ROUND($F$14*365/12,2)+('Simple Bill Insert Calc (2)'!M17*2)/12","v":188.43239870666667},{"$f":"E$22*MIN(I25,$J$64)+IF($J$64-I25>0,E$23*($J$64-I25))+ROUND($F$14*365/12,2)+('Simple Bill Insert Calc (2)'!M17*2)/12","v":174.32666666666665},{"$f":"E$22*MIN(J25,$J$64)+IF($J$64-J25>0,E$23*($J$64-J25))+ROUND($F$14*365/12,2)+('Simple Bill Insert Calc (2)'!M17*2)/12","v":188.43239870666667},null,"9 warm",{"$f":"C$28*MIN(I25,$J$64)+IF($J$64-I25>0,C$29*($J$64-I25))+ROUND($C$31*365/12,2)+('Simple Bill Insert Calc (2)'!M17*2)/12","v":95.696666666666687},{"$f":"C$28*MIN(J25,$J$64)+IF($J$64-J25>0,C$29*($J$64-J25))+ROUND($C$31*365/12,2)+('Simple Bill Insert Calc (2)'!M17*2)/12","v":104.36475982666667},{"$f":"D$28*MIN(I25,$J$64)+IF($J$64-I25>0,D$29*($J$64-I25))+ROUND($P$14*365/12,2)+('Simple Bill Insert Calc (2)'!M17*2)/12","v":101.78166666666667},{"$f":"D$28*MIN(J25,$J$64)+IF($J$64-J25>0,D$29*($J$64-J25))+ROUND($P$14*365/12,2)+('Simple Bill Insert Calc (2)'!M17*2)/12","v":111.30293454666668},{"$f":"E$28*MIN(I25,$J$64)+IF($J$64-I25>0,E$29*($J$64-I25))+ROUND($P$14*365/12,2)+('Simple Bill Insert Calc (2)'!M17*2)/12","v":101.78166666666667},{"$f":"E$28*MIN(J25,$J$64)+IF($J$64-J25>0,E$29*($J$64-J25))+ROUND($P$14*365/12,2)+('Simple Bill Insert Calc (2)'!M17*2)/12","v":111.30293454666668}]
[null,"10 hot (Sec 745)",{"$f":"C$22*MIN(K26,X26)+IF(X26-K26>0,C$23*(X26-K26))+ROUND($C$25*365/12,2)+('Simple Bill Insert Calc (2)'!M17*2)/12","v":214.29868179984689},{"$f":"C$22*MIN(L26,Y26)+IF(Y26-L26>0,C$23*(Y26-L26))+ROUND($C$25*365/12,2)+('Simple Bill Insert Calc (2)'!M17*2)/12","v":133.86568444666349},{"$f":"D$22*MIN(K26,X26)+IF(X26-K26>0,D$23*(X26-K26))+ROUND($F$14*365/12,2)+('Simple Bill Insert Calc (2)'!M17*2)/12","v":230.03267424717197},{"$f":"D$22*MIN(L26,Y26)+IF(Y26-L26>0,D$23*(Y26-L26))+ROUND($F$14*365/12,2)+('Simple Bill Insert Calc (2)'!M17*2)/12","v":151.07063523930563},{"$f":"E$22*MIN(K26,X26)+IF(X26-K26>0,E$23*(X26-K26))+ROUND($F$14*365/12,2)+('Simple Bill Insert Calc (2)'!M17*2)/12","v":230.03267424717197},{"$f":"E$22*MIN(L26,Y26)+IF(Y26-L26>0,E$23*(Y26-L26))+ROUND($F$14*365/12,2)+('Simple Bill Insert Calc (2)'!M17*2)/12","v":151.07063523930563},null,"10 hot (Sec 745)",{"$f":"C$22*MIN(I26,$J$64)+IF($J$64-I26>0,C$23*($J$64-I26))+ROUND($C$25*365/12,2)+('Simple Bill Insert Calc (2)'!M17*2)/12","v":158.14666666666665},{"$f":"C$22*MIN(J26,$J$64)+IF($J$64-J26>0,C$23*($J$64-J26))+ROUND($C$25*365/12,2)+('Simple Bill Insert Calc (2)'!M17*2)/12","v":170.69947922566664},{"$f":"D$22*MIN(I26,$J$64)+IF($J$64-I26>0,D$23*($J$64-I26))+ROUND($F$14*365/12,2)+('Simple Bill Insert Calc (2)'!M17*2)/12","v":174.32666666666665},{"$f":"D$22*MIN(J26,$J$64)+IF($J$64-J26>0,D$23*($J$64-J26))+ROUND($F$14*365/12,2)+('Simple Bill Insert Calc (2)'!M17*2)/12","v":188.11457147366667},{"$f":"E$22*MIN(I26,$J$64)+IF($J$64-I26>0,E$23*($J$64-I26))+ROUND($F$14*365/12,2)+('Simple Bill Insert Calc (2)'!M17*2)/12","v":174.32666666666665},{"$f":"E$22*MIN(J26,$J$64)+IF($J$64-J26>0,E$23*($J$64-J26))+ROUND($F$14*365/12,2)+('Simple Bill Insert Calc (2)'!M17*2)/12","v":188.11457147366667},null,"10 hot (Sec 745)",{"$f":"C$28*MIN(I26,$J$64)+IF($J$64-I26>0,C$29*($J$64-I26))+ROUND($C$31*365/12,2)+('Simple Bill Insert Calc (2)'!M17*2)/12","v":95.696666666666687},{"$f":"C$28*MIN(J26,$J$64)+IF($J$64-J26>0,C$29*($J$64-J26))+ROUND($C$31*365/12,2)+('Simple Bill Insert Calc (2)'!M17*2)/12","v":104.16945226966669},{"$f":"D$28*MIN(I26,$J$64)+IF($J$64-I26>0,D$29*($J$64-I26))+ROUND($P$14*365/12,2)+('Simple Bill Insert Calc (2)'!M17*2)/12","v":101.78166666666667},{"$f":"D$28*MIN(J26,$J$64)+IF($J$64-J26>0,D$29*($J$64-J26))+ROUND($P$14*365/12,2)+('Simple Bill Insert Calc (2)'!M17*2)/12","v":111.08840344566667},{"$f":"E$28*MIN(I26,$J$64)+IF($J$64-I26>0,E$29*($J$64-I26))+ROUND($P$14*365/12,2)+('Simple Bill Insert Calc (2)'!M17*2)/12","v":101.78166666666667},{"$f":"E$28*MIN(J26,$J$64)+IF($J$64-J26>0,E$29*($J$64-J26))+ROUND($P$14*365/12,2)+('Simple Bill Insert Calc (2)'!M17*2)/12","v":111.08840344566667}]
[null,"13 hot",{"$f":"C$22*MIN(K27,X27)+IF(X27-K27>0,C$23*(X27-K27))+ROUND($C$25*365/12,2)+('Simple Bill Insert Calc (2)'!M17*2)/12","v":335.22657897458271},{"$f":"C$22*MIN(L27,Y27)+IF(Y27-L27>0,C$23*(Y27-L27))+ROUND($C$25*365/12,2)+('Simple Bill Insert Calc (2)'!M17*2)/12","v":183.03274737024662},{"$f":"D$22*MIN(K27,X27)+IF(X27-K27>0,D$23*(X27-K27))+ROUND($F$14*365/12,2)+('Simple Bill Insert Calc (2)'!M17*2)/12","v":347.00663561324029},{"$f":"D$22*MIN(L27,Y27)+IF(Y27-L27>0,D$23*(Y27-L27))+ROUND($F$14*365/12,2)+('Simple Bill Insert Calc (2)'!M17*2)/12","v":198.16225411129281},{"$f":"E$22*MIN(K27,X27)+IF(X27-K27>0,E$23*(X27-K27))+ROUND($F$14*365/12,2)+('Simple Bill Insert Calc (2)'!M17*2)/12","v":347.00663561324029},{"$f":"E$22*MIN(L27,Y27)+IF(Y27-L27>0,E$23*(Y27-L27))+ROUND($F$14*365/12,2)+('Simple Bill Insert Calc (2)'!M17*2)/12","v":198.16225411129281},null,"13 hot",{"$f":"C$22*MIN(I27,$J$64)+IF($J$64-I27>0,C$23*($J$64-I27))+ROUND($C$25*365/12,2)+('Simple Bill Insert Calc (2)'!M17*2)/12","v":158.14666666666665},{"$f":"C$22*MIN(J27,$J$64)+IF($J$64-J27>0,C$23*($J$64-J27))+ROUND($C$25*365/12,2)+('Simple Bill Insert Calc (2)'!M17*2)/12","v":170.41012230466666},{"$f":"D$22*MIN(I27,$J$64)+IF($J$64-I27>0,D$23*($J$64-I27))+ROUND($F$14*365/12,2)+('Simple Bill Insert Calc (2)'!M17*2)/12","v":174.32666666666665},{"$f":"D$22*MIN(J27,$J$64)+IF($J$64-J27>0,D$23*($J$64-J27))+ROUND($F$14*365/12,2)+('Simple Bill Insert Calc (2)'!M17*2)/12","v":187.79674424066667},{"$f":"E$22*MIN(I27,$J$64)+IF($J$64-I27>0,E$23*($J$64-I27))+ROUND($F$14*365/12,2)+('Simple Bill Insert Calc (2)'!M17*2)/12","v":174.32666666666665},{"$f":"E$22*MIN(J27,$J$64)+IF($J$64-J27>0,E$23*($J$64-J27))+ROUND($F$14*365/12,2)+('Simple Bill Insert Calc (2)'!M17*2)/12","v":187.79674424066667},null,"13 hot",{"$f":"C$28*MIN(I27,$J$64)+IF($J$64-I27>0,C$29*($J$64-I27))+ROUND($C$31*365/12,2)+('Simple Bill Insert Calc (2)'!M17*2)/12","v":95.696666666666687},{"$f":"C$28*MIN(J27,$J$64)+IF($J$64-J27>0,C$29*($J$64-J27))+ROUND($C$31*365/12,2)+('Simple Bill Insert Calc (2)'!M17*2)/12","v":103.97414471266669},{"$f":"D$28*MIN(I27,$J$64)+IF($J$64-I27>0,D$29*($J$64-I27))+ROUND($P$14*365/12,2)+('Simple Bill Insert Calc (2)'!M17*2)/12","v":101.78166666666667},{"$f":"D$28*MIN(J27,$J$64)+IF($J$64-J27>0,D$29*($J$64-J27))+ROUND($P$14*365/12,2)+('Simple Bill Insert Calc (2)'!M17*2)/12","v":110.87387234466667},{"$f":"E$28*MIN(I27,$J$64)+IF($J$64-I27>0,E$29*($J$64-I27))+ROUND($P$14*365/12,2)+('Simple Bill Insert Calc (2)'!M17*2)/12","v":101.78166666666667},{"$f":"E$28*MIN(J27,$J$64)+IF($J$64-J27>0,E$29*($J$64-J27))+ROUND($P$14*365/12,2)+('Simple Bill Insert Calc (2)'!M17*2)/12","v":110.87387234466667}]
[null,"14 hot",{"$f":"C$22*MIN(K28,X28)+IF(X28-K28>0,C$23*(X28-K28))+ROUND($C$25*365/12,2)+('Simple Bill Insert Calc (2)'!M17*2)/12","v":261.81143781129128},{"$f":"C$22*MIN(L28,Y28)+IF(Y28-L28>0,C$23*(Y28-L28))+ROUND($C$25*365/12,2)+('Simple Bill Insert Calc (2)'!M17*2)/12","v":177.03245012311169},{"$f":"D$22*MIN(K28,X28)+IF(X28-K28>0,D$23*(X28-K28))+ROUND($F$14*365/12,2)+('Simple Bill Insert Calc (2)'!M17*2)/12","v":276.20113085215809},{"$f":"D$22*MIN(L28,Y28)+IF(Y28-L28>0,D$23*(Y28-L28))+ROUND($F$14*365/12,2)+('Simple Bill Insert Calc (2)'!M17*2)/12","v":192.41524189866826},{"$f":"E$22*MIN(K28,X28)+IF(X28-K28>0,E$23*(X28-K28))+ROUND($F$14*365/12,2)+('Simple Bill Insert Calc (2)'!M17*2)/12","v":276.20113085215809},{"$f":"E$22*MIN(L28,Y28)+IF(Y28-L28>0,E$23*(Y28-L28))+ROUND($F$14*365/12,2)+('Simple Bill Insert Calc (2)'!M17*2)/12","v":192.41524189866826},null,"14 hot",{"$f":"C$22*MIN(I28,$J$64)+IF($J$64-I28>0,C$23*($J$64-I28))+ROUND($C$25*365/12,2)+('Simple Bill Insert Calc (2)'!M17*2)/12","v":158.14666666666665},{"$f":"C$22*MIN(J28,$J$64)+IF($J$64-J28>0,C$23*($J$64-J28))+ROUND($C$25*365/12,2)+('Simple Bill Insert Calc (2)'!M17*2)/12","v":171.27819306766665},{"$f":"D$22*MIN(I28,$J$64)+IF($J$64-I28>0,D$23*($J$64-I28))+ROUND($F$14*365/12,2)+('Simple Bill Insert Calc (2)'!M17*2)/12","v":174.32666666666665},{"$f":"D$22*MIN(J28,$J$64)+IF($J$64-J28>0,D$23*($J$64-J28))+ROUND($F$14*365/12,2)+('Simple Bill Insert Calc (2)'!M17*2)/12","v":188.75022593966668},{"$f":"E$22*MIN(I28,$J$64)+IF($J$64-I28>0,E$23*($J$64-I28))+ROUND($F$14*365/12,2)+('Simple Bill Insert Calc (2)'!M17*2)/12","v":174.32666666666665},{"$f":"E$22*MIN(J28,$J$64)+IF($J$64-J28>0,E$23*($J$64-J28))+ROUND($F$14*365/12,2)+('Simple Bill Insert Calc (2)'!M17*2)/12","v":188.75022593966668},null,"14 hot",{"$f":"C$28*MIN(I28,$J$64)+IF($J$64-I28>0,C$29*($J$64-I28))+ROUND($C$31*365/12,2)+('Simple Bill Insert Calc (2)'!M17*2)/12","v":95.696666666666687},{"$f":"C$28*MIN(J28,$J$64)+IF($J$64-J28>0,C$29*($J$64-J28))+ROUND($C$31*365/12,2)+('Simple Bill Insert Calc (2)'!M17*2)/12","v":104.56006738366668},{"$f":"D$28*MIN(I28,$J$64)+IF($J$64-I28>0,D$29*($J$64-I28))+ROUND($P$14*365/12,2)+('Simple Bill Insert Calc (2)'!M17*2)/12","v":101.78166666666667},{"$f":"D$28*MIN(J28,$J$64)+IF($J$64-J28>0,D$29*($J$64-J28))+ROUND($P$14*365/12,2)+('Simple Bill Insert Calc (2)'!M17*2)/12","v":111.51746564766667},{"$f":"E$28*MIN(I28,$J$64)+IF($J$64-I28>0,E$29*($J$64-I28))+ROUND($P$14*365/12,2)+('Simple Bill Insert Calc (2)'!M17*2)/12","v":101.78166666666667},{"$f":"E$28*MIN(J28,$J$64)+IF($J$64-J28>0,E$29*($J$64-J28))+ROUND($P$14*365/12,2)+('Simple Bill Insert Calc (2)'!M17*2)/12","v":111.51746564766667}]
[null,"15 hot",{"$f":"C$22*MIN(K29,X29)+IF(X29-K29>0,C$23*(X29-K29))+ROUND($C$25*365/12,2)+('Simple Bill Insert Calc (2)'!M17*2)/12","v":318.24183155555795},{"$f":"C$22*MIN(L29,Y29)+IF(Y29-L29>0,C$23*(Y29-L29))+ROUND($C$25*365/12,2)+('Simple Bill Insert Calc (2)'!M17*2)/12","v":142.0377559510865},{"$f":"D$22*MIN(K29,X29)+IF(X29-K29>0,D$23*(X29-K29))+ROUND($F$14*365/12,2)+('Simple Bill Insert Calc (2)'!M17*2)/12","v":330.27160401712916},{"$f":"D$22*MIN(L29,Y29)+IF(Y29-L29>0,D$23*(Y29-L29))+ROUND($F$14*365/12,2)+('Simple Bill Insert Calc (2)'!M17*2)/12","v":158.89774659796129},{"$f":"E$22*MIN(K29,X29)+IF(X29-K29>0,E$23*(X29-K29))+ROUND($F$14*365/12,2)+('Simple Bill Insert Calc (2)'!M17*2)/12","v":330.27160401712916},{"$f":"E$22*MIN(L29,Y29)+IF(Y29-L29>0,E$23*(Y29-L29))+ROUND($F$14*365/12,2)+('Simple Bill Insert Calc (2)'!M17*2)/12","v":158.89774659796129},null,"15 hot",{"$f":"C$22*MIN(I29,$J$64)+IF($J$64-I29>0,C$23*($J$64-I29))+ROUND($C$25*365/12,2)+('Simple Bill Insert Calc (2)'!M17*2)/12","v":158.14666666666665},{"$f":"C$22*MIN(J29,$J$64)+IF($J$64-J29>0,C$23*($J$64-J29))+ROUND($C$25*365/12,2)+('Simple Bill Insert Calc (2)'!M17*2)/12","v":177.64404532966668},{"$f":"D$22*MIN(I29,$J$64)+IF($J$64-I29>0,D$23*($J$64-I29))+ROUND($F$14*365/12,2)+('Simple Bill Insert Calc (2)'!M17*2)/12","v":174.32666666666665},{"$f":"D$22*MIN(J29,$J$64)+IF($J$64-J29>0,D$23*($J$64-J29))+ROUND($F$14*365/12,2)+('Simple Bill Insert Calc (2)'!M17*2)/12","v":195.74242506566668},{"$f":"E$22*MIN(I29,$J$64)+IF($J$64-I29>0,E$23*($J$64-I29))+ROUND($F$14*365/12,2)+('Simple Bill Insert Calc (2)'!M17*2)/12","v":174.32666666666665},{"$f":"E$22*MIN(J29,$J$64)+IF($J$64-J29>0,E$23*($J$64-J29))+ROUND($F$14*365/12,2)+('Simple Bill Insert Calc (2)'!M17*2)/12","v":195.74242506566668},null,"15 hot",{"$f":"C$28*MIN(I29,$J$64)+IF($J$64-I29>0,C$29*($J$64-I29))+ROUND($C$31*365/12,2)+('Simple Bill Insert Calc (2)'!M17*2)/12","v":95.696666666666687},{"$f":"C$28*MIN(J29,$J$64)+IF($J$64-J29>0,C$29*($J$64-J29))+ROUND($C$31*365/12,2)+('Simple Bill Insert Calc (2)'!M17*2)/12","v":108.85683363766668},{"$f":"D$28*MIN(I29,$J$64)+IF($J$64-I29>0,D$29*($J$64-I29))+ROUND($P$14*365/12,2)+('Simple Bill Insert Calc (2)'!M17*2)/12","v":101.78166666666667},{"$f":"D$28*MIN(J29,$J$64)+IF($J$64-J29>0,D$29*($J$64-J29))+ROUND($P$14*365/12,2)+('Simple Bill Insert Calc (2)'!M17*2)/12","v":116.23714986966667},{"$f":"E$28*MIN(I29,$J$64)+IF($J$64-I29>0,E$29*($J$64-I29))+ROUND($P$14*365/12,2)+('Simple Bill Insert Calc (2)'!M17*2)/12","v":101.78166666666667},{"$f":"E$28*MIN(J29,$J$64)+IF($J$64-J29>0,E$29*($J$64-J29))+ROUND($P$14*365/12,2)+('Simple Bill Insert Calc (2)'!M17*2)/12","v":116.23714986966667}]
[null,"16 cool",{"$f":"C$22*MIN(K30,X30)+IF(X30-K30>0,C$23*(X30-K30))+ROUND($C$25*365/12,2)+('Simple Bill Insert Calc (2)'!M17*2)/12","v":145.17251748267714},{"$f":"C$22*MIN(L30,Y30)+IF(Y30-L30>0,C$23*(Y30-L30))+ROUND($C$25*365/12,2)+('Simple Bill Insert Calc (2)'!M17*2)/12","v":171.02454044566267},{"$f":"D$22*MIN(K30,X30)+IF(X30-K30>0,D$23*(X30-K30))+ROUND($F$14*365/12,2)+('Simple Bill Insert Calc (2)'!M17*2)/12","v":162.42474389982073},{"$f":"D$22*MIN(L30,Y30)+IF(Y30-L30>0,D$23*(Y30-L30))+ROUND($F$14*365/12,2)+('Simple Bill Insert Calc (2)'!M17*2)/12","v":186.660938592256},{"$f":"E$22*MIN(K30,X30)+IF(X30-K30>0,E$23*(X30-K30))+ROUND($F$14*365/12,2)+('Simple Bill Insert Calc (2)'!M17*2)/12","v":162.42474389982073},{"$f":"E$22*MIN(L30,Y30)+IF(Y30-L30>0,E$23*(Y30-L30))+ROUND($F$14*365/12,2)+('Simple Bill Insert Calc (2)'!M17*2)/12","v":186.660938592256},null,"16 cool",{"$f":"C$22*MIN(I30,$J$64)+IF($J$64-I30>0,C$23*($J$64-I30))+ROUND($C$25*365/12,2)+('Simple Bill Insert Calc (2)'!M17*2)/12","v":163.17619927966663},{"$f":"C$22*MIN(J30,$J$64)+IF($J$64-J30>0,C$23*($J$64-J30))+ROUND($C$25*365/12,2)+('Simple Bill Insert Calc (2)'!M17*2)/12","v":169.83140846266664},{"$f":"D$22*MIN(I30,$J$64)+IF($J$64-I30>0,D$23*($J$64-I30))+ROUND($F$14*365/12,2)+('Simple Bill Insert Calc (2)'!M17*2)/12","v":179.85106341566666},{"$f":"D$22*MIN(J30,$J$64)+IF($J$64-J30>0,D$23*($J$64-J30))+ROUND($F$14*365/12,2)+('Simple Bill Insert Calc (2)'!M17*2)/12","v":187.16108977466666},{"$f":"E$22*MIN(I30,$J$64)+IF($J$64-I30>0,E$23*($J$64-I30))+ROUND($F$14*365/12,2)+('Simple Bill Insert Calc (2)'!M17*2)/12","v":179.85106341566666},{"$f":"E$22*MIN(J30,$J$64)+IF($J$64-J30>0,E$23*($J$64-J30))+ROUND($F$14*365/12,2)+('Simple Bill Insert Calc (2)'!M17*2)/12","v":187.16108977466666},null,"16 cool",{"$f":"C$28*MIN(I30,$J$64)+IF($J$64-I30>0,C$29*($J$64-I30))+ROUND($C$31*365/12,2)+('Simple Bill Insert Calc (2)'!M17*2)/12","v":99.091455787666675},{"$f":"C$28*MIN(J30,$J$64)+IF($J$64-J30>0,C$29*($J$64-J30))+ROUND($C$31*365/12,2)+('Simple Bill Insert Calc (2)'!M17*2)/12","v":103.58352959866667},{"$f":"D$28*MIN(I30,$J$64)+IF($J$64-I30>0,D$29*($J$64-I30))+ROUND($P$14*365/12,2)+('Simple Bill Insert Calc (2)'!M17*2)/12","v":105.51059481966666},{"$f":"D$28*MIN(J30,$J$64)+IF($J$64-J30>0,D$29*($J$64-J30))+ROUND($P$14*365/12,2)+('Simple Bill Insert Calc (2)'!M17*2)/12","v":110.44481014266665},{"$f":"E$28*MIN(I30,$J$64)+IF($J$64-I30>0,E$29*($J$64-I30))+ROUND($P$14*365/12,2)+('Simple Bill Insert Calc (2)'!M17*2)/12","v":105.51059481966666},{"$f":"E$28*MIN(J30,$J$64)+IF($J$64-J30>0,E$29*($J$64-J30))+ROUND($P$14*365/12,2)+('Simple Bill Insert Calc (2)'!M17*2)/12","v":110.44481014266665}]
[null,"ALL",{"$f":"SUMPRODUCT(C67:C75,$AB$22:$AB$30)","v":170.552539217613},{"$f":"SUMPRODUCT(D67:D75,$AB$22:$AB$30)","v":122.73944863575313},{"$f":"SUMPRODUCT(E67:E75,$AB$22:$AB$30)","v":187.74425375389816},140.41406099769213,{"$f":"SUMPRODUCT(G67:G75,$AB$22:$AB$30)","v":187.74425375389816},140.41406099769213,null,"ALL",{"$f":"SUMPRODUCT(K67:K75,$T$22:$T$30)","v":163.1865904614148},172.66318728033542,179.86247700318754,190.27149205216276,179.86247700318754,190.27149205216276,null,"ALL",{"$f":"SUMPRODUCT(S67:S75,$U$22:$U$30)","v":97.499916045803843},105.03737750586474,103.76240453787898,112.04175599058254,103.76240453787898,112.04175599058254]
[]
[]
[null,null,"All-Electric - CARE"]
[null,null,{"$f":"C27","v":"Jan 2025"},null,{"$f":"D27","v":"2025-11-15"},null,{"$f":"E27","v":"Proposed"}]
[null,null,"Summer","Winter","Summer","Winter","Summer","Winter"]
[null,"5 warm",{"$f":"C$28*MIN(K22,Z22)+IF(Z22-K22>0,C$29*(Z22-K22))+ROUND($C$31*365/12,2)+('Simple Bill Insert Calc (2)'!M17*2)/12","v":65.221086284944491},{"$f":"C$28*MIN(L22,AA22)+IF(AA22-L22>0,C$29*(AA22-L22))+ROUND($C$31*365/12,2)+('Simple Bill Insert Calc (2)'!M17*2)/12","v":81.091586750128357},{"$f":"D$28*MIN(K22,Z22)+IF(Z22-K22>0,D$29*(Z22-K22))+ROUND($P$14*365/12,2)+('Simple Bill Insert Calc (2)'!M17*2)/12","v":71.09151063995391},{"$f":"D$28*MIN(L22,AA22)+IF(AA22-L22>0,D$29*(AA22-L22))+ROUND($P$14*365/12,2)+('Simple Bill Insert Calc (2)'!M17*2)/12","v":87.073753780124932},{"$f":"E$28*MIN(K22,Z22)+IF(Z22-K22>0,E$29*(Z22-K22))+ROUND($P$14*365/12,2)+('Simple Bill Insert Calc (2)'!M17*2)/12","v":71.09151063995391},{"$f":"E$28*MIN(L22,AA22)+IF(AA22-L22>0,E$29*(AA22-L22))+ROUND($P$14*365/12,2)+('Simple Bill Insert Calc (2)'!M17*2)/12","v":87.073753780124932}]
[null,"6 cool",{"$f":"C$28*MIN(K23,Z23)+IF(Z23-K23>0,C$29*(Z23-K23))+ROUND($C$31*365/12,2)+('Simple Bill Insert Calc (2)'!M17*2)/12","v":73.814120829680391},{"$f":"C$28*MIN(L23,AA23)+IF(AA23-L23>0,C$29*(AA23-L23))+ROUND($C$31*365/12,2)+('Simple Bill Insert Calc (2)'!M17*2)/12","v":69.313510553200629},{"$f":"D$28*MIN(K23,Z23)+IF(Z23-K23>0,D$29*(Z23-K23))+ROUND($P$14*365/12,2)+('Simple Bill Insert Calc (2)'!M17*2)/12","v":80.330966463127638},{"$f":"D$28*MIN(L23,AA23)+IF(AA23-L23>0,D$29*(AA23-L23))+ROUND($P$14*365/12,2)+('Simple Bill Insert Calc (2)'!M17*2)/12","v":75.212749275842654},{"$f":"E$28*MIN(K23,Z23)+IF(Z23-K23>0,E$29*(Z23-K23))+ROUND($P$14*365/12,2)+('Simple Bill Insert Calc (2)'!M17*2)/12","v":80.330966463127638},{"$f":"E$28*MIN(L23,AA23)+IF(AA23-L23>0,E$29*(AA23-L23))+ROUND($P$14*365/12,2)+('Simple Bill Insert Calc (2)'!M17*2)/12","v":75.212749275842654}]
[null,"8 cool",{"$f":"C$28*MIN(K24,Z24)+IF(Z24-K24>0,C$29*(Z24-K24))+ROUND($C$31*365/12,2)+('Simple Bill Insert Calc (2)'!M17*2)/12","v":85.102231337513004},{"$f":"C$28*MIN(L24,AA24)+IF(AA24-L24>0,C$29*(AA24-L24))+ROUND($C$31*365/12,2)+('Simple Bill Insert Calc (2)'!M17*2)/12","v":68.608184149109775},{"$f":"D$28*MIN(K24,Z24)+IF(Z24-K24>0,D$29*(Z24-K24))+ROUND($P$14*365/12,2)+('Simple Bill Insert Calc (2)'!M17*2)/12","v":91.777389392534872},{"$f":"D$28*MIN(L24,AA24)+IF(AA24-L24>0,D$29*(AA24-L24))+ROUND($P$14*365/12,2)+('Simple Bill Insert Calc (2)'!M17*2)/12","v":74.502456736039491},{"$f":"E$28*MIN(K24,Z24)+IF(Z24-K24>0,E$29*(Z24-K24))+ROUND($P$14*365/12,2)+('Simple Bill Insert Calc (2)'!M17*2)/12","v":91.777389392534872},{"$f":"E$28*MIN(L24,AA24)+IF(AA24-L24>0,E$29*(AA24-L24))+ROUND($P$14*365/12,2)+('Simple Bill Insert Calc (2)'!M17*2)/12","v":74.502456736039491}]
[null,"9 warm",{"$f":"C$28*MIN(K25,Z25)+IF(Z25-K25>0,C$29*(Z25-K25))+ROUND($C$31*365/12,2)+('Simple Bill Insert Calc (2)'!M17*2)/12","v":106.12090488259082},{"$f":"C$28*MIN(L25,AA25)+IF(AA25-L25>0,C$29*(AA25-L25))+ROUND($C$31*365/12,2)+('Simple Bill Insert Calc (2)'!M17*2)/12","v":69.738276911497366},{"$f":"D$28*MIN(K25,Z25)+IF(Z25-K25>0,D$29*(Z25-K25))+ROUND($P$14*365/12,2)+('Simple Bill Insert Calc (2)'!M17*2)/12","v":113.04094129330475},{"$f":"D$28*MIN(L25,AA25)+IF(AA25-L25>0,D$29*(AA25-L25))+ROUND($P$14*365/12,2)+('Simple Bill Insert Calc (2)'!M17*2)/12","v":75.640506373418518},{"$f":"E$28*MIN(K25,Z25)+IF(Z25-K25>0,E$29*(Z25-K25))+ROUND($P$14*365/12,2)+('Simple Bill Insert Calc (2)'!M17*2)/12","v":113.04094129330475},{"$f":"E$28*MIN(L25,AA25)+IF(AA25-L25>0,E$29*(AA25-L25))+ROUND($P$14*365/12,2)+('Simple Bill Insert Calc (2)'!M17*2)/12","v":75.640506373418518}]
[null,"10 hot (Sec 745)",{"$f":"C$28*MIN(K26,Z26)+IF(Z26-K26>0,C$29*(Z26-K26))+ROUND($C$31*365/12,2)+('Simple Bill Insert Calc (2)'!M17*2)/12","v":140.51515785234997},{"$f":"C$28*MIN(L26,AA26)+IF(AA26-L26>0,C$29*(AA26-L26))+ROUND($C$31*365/12,2)+('Simple Bill Insert Calc (2)'!M17*2)/12","v":80.270711555973023},{"$f":"D$28*MIN(K26,Z26)+IF(Z26-K26>0,D$29*(Z26-K26))+ROUND($P$14*365/12,2)+('Simple Bill Insert Calc (2)'!M17*2)/12","v":147.95255383952608},{"$f":"D$28*MIN(L26,AA26)+IF(AA26-L26>0,D$29*(AA26-L26))+ROUND($P$14*365/12,2)+('Simple Bill Insert Calc (2)'!M17*2)/12","v":86.247098882284334},{"$f":"E$28*MIN(K26,Z26)+IF(Z26-K26>0,E$29*(Z26-K26))+ROUND($P$14*365/12,2)+('Simple Bill Insert Calc (2)'!M17*2)/12","v":147.95255383952608},{"$f":"E$28*MIN(L26,AA26)+IF(AA26-L26>0,E$29*(AA26-L26))+ROUND($P$14*365/12,2)+('Simple Bill Insert Calc (2)'!M17*2)/12","v":86.247098882284334}]
[null,"13 hot",{"$f":"C$28*MIN(K27,Z27)+IF(Z27-K27>0,C$29*(Z27-K27))+ROUND($C$31*365/12,2)+('Simple Bill Insert Calc (2)'!M17*2)/12","v":206.90517857334945},{"$f":"C$28*MIN(L27,AA27)+IF(AA27-L27>0,C$29*(AA27-L27))+ROUND($C$31*365/12,2)+('Simple Bill Insert Calc (2)'!M17*2)/12","v":106.07654793941936},{"$f":"D$28*MIN(K27,Z27)+IF(Z27-K27>0,D$29*(Z27-K27))+ROUND($P$14*365/12,2)+('Simple Bill Insert Calc (2)'!M17*2)/12","v":215.10409674299228},{"$f":"D$28*MIN(L27,AA27)+IF(AA27-L27>0,D$29*(AA27-L27))+ROUND($P$14*365/12,2)+('Simple Bill Insert Calc (2)'!M17*2)/12","v":112.23463169011838},{"$f":"E$28*MIN(K27,Z27)+IF(Z27-K27>0,E$29*(Z27-K27))+ROUND($P$14*365/12,2)+('Simple Bill Insert Calc (2)'!M17*2)/12","v":215.10409674299228},{"$f":"E$28*MIN(L27,AA27)+IF(AA27-L27>0,E$29*(AA27-L27))+ROUND($P$14*365/12,2)+('Simple Bill Insert Calc (2)'!M17*2)/12","v":112.23463169011838}]
[null,"14 hot",{"$f":"C$28*MIN(K28,Z28)+IF(Z28-K28>0,C$29*(Z28-K28))+ROUND($C$31*365/12,2)+('Simple Bill Insert Calc (2)'!M17*2)/12","v":195.6352795196178},{"$f":"C$28*MIN(L28,AA28)+IF(AA28-L28>0,C$29*(AA28-L28))+ROUND($C$31*365/12,2)+('Simple Bill Insert Calc (2)'!M17*2)/12","v":129.64310847141215},{"$f":"D$28*MIN(K28,Z28)+IF(Z28-K28>0,D$29*(Z28-K28))+ROUND($P$14*365/12,2)+('Simple Bill Insert Calc (2)'!M17*2)/12","v":204.29066745958426},{"$f":"D$28*MIN(L28,AA28)+IF(AA28-L28>0,D$29*(AA28-L28))+ROUND($P$14*365/12,2)+('Simple Bill Insert Calc (2)'!M17*2)/12","v":136.06044689651978},{"$f":"E$28*MIN(K28,Z28)+IF(Z28-K28>0,E$29*(Z28-K28))+ROUND($P$14*365/12,2)+('Simple Bill Insert Calc (2)'!M17*2)/12","v":204.29066745958426},{"$f":"E$28*MIN(L28,AA28)+IF(AA28-L28>0,E$29*(AA28-L28))+ROUND($P$14*365/12,2)+('Simple Bill Insert Calc (2)'!M17*2)/12","v":136.06044689651978}]
[null,"15 hot",{"$f":"C$28*MIN(K29,Z29)+IF(Z29-K29>0,C$29*(Z29-K29))+ROUND($C$31*365/12,2)+('Simple Bill Insert Calc (2)'!M17*2)/12","v":248.59744334007226},{"$f":"C$28*MIN(L29,AA29)+IF(AA29-L29>0,C$29*(AA29-L29))+ROUND($C$31*365/12,2)+('Simple Bill Insert Calc (2)'!M17*2)/12","v":99.935320198408775},{"$f":"D$28*MIN(K29,Z29)+IF(Z29-K29>0,D$29*(Z29-K29))+ROUND($P$14*365/12,2)+('Simple Bill Insert Calc (2)'!M17*2)/12","v":258.0133860210446},{"$f":"D$28*MIN(L29,AA29)+IF(AA29-L29>0,D$29*(AA29-L29))+ROUND($P$14*365/12,2)+('Simple Bill Insert Calc (2)'!M17*2)/12","v":106.0501641522916},{"$f":"E$28*MIN(K29,Z29)+IF(Z29-K29>0,E$29*(Z29-K29))+ROUND($P$14*365/12,2)+('Simple Bill Insert Calc (2)'!M17*2)/12","v":258.0133860210446},{"$f":"E$28*MIN(L29,AA29)+IF(AA29-L29>0,E$29*(AA29-L29))+ROUND($P$14*365/12,2)+('Simple Bill Insert Calc (2)'!M17*2)/12","v":106.0501641522916}]
[null,"16 cool",{"$f":"C$28*MIN(K30,Z30)+IF(Z30-K30>0,C$29*(Z30-K30))+ROUND($C$31*365/12,2)+('Simple Bill Insert Calc (2)'!M17*2)/12","v":155.73797085441481},{"$f":"C$28*MIN(L30,AA30)+IF(AA30-L30>0,C$29*(AA30-L30))+ROUND($C$31*365/12,2)+('Simple Bill Insert Calc (2)'!M17*2)/12","v":110.33440520527222},{"$f":"D$28*MIN(K30,Z30)+IF(Z30-K30>0,D$29*(Z30-K30))+ROUND($P$14*365/12,2)+('Simple Bill Insert Calc (2)'!M17*2)/12","v":163.93736932910625},{"$f":"D$28*MIN(L30,AA30)+IF(AA30-L30>0,D$29*(AA30-L30))+ROUND($P$14*365/12,2)+('Simple Bill Insert Calc (2)'!M17*2)/12","v":116.5224681215082},{"$f":"E$28*MIN(K30,Z30)+IF(Z30-K30>0,E$29*(Z30-K30))+ROUND($P$14*365/12,2)+('Simple Bill Insert Calc (2)'!M17*2)/12","v":163.93736932910625},{"$f":"E$28*MIN(L30,AA30)+IF(AA30-L30>0,E$29*(AA30-L30))+ROUND($P$14*365/12,2)+('Simple Bill Insert Calc (2)'!M17*2)/12","v":116.5224681215082}]
[null,"ALL",{"$f":"SUMPRODUCT(C82:C90,$AC$22:$AC$30)","v":131.76475096845519},{"$f":"SUMPRODUCT(D82:D90,$AC$22:$AC$30)","v":82.668515741607067},139.14243170496439,88.668410132490294,139.14243170496439,88.668410132490294]

{"sheet":"SAR and AR (GS1) (2)","index":11,"n_rows":26,"n_cols":24,"rows_kept":26,"cut":false,"hidden":true,"merged":[[62,18,62,19],[0,1,0,21],[13,6,13,17],[7,6,7,17],[3,6,3,17],[21,5,21,8],[21,13,21,16]]}
[null,"CONFIDENTIAL\nThis Excel Sheet Is Marked Confidential In Accordance With Applicable Law and Regulation.\nBasis for Confidentiality In Accompanying Confidentiality Declaration.\nPublic Disclosure Restricted."]
[null,null,"Revenue Change ($000)"]
[]
[null,"Generation",{"$f":"'Simple Bill Insert Calc (2)'!D8","v":0},null,null,null,"Allocation"]
[null,"Distribution",{"$f":"'Simple Bill Insert Calc (2)'!D9","v":0},null,null,null,"Generation","Distribution","NDC","PPPC","DCPP","NSGC","Transmission","TOTCA","GHG Rev","DWRBC","PUCRF","SECURITIZATION"]
[null,"Nuclear",{"$f":"'Simple Bill Insert Calc (2)'!D10","v":0},null,null,"GS-1",{"$f":"'SAR and AR (GS1)'!G37","v":8.56555441047092E-2},6.7453255573747165E-2,{"$f":"'SAR and AR (GS1)'!I37","v":6.9772361086533924E-2},6.9235310174637035E-2,{"$f":"'SAR and AR (GS1)'!K37","v":7.0452504542625E-2},{"$f":"'SAR and AR (GS1)'!L37","v":7.0228496137111671E-2},{"$f":"'SAR and AR (GS1)'!M37","v":6.906624045328115E-2},{"$f":"'SAR and AR (GS1)'!N37","v":7.0290661987155681E-2},{"$f":"'SAR and AR (GS1)'!O37","v":8.0333625621882176E-2},{"$f":"'SAR and AR (GS1)'!P37","v":7.8012925667049801E-2},{"$f":"'SAR and AR (GS1)'!Q37","v":6.9772360274023171E-2},{"$f":"'SAR and AR (GS1)'!R37","v":8.1486516886440832E-2}]
[null,"Public Purpose",{"$f":"'Simple Bill Insert Calc (2)'!D11","v":0}]
[null,"DCPP",{"$f":"'Simple Bill Insert Calc (2)'!D12","v":0},null,null,null,"Revenue Change ($000) - System"]
[null,"New System Gen",{"$f":"'Simple Bill Insert Calc (2)'!D13","v":0},null,null,"Authorized","Generation","Distribution","NDC","PPPC","DCPP","NSGC","Transmission","TOTCA","GHG Rev","DWRBC","PUCRF","SECURITIZATION","Total","CARE Adj.",null,null,"% of CARE Sales",{"$f":"'SAR and AR (GS1)'!G58","v":0}]
[null,"FERC",{"$f":"'Simple Bill Insert Calc (2)'!D14","v":0},null,null,"GS-1",{"$f":"G6*G11","v":0},{"$f":"H6*H11","v":0},{"$f":"I6*I11","v":0},{"$f":"J6*J11","v":0},{"$f":"K6*K11","v":0},0,0,0,0,0,0,{"$f":"R6*R11","v":0},{"$f":"SUM(G10:R10)","v":0},{"$f":"X14","v":0},null,null,"CARE Effective Discount",{"$f":"'SAR and RAR'!X10","v":0.32500000000000001}]
[null,"TOTCA",{"$f":"'Simple Bill Insert Calc (2)'!D15","v":0},null,null,"Total System",{"$f":"C4","v":0},{"$f":"C5","v":0},{"$f":"C6","v":0},{"$f":"C7","v":0},{"$f":"C8","v":0},{"$f":"C9","v":0},{"$f":"C10","v":0},{"$f":"C11","v":0},{"$f":"C12","v":0},{"$f":"C14","v":0},{"$f":"C15","v":0},{"$f":"C16","v":0},{"$f":"SUM(G11:R11)","v":0},0,null,null,"CARE Discounst",{"$f":"'SAR and RAR (2)'!W11","v":0}]
[null,"GHG Revenue",{"$f":"'Simple Bill Insert Calc (2)'!D16","v":0},null,null,null,null,null,null,null,null,null,null,null,null,null,null,null,null,null,null,null,"GS-1 Sales",{"$f":"'SAR and AR (GS1)'!O58","v":5521410.7975000003}]
[null,"MCAM",0,null,null,null,null,null,null,null,null,null,null,null,null,null,null,null,null,null,null,null,"Total Sales (excl. CARE&SL)",{"$f":"'SAR and AR (GS1)'!G64","v":70344975.441687003}]
[null,"DWR",{"$f":"'Simple Bill Insert Calc (2)'!D17","v":0},null,null,null,"Revenue Split - Bundled",null,null,null,null,null,null,null,null,null,null,null,"Bundled Revenue",null,null,null,"Res CARE Surcharge",{"$f":"X11*X12/X13","v":0}]
[null,"PUCRF",{"$f":"'Simple Bill Insert Calc (2)'!D18","v":0},null,null,null,"Generation","Distribution","NDC","PPPC","DCPP","NSGC","Transmission","TOTCA","GHG Rev","DWRBC","PUCRF","SECURITIZATION","Total"]
[null,"SECURITIZATION",{"$f":"'Simple Bill Insert Calc (2)'!D19","v":0},null,null,"GS-1",{"$f":"'SAR and AR (GS1)'!G44","v":1.0232959419553733},{"$f":"'SAR and AR (GS1)'!H44","v":0.70052317223058247},{"$f":"'SAR and AR (GS1)'!I44","v":0.70219550240200623},{"$f":"'SAR and AR (GS1)'!J44","v":0.70219551589012696},{"$f":"'SAR and AR (GS1)'!K44","v":0.7021955158065214},{"$f":"'SAR and AR (GS1)'!L44","v":0.70219551584666895},{"$f":"'SAR and AR (GS1)'!M44","v":0.70219551583162065},{"$f":"'SAR and AR (GS1)'!N44","v":0.70219552360713355},{"$f":"'SAR and AR (GS1)'!O44","v":0.69314593999279384},{"$f":"'SAR and AR (GS1)'!P44","v":0.70219551587821261},{"$f":"'SAR and AR (GS1)'!Q44","v":0.70219551513317291},{"$f":"'SAR and AR (GS1)'!R44","v":0.7021955154799403},{"$f":"SUMPRODUCT(G10:R10,G16:R16)+T10*H16","v":0}]
[null,"Total",{"$f":"SUM(C4:C16)","v":0},null,null,"Total System",{"$f":"'SAR and AR (GS1)'!G50","v":1.0300079979939982},{"$f":"'SAR and AR (GS1)'!H50","v":0.64971955806985959},{"$f":"'SAR and AR (GS1)'!I50","v":0.62830287983182231},{"$f":"'SAR and AR (GS1)'!J50","v":0.64289120974341818},{"$f":"'SAR and AR (GS1)'!K50","v":0.64095261765727696},{"$f":"'SAR and AR (GS1)'!L50","v":0.63866644750913237},{"$f":"'SAR and AR (GS1)'!M50","v":0.66417763828823584},{"$f":"'SAR and AR (GS1)'!N50","v":0.65322305642427669},{"$f":"'SAR and AR (GS1)'!O50","v":0.6916053708131884},{"$f":"'SAR and AR (GS1)'!P50","v":0.6118326262408581},{"$f":"'SAR and AR (GS1)'!Q50","v":0.6283028839215079},{"$f":"'SAR and AR (GS1)'!R50","v":0.62262350370857455},{"$f":"SUMPRODUCT(G11:R11,G17:R17)","v":0}]
[]
[null,null,null,null,null,null,null,null,null,null,null,null,null,null,null,null,null,null,{"$f":"O10*O16","v":0}]
[]
[]
[null,null,null,null,null,"Bundled",null,null,null,null,null,null,null,"System (Bundled and Unbundled)"]
[null,null,null,null,null,"2025 Sales",{"$f":"'SAR and RAR (2)'!F23","v":"11/15/2025 Avg Rates"},"Proposed Avg Rates (Authorized)","% Change (Authorized)",null,null,null,null,{"$f":"F23","v":"2025 Sales"},{"$f":"G23","v":"11/15/2025 Avg Rates"},"Proposed Avg Rates (Authorized)","% Change (Authorized)"]
[null,null,null,null,"GS-1",{"$f":"'SAR and AR (GS1)'!K58","v":3877109.9032000001},{"$f":"IF('Simple Bill Insert Calc (2)'!$D$6=\"Y\",'SAR and AR (GS1)'!W31,'SAR and AR (GS1)'!X31)","v":31.983408553249816},{"$f":"S16/F24*100+G24","v":31.983408553249816},{"$f":"H24/G24-1","v":0},null,null,null,"GS-1",{"$f":"'SAR and AR (GS1)'!O58","v":5521410.7975000003},{"$f":"IF('Simple Bill Insert Calc (2)'!$D$6=\"Y\",'SAR and AR (GS1)'!Z31,'SAR and AR (GS1)'!AA31)","v":28.072807513619431},{"$f":"SUM(S10:T10)/N24*100+O24","v":28.072807513619431},{"$f":"P24/O24-1","v":0}]
[null,null,null,null,"Total Bundled",{"$f":"'SAR and AR (GS1)'!K64","v":49720524.250294097},{"$f":"IF('Simple Bill Insert Calc (2)'!$D$6=\"Y\",'SAR and RAR'!W33,'SAR and RAR'!X33)","v":30.163203046939159},{"$f":"S17/F25*100+G25","v":30.163203046939159},{"$f":"H25/G25-1","v":0},null,null,null,"Total System",{"$f":"'SAR and AR (GS1)'!O64","v":79134642.730374098},{"$f":"IF('Simple Bill Insert Calc (2)'!$D$6=\"Y\",'SAR and RAR'!Z33,'SAR and RAR'!AA33)","v":25.126029785552312},{"$f":"S11/N25*100+O25","v":25.126029785552312},{"$f":"P25/O25-1","v":0}]
[null,null,null,null,{"$f":"M25","v":"Total System"},{"$f":"N25","v":79134642.730374098}]

{"sheet":"Bill Impact (GS1) (2)","index":12,"n_rows":39,"n_cols":21,"rows_kept":39,"cut":false,"hidden":true,"merged":[[1,1,1,3],[2,4,2,9],[19,8,19,9],[0,1,0,21],[19,10,19,11],[33,2,33,9],[34,2,34,3],[34,4,34,5],[34,6,34,7],[34,8,34,9]]}
[null,"CONFIDENTIAL\nThis Excel Sheet Is Marked Confidential In Accordance With Applicable Law and Regulation.\nBasis for Confidentiality In Accompanying Confidentiality Declaration.\nPublic Disclosure Restricted."]
[]
[null,null,null,null,"Schedule TOU-GS-1-E"]
[null,null,null,null,{"$f":"'Bill Impact (GS1)'!E4","v":2025},{"$f":"'Bill Impact (GS1)'!F4","v":"2025-11-15"},"Proposed","Proposed"]
[null,null,null,null,"Sales Forecast","Rates","Rates"," Revenue"]
[]
[null,null,null,"On Peak",{"$f":"'Bill Impact (GS1)'!F44","v":242.75892288899999},{"$f":"'Bill Impact (GS1)'!F7","v":0.69964000000000004},{"$f":"F7/$F$12*$G$12","v":0.69964000000000015},{"$f":"E7*G7","v":169.84385281005999},null,null,null,null,null,"Bundled GS-1 Rev Req "]
[null,null,null,"Mid Peak",{"$f":"'Bill Impact (GS1)'!F45","v":86.270995113999987},{"$f":"'Bill Impact (GS1)'!F8","v":0.35092999999999996},{"$f":"F8/$F$12*$G$12","v":0.35093000000000002},30.275080315356018,null,null,null,null,null,"Current",{"$f":"SUMPRODUCT(E7:E12,F7:F12)+(E14*F14*365/12/10^6)","v":1238.938706484669}]
[null,null,null,"Off Peak",{"$f":"'Bill Impact (GS1)'!F46","v":1077.8460354399999},{"$f":"'Bill Impact (GS1)'!F9","v":0.26244999999999996},0.26244999999999996,282.88069200122794,null,null,null,null,null,"Change",{"$f":"'SAR and AR (GS1) (2)'!S16/1000-'SAR and AR (GS1) (2)'!S19/1000","v":0}]
[null,null,null,"Mid Peak",{"$f":"'Bill Impact (GS1)'!F47","v":566.12601805400004},{"$f":"'Bill Impact (GS1)'!F10","v":0.41642999999999997},0.41643000000000002,235.75185769822724,null,null,null,null,null,"Proposed Change",{"$f":"SUM(O8:O9)","v":1238.938706484669}]
[null,null,null,"Off Peak",{"$f":"'Bill Impact (GS1)'!F48","v":955.88494204999995},{"$f":"'Bill Impact (GS1)'!F11","v":0.27866999999999997},{"$f":"F11/$F$12*$G$12","v":0.27867000000000003},266.37645680107352,null,null,null,null,null,null,{"$f":"O10-SUM(H7:H14)","v":0}]
[null,null,null,"SuperOff Peak",{"$f":"'Bill Impact (GS1)'!F49","v":948.22298967000017},{"$f":"'Bill Impact (GS1)'!F12","v":0.20346999999999998},{"$f":"(O10-G14*E14*365/12/10^6)/SUM(E12,F11/F12*E11,F10/F12*E10,F9/F12*E9,F8/F12*E8,F7/F12*E7)","v":0.20347000000000001},192.93493170815495]
[]
[null,null,null,"Customers",{"$f":"'Bill Impact (GS1)'!F51","v":4276490.0000400003},0.46800000000000003,{"$f":"F14","v":0.46800000000000003},{"$f":"G14*E14*365/12/10^6","v":60.875835150569408}]
[]
[]
[]
[]
[null,null,null,null,null,null,null,null,null,null,null,null,null,{"$f":"'Bill Impact (GS1)'!N19","v":"2024 Recorded Data"}]
[null,"SCHEDULE TOU-GS-1-E ($/kWh)",null,null,null,null,null,null,null,null,null,null,null,"NAICS","Summer",null,null,"Winter"]
[null,"Rates",{"$f":"'Bill Impact (GS1)'!C21","v":"Jan 2025"},{"$f":"Summary!N3","v":"2025-11-15"},"Proposed",null,null,null,null,null,null,null,null,null,"On Peak kWh","Mid Peak kWh","Off Peak kWh","Mid Peak kWh","Off Peak kWh","Super Off Peak kWh","Total kWh"]
[null,"On Peak",{"$f":"'Bill Impact (GS1)'!C22","v":0.61368},{"$f":"F7","v":0.69964000000000004},{"$f":"G7","v":0.69964000000000015},null,null,null,null,null,null,null,null,"NAICS 531",{"$f":"'Bill Impact (GS1)'!O22","v":424.40005556824076},{"$f":"'Bill Impact (GS1)'!P22","v":171.04185413123349},{"$f":"'Bill Impact (GS1)'!Q22","v":2142.0437492858159},{"$f":"'Bill Impact (GS1)'!R22","v":1242.2937320811102},{"$f":"'Bill Impact (GS1)'!S22","v":2623.0984880161704},{"$f":"'Bill Impact (GS1)'!T22","v":1422.3051850127858},{"$f":"SUM(O22:T22)","v":8025.1830640953567}]
[null,"Mid Peak",{"$f":"'Bill Impact (GS1)'!C23","v":0.31883},{"$f":"F8","v":0.35092999999999996},0.35093000000000002,null,null,null,null,null,null,null,null,"NAICS 621",{"$f":"'Bill Impact (GS1)'!O23","v":797.571595913279},{"$f":"'Bill Impact (GS1)'!P23","v":197.86533053051838},{"$f":"'Bill Impact (GS1)'!Q23","v":3613.515045296092},{"$f":"'Bill Impact (GS1)'!R23","v":1413.2746415812949},{"$f":"'Bill Impact (GS1)'!S23","v":2031.5831616473401},{"$f":"'Bill Impact (GS1)'!T23","v":3587.6907218169667},{"$f":"SUM(O23:T23)","v":11641.500496785491}]
[null,"Off Peak",{"$f":"'Bill Impact (GS1)'!C24","v":0.24032000000000003},0.26244999999999996,0.26244999999999996,null,null,null,null,null,null,null,null,"NAICS 722",{"$f":"'Bill Impact (GS1)'!O24","v":2427.2089735988638},{"$f":"'Bill Impact (GS1)'!P24","v":1047.857092196117},{"$f":"'Bill Impact (GS1)'!Q24","v":9631.2947946842687},{"$f":"'Bill Impact (GS1)'!R24","v":5240.8289450835409},{"$f":"'Bill Impact (GS1)'!S24","v":6947.0905233018239},{"$f":"'Bill Impact (GS1)'!T24","v":8200.9311622140394},33495.211491078655]
[null,"Mid Peak",{"$f":"'Bill Impact (GS1)'!C25","v":0.37421000000000004},0.41642999999999997,0.41643000000000002]
[null,"Off Peak",{"$f":"'Bill Impact (GS1)'!C26","v":0.25403000000000003},0.27866999999999997,0.27867000000000003]
[null,"Super Off Peak",{"$f":"'Bill Impact (GS1)'!C27","v":0.18872999999999998},0.20346999999999998,0.20347000000000001]
[]
[]
[]
[]
[null,null,"Daily to Monthly Conversion Factor",30.417000000000002]
[]
[null,null,"TOU-GS-1-E"]
[null,null,{"$f":"C21","v":"Jan 2025"},null,{"$f":"D21","v":"2025-11-15"},null,{"$f":"E21","v":"Proposed"}]
[null,null,"Summer","Winter","Summer","Winter","Summer","Winter"]
[null,"NAICS 531",{"$f":"SUM(SUM($O$22*$C$22,$P$22*$C$23,$Q$22*$C$24)+SUM($F$14*365/12*4))/4","v":221.67376357053666},{"$f":"SUM(SUM($R$22*$C$25,$S$22*$C$26,$T$22*$C$27)+SUM($F$14*365/12*8))/8","v":189.19201299503538},{"$f":"SUM(SUM($O$22*$D$22,$P$22*$D$23,$Q$22*$D$24)+SUM($F$14*365/12*4))/4","v":244.01758868702501},{"$f":"SUM(SUM($R$22*$D$25,$S$22*$D$26,$T$22*$D$27)+SUM($F$14*365/12*8))/8","v":206.44795881256928},{"$f":"SUM(SUM($O$22*$E$22,$P$22*$E$23,$Q$22*$E$24)+SUM($G$14*365/12*4))/4","v":244.01758868702504},{"$f":"SUM(SUM($R$22*$E$25,$S$22*$E$26,$T$22*$E$27)+SUM($G$14*365/12*8))/8","v":206.44795881256937}]
[null,"NAICS 621",{"$f":"SUM(SUM($O$23*$C$22,$P$23*$C$23,$Q$23*$C$24)+SUM($F$14*365/12*4))/4","v":369.4697689996658},{"$f":"SUM(SUM($R$23*$C$25,$S$23*$C$26,$T$23*$C$27)+SUM($F$14*365/12*8))/8","v":229.4911805134908},{"$f":"SUM(SUM($O$23*$D$22,$P$23*$D$23,$Q$23*$D$24)+SUM($F$14*365/12*4))/4","v":408.18922386145016},{"$f":"SUM(SUM($R$23*$D$25,$S$23*$D$26,$T$23*$D$27)+SUM($F$14*365/12*8))/8","v":249.81733372725762},{"$f":"SUM(SUM($O$23*$E$22,$P$23*$E$23,$Q$23*$E$24)+SUM($F$14*365/12*4))/4","v":408.18922386145016},{"$f":"SUM(SUM($R$23*$E$25,$S$23*$E$26,$T$23*$E$27)+SUM($F$14*365/12*8))/8","v":249.81733372725768}]
[null,"NAICS 722",{"$f":"SUM(SUM($O$24*$C$22,$P$24*$C$23,$Q$24*$C$24)+SUM($F$14*365/12*4))/4","v":1048.7876611703905},{"$f":"SUM(SUM($R$24*$C$25,$S$24*$C$26,$T$24*$C$27)+SUM($F$14*365/12*8))/8","v":673.44771792734139},{"$f":"SUM(SUM($O$24*$D$22,$P$24*$D$23,$Q$24*$D$24)+SUM($F$14*365/12*4))/4","v":1162.6425736294943},{"$f":"SUM(SUM($R$24*$D$25,$S$24*$D$26,$T$24*$D$27)+SUM($F$14*365/12*8))/8","v":737.61344716316853},{"$f":"SUM(SUM($O$24*$E$22,$P$24*$E$23,$Q$24*$E$24)+SUM($F$14*365/12*4))/4","v":1162.6425736294946},{"$f":"SUM(SUM($R$24*$E$25,$S$24*$E$26,$T$24*$E$27)+SUM($F$14*365/12*8))/8","v":737.61344716316864}]