{"text_format":"1","workbook":"xlsx","n_sheets":13,"sheets":["Summary","Selected Data","Authorized Rev Req","Incremental Rev Req","SAR and AR (GS1)","Bill Impact (GS1)","SAR and RAR","Res Bill Impact","Simple Bill Insert Calc (2)","SAR and RAR (2)","Res Bill Impact (2)","SAR and AR (GS1) (2)","Bill Impact (GS1) (2)"],"not_rendered":{"charts":0,"images":0,"macros":1,"external_links":0,"defined_names":149,"comments":4,"pivot_tables":0},"unopened":[],"bounds":{"document_bytes":16777216,"sheet_cells":100000,"rows_first":2000,"rows_last":500,"rows_between":2000,"halvings":0,"cell_chars":16384,"cell_head_chars":4096},"cells_cut":0,"cells_raw":0,"read":"whole","date_system":"1900"}

{"sheet":"Summary","index":0,"n_rows":129,"n_cols":20,"rows_kept":129,"cut":false,"hidden":false,"merged":[[122,1,122,2],[126,1,126,2],[127,1,127,2],[128,1,128,2],[114,1,114,2],[115,1,115,2],[116,1,116,2],[120,1,120,2],[121,1,121,2],[109,1,109,2],[110,1,110,2],[102,1,102,2],[103,1,103,2],[104,1,104,2],[108,1,108,2],[67,1,67,2],[72,1,72,2],[96,1,96,2],[97,1,97,2],[98,1,98,2],[40,1,40,2],[45,1,45,2],[58,1,58,2],[90,1,90,2],[91,1,91,2],[85,1,85,2],[86,1,86,2],[59,1,59,2],[80,1,80,2],[81,1,81,2],[60,1,60,2],[61,1,61,2],[75,1,75,2],[73,1,73,2],[74,1,74,2],[65,1,65,2],[46,1,46,2],[41,1,41,2],[66,1,66,2],[68,1,68,2],[30,11,30,19],[34,1,34,2],[31,1,31,2],[32,1,32,2],[31,11,31,12],[32,11,32,12],[34,11,34,12],[53,1,53,2],[51,1,51,2],[52,1,52,2],[47,1,47,2],[39,1,39,2]]}
[]
[null,"Inputs:",null,null,null,null,null,null,null,null,null,"Assumptions:",null,"Current year plus three required data set."]
[null,null,"Rate Impact for Year (2025-2029)",2025,null,null,null,null,"Include CA Climate Credit in Rates","N",null,"Current Effective Rates",null,"2025-11-15"]
[null,null,"Baseline Region - (Residential bill)","9 warm",null,null,null,null,"Typical residential average usage kWh/month",500,null,"Sales Forecast",null,{"$f":"D3","v":2025}]
[null,null,null,null,null,null,null,null,null,null,null,"Residential bill calculated using ",null,"Schedule D, Basic, Single Family",null,null,null,null,"Annual Usage"]
[null,null,null,null,null,null,null,null,null,null,null,"Non-CARE bill impact calculated with average summer usage of ",null,null,null,{"$f":"IF($D$4=\"All\",SUMPRODUCT('Res Bill Impact'!P$22:P$30,'Res Bill Impact'!$T$22:$T$30),VLOOKUP(D$4,'Res Bill Impact'!$O$22:$S$30,2,FALSE))","v":736.18963415586904},"kWh per month","Non-CARE",{"$f":"(P6*4)+(P7*8)","v":6577.1927029417802}]
{"$rows_left_out":124}
{"sheet":"Selected Data","index":1,"n_rows":76,"n_cols":21,"rows_kept":76,"cut":false,"hidden":false,"merged":[]}
["Summary of Selected Data "]
[null,null,null,null,null,null,null,null,null,null,null,null,null,"2025 Revenue"]
[null,null,null,null,null,null,null,null,null,null,null,null,null," Requirement"]
[null,null,null,null,null,null,null,null,null,null,null,null,null,"$000"]
[1,"Current total system-level revenue requirement that is used for defining the reporting threshold:",null,null,null,null,null,null,null,null,null,null,null,{"$f":"'Authorized Rev Req'!J99","v":19339861.87672767}]
[]
{"$rows_left_out":71}
{"sheet":"Authorized Rev Req","index":2,"n_rows":105,"n_cols":14,"rows_kept":105,"cut":false,"hidden":false,"merged":[[102,1,103,2],[104,1,105,11]]}
[]
[null,"Annual Period 2025"]
[null,"Reporting Date: Quarter Ended December 31"]
[null,null,"January 1, 2024","March 1, 2024","June 1, 2024","October 1, 2024","January 1, 2025","March 1, 2025","June 1, 2025","October 1, 2025","January 1, 20261"]
[null,null,"5178-E","5235-E","5307-E","5379-E / E-A","5449-E","5484-E","5555-E","5643-E","5687-E"]
[null,"Filing Description",null,null,null,null,null,null,null,null,null,"Revenue Recovery Mechanism","Authority for Revenue Requirement","Balancing Account "]
{"$rows_left_out":100}
{"sheet":"Incremental Rev Req","index":3,"n_rows":143,"n_cols":24,"rows_kept":143,"cut":false,"hidden":false,"merged":[]}
[]
["Annual Period 2025"]
["Reporting Date: Quarter Ended December 31"]
[]
["Current Revenue Requirement ($000):",{"$f":"'Authorized Rev Req'!J98","v":19403169.590911627},"Inc. PUCRF"]
["Current Revenue Requirement Effective:","October 1, 2025"]
{"$rows_left_out":138}
{"sheet":"SAR and AR (GS1)","index":4,"n_rows":77,"n_cols":27,"rows_kept":77,"cut":false,"hidden":true,"merged":[[25,5,25,10],[25,13,25,18],[63,18,63,19],[0,1,0,21],[1,2,1,3],[3,6,3,15],[7,6,7,15],[16,6,16,15],[16,18,16,19]]}
[null,"CONFIDENTIAL\nThis Excel Sheet Is Marked Confidential In Accordance With Applicable Law and Regulation.\nBasis for Confidentiality In Accompanying Confidentiality Declaration.\nPublic Disclosure Restricted."]
[null,null,"Total Revenue ($000)"]
[null,null,"Authorized","w/ Pending"]
[null,"Generation",{"$f":"INDEX('Incremental Rev Req'!$S$9:$X$22,MATCH(B4,'Incremental Rev Req'!$S$9:$S$22,0),MATCH(Summary!$D$3,'Incremental Rev Req'!$S$9:$X$9,0))","v":5525852.9476728207},{"$f":"INDEX('Incremental Rev Req'!$S$69:$X$82,MATCH(B4,'Incremental Rev Req'!$S$69:$S$82,0),MATCH(Summary!$D$3,'Incremental Rev Req'!$S$69:$X$69,0))","v":5525852.9476728207},null,null,"Allocation"]
[null,"Distribution",{"$f":"INDEX('Incremental Rev Req'!$S$9:$X$22,MATCH(B5,'Incremental Rev Req'!$S$9:$S$22,0),MATCH(Summary!$D$3,'Incremental Rev Req'!$S$9:$X$9,0))","v":10708193.85627551},{"$f":"INDEX('Incremental Rev Req'!$S$69:$X$82,MATCH(B5,'Incremental Rev Req'!$S$69:$S$82,0),MATCH(Summary!$D$3,'Incremental Rev Req'!$S$69:$X$69,0))","v":10708193.85627551},null,null,"Generation","Distribution","NDC","PPPC","DCPP","NSGC","Transmission","TOTCA","GHG Rev","DWRBC","PUCRF","SECURITIZATION"]
[null,"Nuclear",{"$f":"INDEX('Incremental Rev Req'!$S$9:$X$22,MATCH(B6,'Incremental Rev Req'!$S$9:$S$22,0),MATCH(Summary!$D$3,'Incremental Rev Req'!$S$9:$X$9,0))","v":-915.75073764498552},{"$f":"INDEX('Incremental Rev Req'!$S$69:$X$82,MATCH(B6,'Incremental Rev Req'!$S$69:$S$82,0),MATCH(Summary!$D$3,'Incremental Rev Req'!$S$69:$X$69,0))","v":-915.75073764498552},null,"GS-1",{"$f":"VLOOKUP(Summary!$D$3,'SAR and AR (GS1)'!$F$37:$R$42,'SAR and AR (GS1)'!G$35,FALSE)","v":8.56555441047092E-2},{"$f":"VLOOKUP(Summary!$D$3,'SAR and AR (GS1)'!$F$37:$R$42,'SAR and AR (GS1)'!H$35,FALSE)","v":6.6981813261656364E-2},{"$f":"VLOOKUP(Summary!$D$3,'SAR and AR (GS1)'!$F$37:$R$42,'SAR and AR (GS1)'!I$35,FALSE)","v":6.9772361086533924E-2},{"$f":"VLOOKUP(Summary!$D$3,'SAR and AR (GS1)'!$F$37:$R$42,'SAR and AR (GS1)'!J$35,FALSE)","v":7.0833414404385592E-2},{"$f":"VLOOKUP(Summary!$D$3,'SAR and AR (GS1)'!$F$37:$R$42,'SAR and AR (GS1)'!K$35,FALSE)","v":7.0452504542625E-2},{"$f":"VLOOKUP(Summary!$D$3,'SAR and AR (GS1)'!$F$37:$R$42,'SAR and AR (GS1)'!L$35,FALSE)","v":7.0228496137111671E-2},{"$f":"VLOOKUP(Summary!$D$3,'SAR and AR (GS1)'!$F$37:$R$42,'SAR and AR (GS1)'!M$35,FALSE)","v":6.906624045328115E-2},{"$f":"VLOOKUP(Summary!$D$3,'SAR and AR (GS1)'!$F$37:$R$42,'SAR and AR (GS1)'!N$35,FALSE)","v":7.0290661987155681E-2},{"$f":"VLOOKUP(Summary!$D$3,'SAR and AR (GS1)'!$F$37:$R$42,'SAR and AR (GS1)'!O$35,FALSE)","v":8.0333625621882176E-2},{"$f":"VLOOKUP(Summary!$D$3,'SAR and AR (GS1)'!$F$37:$R$42,'SAR and AR (GS1)'!P$35,FALSE)","v":7.8012925667049801E-2},{"$f":"VLOOKUP(Summary!$D$3,'SAR and AR (GS1)'!$F$37:$R$42,'SAR and AR (GS1)'!Q$35,FALSE)","v":6.9772360274023171E-2},{"$f":"VLOOKUP(Summary!$D$3,'SAR and AR (GS1)'!$F$37:$R$42,'SAR and AR (GS1)'!R$35,FALSE)","v":8.1486516886440832E-2}]
{"$rows_left_out":72}
{"sheet":"Bill Impact (GS1)","index":5,"n_rows":55,"n_cols":21,"rows_kept":55,"cut":false,"hidden":true,"merged":[[19,10,19,11],[33,2,33,9],[0,1,0,21],[34,2,34,3],[34,4,34,5],[34,6,34,7],[34,8,34,9],[1,1,1,3],[2,4,2,9],[19,8,19,9]]}
[null,"CONFIDENTIAL\nThis Excel Sheet Is Marked Confidential In Accordance With Applicable Law and Regulation.\nBasis for Confidentiality In Accompanying Confidentiality Declaration.\nPublic Disclosure Restricted."]
[]
[null,null,null,null,"Schedule TOU-GS-1-E"]
[null,null,null,null,{"$f":"Summary!N4","v":2025},{"$f":"Summary!N3","v":"2025-11-15"},"Proposed","Proposed","Proposed","Proposed"]
[null,null,null,null,"Sales Forecast","Rates","Authorized Rates","Authorized Revenue","w/Pending Rates","w/Pending Revenue"]
[]
{"$rows_left_out":50}
{"sheet":"SAR and RAR","index":6,"n_rows":77,"n_cols":27,"rows_kept":77,"cut":false,"hidden":true,"merged":[[63,18,63,19],[25,5,25,10],[25,13,25,18],[0,1,0,21],[7,6,7,15],[1,2,1,3],[16,6,16,15],[3,6,3,15],[16,18,16,19]]}
[null,"CONFIDENTIAL\nThis Excel Sheet Is Marked Confidential In Accordance With Applicable Law and Regulation.\nBasis for Confidentiality In Accompanying Confidentiality Declaration.\nPublic Disclosure Restricted."]
[null,null,"Total Revenue ($000)"]
[null,null,"Authorized","w/ Pending"]
[null,"Generation",{"$f":"INDEX('Incremental Rev Req'!$S$9:$X$22,MATCH(B4,'Incremental Rev Req'!$S$9:$S$22,0),MATCH(Summary!$D$3,'Incremental Rev Req'!$S$9:$X$9,0))","v":5525852.9476728207},{"$f":"INDEX('Incremental Rev Req'!$S$69:$X$82,MATCH(B4,'Incremental Rev Req'!$S$69:$S$82,0),MATCH(Summary!$D$3,'Incremental Rev Req'!$S$69:$X$69,0))","v":5525852.9476728207},null,null,"Allocation"]
[null,"Distribution",{"$f":"INDEX('Incremental Rev Req'!$S$9:$X$22,MATCH(B5,'Incremental Rev Req'!$S$9:$S$22,0),MATCH(Summary!$D$3,'Incremental Rev Req'!$S$9:$X$9,0))","v":10708193.85627551},{"$f":"INDEX('Incremental Rev Req'!$S$69:$X$82,MATCH(B5,'Incremental Rev Req'!$S$69:$S$82,0),MATCH(Summary!$D$3,'Incremental Rev Req'!$S$69:$X$69,0))","v":10708193.85627551},null,null,"Generation","Distribution","NDC","PPPC","DCPP","NSGC","Transmission","TOTCA","GHG Rev","DWRBC","PUCRF","SECURITIZATION"]
[null,"Nuclear",{"$f":"INDEX('Incremental Rev Req'!$S$9:$X$22,MATCH(B6,'Incremental Rev Req'!$S$9:$S$22,0),MATCH(Summary!$D$3,'Incremental Rev Req'!$S$9:$X$9,0))","v":-915.75073764498552},{"$f":"INDEX('Incremental Rev Req'!$S$69:$X$82,MATCH(B6,'Incremental Rev Req'!$S$69:$S$82,0),MATCH(Summary!$D$3,'Incremental Rev Req'!$S$69:$X$69,0))","v":-915.75073764498552},null,"Residential",{"$f":"VLOOKUP(Summary!$D$3,'SAR and RAR'!$F$37:$R$42,'SAR and RAR'!G$35,FALSE)","v":0.43353664097137312},{"$f":"VLOOKUP(Summary!$D$3,'SAR and RAR'!$F$37:$R$42,'SAR and RAR'!H$35,FALSE)","v":0.489526966969619},{"$f":"VLOOKUP(Summary!$D$3,'SAR and RAR'!$F$37:$R$42,'SAR and RAR'!I$35,FALSE)","v":0.3376537252060986},{"$f":"VLOOKUP(Summary!$D$3,'SAR and RAR'!$F$37:$R$42,'SAR and RAR'!J$35,FALSE)","v":0.43749935944966239},{"$f":"VLOOKUP(Summary!$D$3,'SAR and RAR'!$F$37:$R$42,'SAR and RAR'!K$35,FALSE)","v":0.4505009853364747},{"$f":"VLOOKUP(Summary!$D$3,'SAR and RAR'!$F$37:$R$42,'SAR and RAR'!L$35,FALSE)","v":0.43823032581794397},{"$f":"VLOOKUP(Summary!$D$3,'SAR and RAR'!$F$37:$R$42,'SAR and RAR'!M$35,FALSE)","v":0.46381018246062999},{"$f":"VLOOKUP(Summary!$D$3,'SAR and RAR'!$F$37:$R$42,'SAR and RAR'!N$35,FALSE)","v":0.5669366333554875},{"$f":"VLOOKUP(Summary!$D$3,'SAR and RAR'!$F$37:$R$42,'SAR and RAR'!O$35,FALSE)","v":0.82642497364889311},{"$f":"VLOOKUP(Summary!$D$3,'SAR and RAR'!$F$37:$R$42,'SAR and RAR'!P$35,FALSE)","v":0.2594263611204975},{"$f":"VLOOKUP(Summary!$D$3,'SAR and RAR'!$F$37:$R$42,'SAR and RAR'!Q$35,FALSE)","v":0.33765372536611121},{"$f":"VLOOKUP(Summary!$D$3,'SAR and RAR'!$F$37:$R$42,'SAR and RAR'!R$35,FALSE)","v":0.36749008607402561}]
{"$rows_left_out":72}
{"sheet":"Res Bill Impact","index":7,"n_rows":108,"n_cols":30,"rows_kept":108,"cut":false,"hidden":true,"merged":[[63,12,63,19],[63,22,63,29],[64,2,64,3],[64,4,64,5],[64,6,64,7],[64,8,64,9],[64,22,64,23],[63,2,63,9],[79,2,79,3],[79,4,79,5],[79,6,79,7],[79,8,79,9],[64,18,64,19],[64,12,64,13],[64,14,64,15],[64,16,64,17],[78,2,78,9],[19,27,19,28],[20,23,20,24],[20,25,20,26],[64,24,64,25],[64,26,64,27],[64,28,64,29],[48,22,48,29],[49,22,49,23],[49,24,49,25],[49,26,49,27],[49,28,49,29],[33,22,33,29],[34,22,34,23],[34,24,34,25],[34,26,34,27],[34,28,34,29],[48,12,48,19],[49,12,49,13],[49,14,49,15],[49,16,49,17],[49,18,49,19],[49,2,49,3],[49,4,49,5],[34,6,34,7],[34,8,34,9],[33,2,33,9],[49,6,49,7],[49,8,49,9],[48,2,48,9],[1,1,1,3],[34,2,34,3],[34,4,34,5],[2,4,2,9],[2,14,2,19],[20,15,20,16],[20,17,20,18],[19,19,19,20],[19,8,19,9],[19,10,19,11],[33,12,33,19],[34,12,34,13],[34,14,34,15],[34,16,34,17],[34,18,34,19]]}
["CONFIDENTIAL\nThe Attachment(s) Are Marked Confidential In Accordance With D. 16-08-024 and D. 17-09-023. Basis for Confidentiality In Accompanying Confidentiality Declaration.\n"]
[]
[null,null,null,null,"Schedule D",null,null,null,null,null,null,null,null,null,"Schedule D-CARE"]
[null,null,null,null,{"$f":"Summary!N4","v":2025},{"$f":"Summary!N3","v":"2025-11-15"},"Proposed","Proposed","Proposed","Proposed",null,null,null,null,{"$f":"Summary!N4","v":2025},{"$f":"Summary!N3","v":"2025-11-15"},"Proposed","Proposed","Proposed","Proposed"]
[null,null,null,null,"Sales Forecast","Rates","Authorized Rates","Authorized Revenue","w/Pending Rates","w/Pending Revenue",null,null,null,null,"Sales Forecast","Rates","Authorized Rates","Authorized Revenue","w/Pending Rates","w/Pending Revenue"]
[null,null,null,null,null,"w/ BSC",null,null,null,null,null,null,null,null,null,"w/ BSC"]
{"$rows_left_out":103}
{"sheet":"Simple Bill Insert Calc (2)","index":8,"n_rows":122,"n_cols":17,"rows_kept":122,"cut":false,"hidden":false,"merged":[[102,1,102,2],[103,1,103,2],[93,1,93,7],[95,1,95,2],[96,1,96,2],[97,1,97,2],[99,1,99,7],[101,1,101,2],[91,1,91,2],[73,1,73,2],[74,1,74,2],[76,1,76,7],[78,1,78,2],[79,1,79,2],[81,1,81,7],[83,1,83,2],[84,1,84,2],[87,1,87,7],[89,1,89,2],[90,1,90,2],[71,1,71,7],[54,1,54,2],[56,1,56,7],[58,1,58,2],[59,1,59,2],[60,1,60,2],[61,1,61,2],[63,1,63,7],[65,1,65,2],[66,1,66,2],[67,1,67,2],[68,1,68,2],[53,1,53,2],[36,1,36,7],[38,1,38,2],[39,1,39,2],[40,1,40,2],[42,1,42,7],[44,1,44,2],[45,1,45,2],[46,1,46,2],[49,1,49,7],[51,1,51,2],[52,1,52,2],[33,1,33,2],[22,1,22,7],[22,9,22,15],[23,1,23,2],[23,9,23,10],[24,1,24,2],[24,9,24,10],[26,1,26,2],[26,9,26,10],[29,1,29,7],[31,1,31,2],[32,1,32,2],[115,1,115,2],[119,1,119,2],[120,1,120,2],[121,1,121,2],[105,1,105,7],[111,1,111,7],[117,1,117,7],[107,1,107,2],[108,1,108,2],[109,1,109,2],[113,1,113,2],[114,1,114,2]]}
[]
[null,"Inputs:",null,null,null,null,null,null,null,null,"Assumptions:"]
[null,null,null,null,null,null,null,null,null,null,"Current Effective Rates",null,{"$f":"Summary!N3","v":"2025-11-15"}]
[null,null,"Baseline Region - (Residential bill)","9 warm",null,null,null,null,null,null,"Sales Forecast",null,2025]
[null,null,"Typical residential average usage kWh/month",500,null,null,null,null,null,null,"Residential bill calculated using ",null,"Schedule D, Basic, Single Family"]
[null,null,"Include CA Climate Credit in Rates","N",null,null,null,null,null,null,"Non-CARE bill impact calculated with average summer usage of ",null,null,null,{"$f":"IF($D$4=\"All\",SUMPRODUCT('Res Bill Impact (2)'!P$22:P$30,'Res Bill Impact (2)'!$T$22:$T$30),VLOOKUP(D$4,'Res Bill Impact (2)'!$O$22:$S$30,2,FALSE))","v":736.18963415586904},"kWh per month"]
{"$rows_left_out":117}
{"sheet":"SAR and RAR (2)","index":9,"n_rows":25,"n_cols":23,"rows_kept":25,"cut":false,"hidden":true,"merged":[[0,1,0,21],[45,17,45,18],[3,5,3,14],[7,5,7,14],[13,5,13,15],[21,4,21,7],[21,12,21,15]]}
[null,"CONFIDENTIAL\nThis Excel Sheet Is Marked Confidential In Accordance With Applicable Law and Regulation.\nBasis for Confidentiality In Accompanying Confidentiality Declaration.\nPublic Disclosure Restricted."]
[null,null,"Revenue Change ($000)"]
[]
[null,"Generation",{"$f":"'Simple Bill Insert Calc (2)'!D8","v":0},null,null,"Allocation"]
[null,"Distribution",{"$f":"'Simple Bill Insert Calc (2)'!D9","v":0},null,null,"Generation","Distribution","NDC","PPPC","DCPP","NSGC","Transmission","TOTCA","GHG Rev","DWRBC","PUCRF","SECURITIZATION"]
[null,"Nuclear",{"$f":"'Simple Bill Insert Calc (2)'!D10","v":0},null,"Residential",{"$f":"'SAR and RAR'!G37","v":0.43353664097137312},0.4929724354318929,{"$f":"'SAR and RAR'!I37","v":0.3376537252060986},0.44907276802647744,{"$f":"'SAR and RAR'!K37","v":0.4505009853364747},{"$f":"'SAR and RAR'!L37","v":0.43823032581794397},{"$f":"'SAR and RAR'!M37","v":0.46381018246062999},{"$f":"'SAR and RAR'!N37","v":0.5669366333554875},{"$f":"'SAR and RAR'!O37","v":0.82642497364889311},{"$f":"'SAR and RAR'!P37","v":0.2594263611204975},{"$f":"'SAR and RAR'!Q37","v":0.33765372536611121},{"$f":"'SAR and RAR'!R37","v":0.36749008607402561}]
{"$rows_left_out":20}
{"sheet":"Res Bill Impact (2)","index":10,"n_rows":91,"n_cols":29,"rows_kept":91,"cut":false,"hidden":true,"merged":[[0,1,0,21],[64,18,64,19],[64,20,64,21],[64,22,64,23],[78,2,78,7],[64,10,64,11],[64,12,64,13],[64,14,64,15],[49,18,49,19],[49,20,49,21],[49,22,49,23],[34,18,34,19],[34,20,34,21],[34,22,34,23],[33,2,33,7],[33,10,33,15],[79,2,79,3],[79,4,79,5],[79,6,79,7],[64,2,64,3],[64,4,64,5],[64,6,64,7],[49,24,49,25],[63,2,63,7],[63,10,63,15],[63,18,63,23],[49,2,49,3],[49,4,49,5],[49,6,49,7],[49,10,49,11],[49,12,49,13],[49,14,49,15],[34,24,34,25],[48,2,48,7],[48,10,48,15],[48,18,48,23],[34,2,34,3],[34,4,34,5],[34,6,34,7],[34,10,34,11],[34,12,34,13],[34,14,34,15],[19,27,19,28],[20,15,20,16],[20,17,20,18],[20,23,20,24],[20,25,20,26],[33,18,33,23],[1,1,1,3],[2,4,2,7],[2,14,2,17],[19,8,19,9],[19,10,19,11],[19,19,19,20]]}
[null,"CONFIDENTIAL\nThis Excel Sheet Is Marked Confidential In Accordance With Applicable Law and Regulation.\nBasis for Confidentiality In Accompanying Confidentiality Declaration.\nPublic Disclosure Restricted."]
[]
[null,null,null,null,"Schedule D",null,null,null,null,null,null,null,null,null,"Schedule D-CARE"]
[null,null,null,null,{"$f":"'Simple Bill Insert Calc (2)'!M4","v":2025},{"$f":"'Simple Bill Insert Calc (2)'!M3","v":"2025-11-15"},"Proposed","Proposed",null,null,null,null,null,null,{"$f":"'Simple Bill Insert Calc (2)'!M4","v":2025},{"$f":"'Simple Bill Insert Calc (2)'!M3","v":"2025-11-15"},"Proposed","Proposed"]
[null,null,null,null,"Sales Forecast","Rates","Rates","Revenue",null,null,null,null,null,null,"Sales Forecast","Rates","Rates","Revenue"]
[]
{"$rows_left_out":86}
{"sheet":"SAR and AR (GS1) (2)","index":11,"n_rows":26,"n_cols":24,"rows_kept":26,"cut":false,"hidden":true,"merged":[[62,18,62,19],[0,1,0,21],[13,6,13,17],[7,6,7,17],[3,6,3,17],[21,5,21,8],[21,13,21,16]]}
[null,"CONFIDENTIAL\nThis Excel Sheet Is Marked Confidential In Accordance With Applicable Law and Regulation.\nBasis for Confidentiality In Accompanying Confidentiality Declaration.\nPublic Disclosure Restricted."]
[null,null,"Revenue Change ($000)"]
[]
[null,"Generation",{"$f":"'Simple Bill Insert Calc (2)'!D8","v":0},null,null,null,"Allocation"]
[null,"Distribution",{"$f":"'Simple Bill Insert Calc (2)'!D9","v":0},null,null,null,"Generation","Distribution","NDC","PPPC","DCPP","NSGC","Transmission","TOTCA","GHG Rev","DWRBC","PUCRF","SECURITIZATION"]
[null,"Nuclear",{"$f":"'Simple Bill Insert Calc (2)'!D10","v":0},null,null,"GS-1",{"$f":"'SAR and AR (GS1)'!G37","v":8.56555441047092E-2},6.7453255573747165E-2,{"$f":"'SAR and AR (GS1)'!I37","v":6.9772361086533924E-2},6.9235310174637035E-2,{"$f":"'SAR and AR (GS1)'!K37","v":7.0452504542625E-2},{"$f":"'SAR and AR (GS1)'!L37","v":7.0228496137111671E-2},{"$f":"'SAR and AR (GS1)'!M37","v":6.906624045328115E-2},{"$f":"'SAR and AR (GS1)'!N37","v":7.0290661987155681E-2},{"$f":"'SAR and AR (GS1)'!O37","v":8.0333625621882176E-2},{"$f":"'SAR and AR (GS1)'!P37","v":7.8012925667049801E-2},{"$f":"'SAR and AR (GS1)'!Q37","v":6.9772360274023171E-2},{"$f":"'SAR and AR (GS1)'!R37","v":8.1486516886440832E-2}]
{"$rows_left_out":21}
{"sheet":"Bill Impact (GS1) (2)","index":12,"n_rows":39,"n_cols":21,"rows_kept":39,"cut":false,"hidden":true,"merged":[[1,1,1,3],[2,4,2,9],[19,8,19,9],[0,1,0,21],[19,10,19,11],[33,2,33,9],[34,2,34,3],[34,4,34,5],[34,6,34,7],[34,8,34,9]]}
[null,"CONFIDENTIAL\nThis Excel Sheet Is Marked Confidential In Accordance With Applicable Law and Regulation.\nBasis for Confidentiality In Accompanying Confidentiality Declaration.\nPublic Disclosure Restricted."]
[]
[null,null,null,null,"Schedule TOU-GS-1-E"]
[null,null,null,null,{"$f":"'Bill Impact (GS1)'!E4","v":2025},{"$f":"'Bill Impact (GS1)'!F4","v":"2025-11-15"},"Proposed","Proposed"]
[null,null,null,null,"Sales Forecast","Rates","Rates"," Revenue"]
[]
{"$rows_left_out":33}